Daily Build Log (Brief)


Test


tests/Bug_2434_Regression_Test

[Details] ACE_ASSERT: file Bug_2434_Regression_Test.cpp, line 56 assertion failed for 'tv1 == tv2'.Aborting...
[Details] Error: Bug_2434_Regression_Test FAILED with exit status 3 after Time:0s
[Details] Error: (log/Bug_2434_Regression_Test.log): ACE_ASSERT: file Bug_2434_Regression_Test.cpp, line 56 assertion failed for 'tv1 == tv2'.Aborting...
[Details] Error (log/Bug_2434_Regression_Test.log): no line with 'Ending'
[Details] 2023-03-25 07:36:16.561@LM_ERROR@ACE_ASSERT: file Bug_2434_Regression_Test.cpp, line 56 assertion failed for 'tv1 == tv2'.Aborting...

tests/Process_Env_Test

[Details] Error: Process_Env_Test FAILED with exit status 1 after Time:0s

tests/Task_Wait_Test

[Details] ERROR: Task_Wait_Test timedout
[Details] Error: Task_Wait_Test FAILED (time out after Time:316s)
[Details] Error (log/Task_Wait_Test.log): no line with 'Ending'

tests/SSL/SSL_Asynch_Stream_Test

[Details] ERROR: SSL_Asynch_Stream_Test timedout
[Details] Error: SSL_Asynch_Stream_Test FAILED (time out after Time:315s)
[Details] Error (log/SSL_Asynch_Stream_Test.log): no line with 'Ending'

TAO/tests/Bug_3598a_Regression/run_test.pl

[Details] ACE (2888|2624) ERROR: SG::initialize - service 'OC_Endpoint_Selector_Factory' was not located.

TAO/tests/Dynamic_TP/POA_Loader/Dynamic_TP_POA_Test_Dynamic/run_test.pl

[Details] ERROR: server returned 3221225477

TAO/orbsvcs/tests/Bug_2247_Regression/run_test.pl

[Details] (1404|4644) ERROR: ACCESS VIOLATION
[Details] ERROR: Manager 0 returned 3221225477
[Details] (4788|4488) ERROR: ACCESS VIOLATION
[Details] ERROR: Manager 1 returned 3221225477
[Details] (5112|5192) ERROR: ACCESS VIOLATION
[Details] ERROR: Manager 2 returned 3221225477
[Details] ERROR: server 2 returned 3

TAO/orbsvcs/tests/Bug_4118_Regression/run_test.pl

[Details] ERROR: Cannot Spawn: <C:\tao_builds\jenkins\workspace\oci_tao-2_2_0_cricket_win2012r2_vc10_s1d0o1\TAO\orbsvcs\tests\Bug_4118_Regression\..\..\..\utils\nslist\Release\\tao_nsadd.EXE> not found
[Details] ERROR: ns_add returned -1
[Details] ERROR: Cannot Spawn: <C:\tao_builds\jenkins\workspace\oci_tao-2_2_0_cricket_win2012r2_vc10_s1d0o1\TAO\orbsvcs\tests\Bug_4118_Regression\..\..\..\utils\nslist\Release\\tao_nsadd.EXE> not found
[Details] ERROR: ns_add returned -1

TAO/orbsvcs/tests/InterfaceRepo/Persistence_Test/run_test.pl

[Details] (3040|4768) ERROR: ACCESS VIOLATION
[Details] (4068|1724) EXCEPTION, Ptest::run
[Details] ERROR: client returned 4294967295
[Details] ERROR: server returned 3221225477

TAO/orbsvcs/tests/ImplRepo/Bug_4152_Regression/run_test.pl

[Details] ERROR: tao_imr start returned 4
[Details] ERROR: expected 2 server pids, got 3

TAO/orbsvcs/tests/ImplRepo/servers_interact_on_startup/run_test.pl -multistart

[Details] ERROR: cannot find file TestObject_1.status
[Details] (2948|5248) EXCEPTION, Exception
[Details] ERROR: server timedout
[Details] ERROR: Server 2 not terminated correctly
[Details] (6132|4092) EXCEPTION, Exception
[Details] (5328|5224) EXCEPTION, Exception
[Details] ERROR: IMR returned 4294967295

TAO/orbsvcs/tests/Notify/Bug_2415_Regression/run_test.pl

[Details] (4808|3692) EXCEPTION, Error: Consumer exception:
[Details] ERROR: Consumer returned 1
[Details] ERROR: Supplier timedout
[Details] ERROR: Supplier returned -1

TAO/orbsvcs/tests/Notify/Sequence_Multi_Filter/run_test.pl

[Details] (6024|4908) EXCEPTION, Error: Consumer exception:
[Details] ERROR: Consumer returned 1
[Details] ERROR: <Sequence_Supplier> still running upon object destruction

TAO/orbsvcs/tests/Security/Secure_Invocation/run_test.pl

[Details] (4268|2304) EXCEPTION, Caught exception:
[Details] ERROR: client returned 1
[Details] ERROR: server timedout
[Details] ERROR: server returned -1

TAO/orbsvcs/tests/Security/Bug_1107_Regression/run_test.pl

[Details] (2156|4304) EXCEPTION, Caught unexpected exception (probable failure):
[Details] ERROR: client returned 1
[Details] ERROR: server timedout
[Details] ERROR: server returned -1

TAO/orbsvcs/tests/Security/Big_Request/run_test.pl

[Details] (5396|2880) EXCEPTION, ERROR
[Details] ERROR: client returned 4294967295
[Details] ERROR: server timedout
[Details] ERROR: server returned -1

TAO/orbsvcs/tests/Security/Callback/run_test.pl

[Details] (4172|5084) EXCEPTION, Caught exception
[Details] ERROR: client returned 4294967295
[Details] ERROR: server timedout
[Details] ERROR: server returned -1

TAO/orbsvcs/tests/Security/Crash_Test/run_test.pl

[Details] (6036|4732) EXCEPTION, CLIENT (%P): Caught exception:
[Details] (3148|3680) EXCEPTION, CLIENT (%P): Caught exception:
[Details] ERROR: Stopping client #1 returned 1
[Details] ERROR: Stopping client #2 returned 1
[Details] (2408|284) EXCEPTION, CLIENT (%P): Caught exception:
[Details] ERROR: Stopping client #3 returned 1
[Details] ERROR: server timedout
[Details] ERROR: server returned -1

TAO/orbsvcs/tests/Security/Null_Cipher/run_test.pl

[Details] (3632|5680) EXCEPTION, Caught exception:
[Details] ERROR: client returned 1
[Details] ERROR: server timedout
[Details] ERROR: server returned -1

TAO/orbsvcs/DevGuideExamples/Security/ParticipatingApp/run_test.pl

[Details] (4416|3408) EXCEPTION, Client: main block
[Details] ERROR: client returned 1
[Details] ERROR: MessengerServer timedout
[Details] ERROR: server returned -1

TAO/orbsvcs/DevGuideExamples/Security/PolicyControllingApp/run_test.pl

[Details] (3632|4168) EXCEPTION, Client: main block
[Details] ERROR: Messenger Client returned 1

TAO/orbsvcs/DevGuideExamples/Security/SecurityUnawareApp/run_test.pl

[Details] ERROR: Messenger Client1 returned 1
[Details] ERROR: Messenger Client2 returned 1
[Details] ERROR: Messenger Server returned 4294967295