Failed Test Brief Log By Build


Remedy_Fedora_Versioned

tests/DCPS/Thrasher/run_test.pl aggressive rtps durable

[Details] ERROR: Thrasher timedout
[Details] 2022-12-03 07:01:49: ERROR: Thrasher timedout
[Details] test FAILED.
[Details] auto_run_tests.pl: ERROR: "tests/DCPS/Thrasher/run_test.pl aggressive rtps durable" returned with status 1

tests/DCPS/ConfigFile/run_test.pl

[Details] (1271818|1271819) ERROR: LinuxNetworkConfigMonitor::open: could not register for input: Invalid argument

tests/DCPS/SubscriberCycle/run_test.pl

[Details] (1273445|1273451) ERROR: SubscriberListenerImpl::on_data_on_readers did not get only one data reader

dds_doc_ace6tao2_cricket_win2012r2-x64_vc10_d1o0

tests/DCPS/MultiTopic/run_test.pl classic rtps_disc

[Details] ERROR: Failed to wait for match: Timeout
[Details] ERROR: classic/MultiTopicTest timedout
[Details] 2022-12-03 14:39:05: ERROR: proc timedout
[Details] test FAILED.

tests/DCPS/Instances/run_test.pl multiple_instance multiple_datawriter keyed

[Details] (3244|4956) ERROR: ACCESS VIOLATION
[Details] 2022-12-03 15:29:24: ERROR: sub finished and returned 3221225477
[Details] ERROR: publisher timedout
[Details] 2022-12-03 15:29:49: ERROR: pub timedout
[Details] test FAILED.

dds_doc_ace6tao2_hornet_win7-x64_vc14_i1d1o0w1

tests/DCPS/ConfigTransports/run_test.pl

[Details] (4980|4392) EXCEPTION, ERROR: InfoRepoDiscovery::add_domain_participant:
[Details] (4980|4392) TEST_ASSERT(!CORBA::is_nil(dp.in())) FAILED at c:\tao_builds\jenkins\workspace\dds_doc_vc14_i1d1o0w1\opendds\tests\dcps\configtransports\factory.cpp:26
[Details] abort() has been called2022-12-02 22:18:37: ERROR: publisher finished and returned 3
[Details] ERROR: subscriber timedout
[Details] 2022-12-02 22:19:02: ERROR: subscriber timedout
[Details] test FAILED.
[Details] Test FAILED (hasbuiltins=){
[Details] FAILED: 1 of 1

performance-tests/bench/run_test.pl ci-disco-long --show-worker-logs

[Details] ERROR: Total Undermatched Readers: 40, ERROR: Total Undermatched Writers: 40
[Details] 2022-12-02 22:33:05: ERROR: test_controller finished and returned 1
[Details] test FAILED.

performance-tests/bench/run_test.pl ci-fan --show-worker-logs

[Details] Missing Data (574) Details: ERROR :: Topic Name: topic_02, Reliable: true, Durable: false [PH: 14 (1-100)] 19-100 [PH: 43 (1-100)] 45-100 [PH: 27 (1-100)] 56-100 [PH: 32 (1-100)] 17-100 [PH: 37 (1-100)] 32-100 [PH: 29 (1-100)] 22-100 [PH: 34 (1-100)] 47-100 [PH: 39 (1-100)] 54-100 [PH: 33 (1-100)] 60-100 [PH: 41 (1-100)] 84-100 ERROR Total Expected Sample Deficit: 574
[Details] 2022-12-02 22:36:55: ERROR: test_controller finished and returned 1
[Details] test FAILED.

dds_doc_ace6tao2_mantis_linux_gccasan_d1o0

tools/modeling/tests/TopicQos/run_test.pl

[Details] ==9964==ERROR: LeakSanitizer: detected memory leaks
[Details] ERROR: subscriber returned 1
[Details] auto_run_tests.pl: ERROR: "tools/modeling/tests/TopicQos/run_test.pl" returned with status 1

dds_doc_ace6tao2_tick_linux_gcc_d1o0

tests/FACE/Reliability/run_test.pl

[Details] ERROR: Publisher/publisher timedout
[Details] #9 0x00007f8165c99f36 in FACE::TS::Destroy_Connection (connection_id=1, return_code=@0x7ffecba6903c: FACE::RC_NO_ERROR) at /tao_builds/jenkins/workspace/dds_doc_ace6tao2_tick_linux_gcc_d1o0/OpenDDS/dds/FACE/FaceTSS.cpp:306
[Details] 2022-12-02 22:00:22: ERROR: Publisher timedout
[Details] test FAILED.
[Details] auto_run_tests.pl: ERROR: "tests/FACE/Reliability/run_test.pl" returned with status 1

performance-tests/bench/run_test.pl ci-fan-frag-ws --show-worker-logs

[Details] Missing Data (3) Details: ERROR :: Topic Name: topic_02, Reliable: true, Durable: false [PH: 34 (1-10)] 9-10 [PH: 39 (1-10)] 10 ERROR Total Expected Sample Deficit: 3
[Details] 2022-12-02 22:09:08: ERROR: test_controller finished and returned 1
[Details] test FAILED.
[Details] auto_run_tests.pl: ERROR: "performance-tests/bench/run_test.pl ci-fan-frag-ws --show-worker-logs" returned with status 1

dds_doc_ace6tao2_wiro_linux_clang_d1o0

performance-tests/bench/run_test.pl ci-echo --show-worker-logs

[Details] Missing Data (259) Details: ERROR :: Topic Name: topic_01, Reliable: true, Durable: false [PH: 7 (1-1000)] 742-1000 ERROR Total Expected Sample Deficit: 259
[Details] Missing Data (259) Details: ERROR :: Topic Name: topic_02, Reliable: true, Durable: false [PH: 7 (1-1000)] 742-1000 ERROR Total Expected Sample Deficit: 259
[Details] 2022-12-04 02:05:52: ERROR: test_controller finished and returned 1
[Details] test FAILED.
[Details] auto_run_tests.pl: ERROR: "performance-tests/bench/run_test.pl ci-echo --show-worker-logs" returned with status 1

tests/DCPS/RtpsRelay/Smoke/run_lease_duration_test.pl reverse

[Details] 2022-12-04 02:16:49.877@LM_ERROR@(3052616|3052624) ERROR: RelayThreadMonitor::svc thread 3052616 (RtpsRelay Main) failed to update status. Aborting...
[Details] test FAILED.
[Details] auto_run_tests.pl: ERROR: "tests/DCPS/RtpsRelay/Smoke/run_lease_duration_test.pl reverse" returned with status 255

dds_doc_ace6tao2_wiro_linux_gcc-12_d1o0

tests/DCPS/CompatibilityTest/run_test.pl rtps_disc_tcp

[Details] 2022-12-04 04:56:02: ERROR: publisher finished and returned 1
[Details] 2022-12-04 04:56:02: ERROR: subscriber finished and returned 1
[Details] test FAILED.
[Details] ERROR: test returned 1
[Details] auto_run_tests.pl: ERROR: "tests/DCPS/CompatibilityTest/run_test.pl rtps_disc_tcp" returned with status 1

dds_doc_ace6tao2_wiro_linux_gcc_d1o0s1

performance-tests/bench/run_test.pl ci-echo --show-worker-logs

[Details] Missing Data (257) Details: ERROR :: Topic Name: topic_01, Reliable: true, Durable: false [PH: 7 (1-1000)] 744-1000 ERROR Total Expected Sample Deficit: 257
[Details] Missing Data (257) Details: ERROR :: Topic Name: topic_02, Reliable: true, Durable: false [PH: 7 (1-1000)] 744-1000 ERROR Total Expected Sample Deficit: 257
[Details] 2022-12-03 17:17:52: ERROR: test_controller finished and returned 1
[Details] test FAILED.
[Details] auto_run_tests.pl: ERROR: "performance-tests/bench/run_test.pl ci-echo --show-worker-logs" returned with status 1

tools/scripts/unit_test_coverage.sh

[Details] ERROR: No test cases for dds/CORBA/tao/Allocation_Macros
[Details] ERROR: No test cases for dds/CORBA/tao/Exception
[Details] ERROR: No test cases for dds/CORBA/tao/Inlines
[Details] ERROR: No test cases for dds/CORBA/tao/LocalObject
[Details] ERROR: No test cases for dds/CORBA/tao/Object
[Details] ERROR: No test cases for dds/CORBA/tao/ORB_Misc
[Details] ERROR: No test cases for dds/CORBA/tao/PolicyS
[Details] ERROR: No test cases for dds/CORBA/tao/String_Alloc
[Details] ERROR: No test cases for dds/CORBA/tao/SystemException
[Details] ERROR: No test cases for dds/DCPS/AssociationData
[Details] ERROR: No test cases for dds/DCPS/AstNodeWrapper
[Details] ERROR: No test cases for dds/DCPS/BitPubListenerImpl
[Details] ERROR: No test cases for dds/DCPS/BuiltInTopicDataReaderImpls
[Details] ERROR: No test cases for dds/DCPS/BuiltInTopicUtils
[Details] ERROR: No test cases for dds/DCPS/Cached_Allocator_With_Overflow_T
[Details] ERROR: No test cases for dds/DCPS/CoherentChangeControl
[Details] ERROR: No test cases for dds/DCPS/Comparator_T
[Details] ERROR: No test cases for dds/DCPS/ConditionImpl
[Details] ERROR: No test cases for dds/DCPS/ConditionVariable
[Details] ERROR: No test cases for dds/DCPS/ConfigUtils
[Details] ERROR: No test cases for dds/DCPS/ConnectionRecords
[Details] ERROR: No test cases for dds/DCPS/ContentFilteredTopicImpl
[Details] ERROR: No test cases for dds/DCPS/DataBlockLockPool
[Details] ERROR: No test cases for dds/DCPS/DataCollector_T
[Details] ERROR: No test cases for dds/DCPS/DataDurabilityCache
[Details] ERROR: No test cases for dds/DCPS/DataReaderCallbacks
[Details] ERROR: No test cases for dds/DCPS/DataReaderImpl
[Details] ERROR: No test cases for dds/DCPS/DataReaderImpl_T
[Details] ERROR: No test cases for dds/DCPS/DataSampleElement
[Details] ERROR: No test cases for dds/DCPS/DataWriterCallbacks
[Details] ERROR: No test cases for dds/DCPS/DataWriterImpl
[Details] ERROR: No test cases for dds/DCPS/DataWriterImpl_T
[Details] ERROR: No test cases for dds/DCPS/DcpsUpcalls
[Details] ERROR: No test cases for dds/DCPS/DCPS_Utils
[Details] ERROR: No test cases for dds/DCPS/DdsDcps_pch
[Details] ERROR: No test cases for dds/DCPS/debug
[Details] ERROR: No test cases for dds/DCPS/DefaultNetworkConfigMonitor
[Details] ERROR: No test cases for dds/DCPS/Definitions
[Details] ERROR: No test cases for dds/DCPS/DirentWrapper
[Details] ERROR: No test cases for dds/DCPS/Discovery
[Details] ERROR: No test cases for dds/DCPS/DiscoveryListener
[Details] ERROR: No test cases for dds/DCPS/DomainParticipantFactoryImpl
[Details] ERROR: No test cases for dds/DCPS/DurabilityArray
[Details] ERROR: No test cases for dds/DCPS/DurabilityQueue
[Details] ERROR: No test cases for dds/DCPS/Dynamic_Cached_Allocator_With_Overflow_T
[Details] ERROR: No test cases for dds/DCPS/EntityImpl
[Details] ERROR: No test cases for dds/DCPS/FeatureDisabledQosCheck
[Details] ERROR: No test cases for dds/DCPS/FileSystemStorage
[Details] ERROR: No test cases for dds/DCPS/FilterEvaluator
[Details] ERROR: No test cases for dds/DCPS/FilterExpressionGrammar
[Details] ERROR: No test cases for dds/DCPS/GroupRakeData
[Details] ERROR: No test cases for dds/DCPS/GuardCondition
[Details] ERROR: No test cases for dds/DCPS/GuidBuilder
[Details] ERROR: No test cases for dds/DCPS/Hash
[Details] ERROR: No test cases for dds/DCPS/Ice
[Details] ERROR: No test cases for dds/DCPS/InfoRepoDiscovery/DataReaderRemoteImpl
[Details] ERROR: No test cases for dds/DCPS/InfoRepoDiscovery/DataWriterRemoteImpl
[Details] ERROR: No test cases for dds/DCPS/InfoRepoDiscovery/FailoverListener
[Details] ERROR: No test cases for dds/DCPS/InfoRepoDiscovery/InfoRepoDiscovery
[Details] ERROR: No test cases for dds/DCPS/InstanceDataSampleList
[Details] ERROR: No test cases for dds/DCPS/InstanceHandle
[Details] ERROR: No test cases for dds/DCPS/InstanceState
[Details] ERROR: No test cases for dds/DCPS/InternalDataReaderListener
[Details] ERROR: No test cases for dds/DCPS/JobQueue
[Details] ERROR: No test cases for dds/DCPS/LinuxNetworkConfigMonitor
[Details] ERROR: No test cases for dds/DCPS/LocalObject
[Details] ERROR: No test cases for dds/DCPS/LogAddr
[Details] ERROR: No test cases for dds/DCPS/Logging
[Details] ERROR: No test cases for dds/DCPS/Marked_Default_Qos
[Details] ERROR: No test cases for dds/DCPS/Message_Block_Ptr
[Details] ERROR: No test cases for dds/DCPS/MessageTracker
[Details] ERROR: No test cases for dds/DCPS/MonitorFactory
[Details] ERROR: No test cases for dds/DCPS/MulticastManager
[Details] ERROR: No test cases for dds/DCPS/MultiTask
[Details] ERROR: No test cases for dds/DCPS/MultiTopicDataReaderBase
[Details] ERROR: No test cases for dds/DCPS/MultiTopicDataReader_T
[Details] ERROR: No test cases for dds/DCPS/MultiTopicImpl
[Details] ERROR: No test cases for dds/DCPS/NetworkConfigModifier
[Details] ERROR: No test cases for dds/DCPS/NetworkConfigMonitor
[Details] ERROR: No test cases for dds/DCPS/Observer
[Details] ERROR: No test cases for dds/DCPS/OwnershipManager
[Details] ERROR: No test cases for dds/DCPS/PeriodicTask
[Details] ERROR: No test cases for dds/DCPS/PoolAllocationBase
[Details] ERROR: No test cases for dds/DCPS/PoolAllocator
[Details] ERROR: No test cases for dds/DCPS/PublicationInstance
[Details] ERROR: No test cases for dds/DCPS/PublisherImpl
[Details] ERROR: No test cases for dds/DCPS/QOS_XML_Handler/DataReaderQos_Handler
[Details] ERROR: No test cases for dds/DCPS/QOS_XML_Handler/DataWriterQos_Handler
[Details] ERROR: No test cases for dds/DCPS/QOS_XML_Handler/dds_qos
[Details] ERROR: No test cases for dds/DCPS/QOS_XML_Handler/ParticipantQos_Handler
[Details] ERROR: No test cases for dds/DCPS/QOS_XML_Handler/PublisherQos_Handler
[Details] ERROR: No test cases for dds/DCPS/QOS_XML_Handler/QOS_Common
[Details] ERROR: No test cases for dds/DCPS/QOS_XML_Handler/QOS_DataReader_T
[Details] ERROR: No test cases for dds/DCPS/QOS_XML_Handler/QOS_DataWriter_T
[Details] ERROR: No test cases for dds/DCPS/QOS_XML_Handler/QOS_DwDrTp_Base_T
[Details] ERROR: No test cases for dds/DCPS/QOS_XML_Handler/QOS_DwTp_Base_T
[Details] ERROR: No test cases for dds/DCPS/QOS_XML_Handler/QOS_PubSub_T
[Details] ERROR: No test cases for dds/DCPS/QOS_XML_Handler/QOS_Topic_T
[Details] ERROR: No test cases for dds/DCPS/QOS_XML_Handler/QOS_XML_Loader
[Details] ERROR: No test cases for dds/DCPS/QOS_XML_Handler/SubscriberQos_Handler
[Details] ERROR: No test cases for dds/DCPS/QOS_XML_Handler/TopicQos_Handler
[Details] ERROR: No test cases for dds/DCPS/QOS_XML_Handler/XML_File_Intf
[Details] ERROR: No test cases for dds/DCPS/QOS_XML_Handler/XML_Intf
[Details] ERROR: No test cases for dds/DCPS/QOS_XML_Handler/XML_String_Intf
[Details] ERROR: No test cases for dds/DCPS/QueryConditionImpl
[Details] ERROR: No test cases for dds/DCPS/RakeData
[Details] ERROR: No test cases for dds/DCPS/RakeResults_T
[Details] ERROR: No test cases for dds/DCPS/RapidJsonWrapper
[Details] ERROR: No test cases for dds/DCPS/RawDataSample
[Details] ERROR: No test cases for dds/DCPS/RcEventHandler
[Details] ERROR: No test cases for dds/DCPS/ReactorInterceptor
[Details] ERROR: No test cases for dds/DCPS/ReactorTask
[Details] ERROR: No test cases for dds/DCPS/ReactorTask_rch
[Details] ERROR: No test cases for dds/DCPS/ReadConditionImpl
[Details] ERROR: No test cases for dds/DCPS/ReceivedDataElementList
[Details] ERROR: No test cases for dds/DCPS/ReceivedDataStrategy
[Details] ERROR: No test cases for dds/DCPS/Recorder
[Details] ERROR: No test cases for dds/DCPS/RecorderImpl
[Details] ERROR: No test cases for dds/DCPS/Registered_Data_Types
[Details] ERROR: No test cases for dds/DCPS/Replayer
[Details] ERROR: No test cases for dds/DCPS/ReplayerImpl
[Details] ERROR: No test cases for dds/DCPS/RepoIdBuilder
[Details] ERROR: No test cases for dds/DCPS/RepoIdConverter
[Details] ERROR: No test cases for dds/DCPS/RepoIdGenerator
[Details] ERROR: No test cases for dds/DCPS/RepoIdTypes
[Details] ERROR: No test cases for dds/DCPS/RestoreOutputStreamState
[Details] ERROR: No test cases for dds/DCPS/RTPS/ICE/AgentImpl
[Details] ERROR: No test cases for dds/DCPS/RTPS/ICE/Checklist
[Details] ERROR: No test cases for dds/DCPS/RTPS/ICE/EndpointManager
[Details] ERROR: No test cases for dds/DCPS/RTPS/ICE/Ice
[Details] ERROR: No test cases for dds/DCPS/RTPS/ICE/Stun
[Details] ERROR: No test cases for dds/DCPS/RTPS/ICE/Task
[Details] ERROR: No test cases for dds/DCPS/RTPS/MessageParser
[Details] ERROR: No test cases for dds/DCPS/RTPS/MessageTypes
[Details] ERROR: No test cases for dds/DCPS/RTPS/RtpsDiscovery
[Details] ERROR: No test cases for dds/DCPS/RTPS/RtpsDiscoveryConfig
[Details] ERROR: No test cases for dds/DCPS/RTPS/Sedp
[Details] ERROR: No test cases for dds/DCPS/RTPS/Spdp
[Details] ERROR: No test cases for dds/DCPS/RTPS/TypeLookup
[Details] ERROR: No test cases for dds/DCPS/SafetyProfilePool
[Details] ERROR: No test cases for dds/DCPS/SafetyProfileSequence
[Details] ERROR: No test cases for dds/DCPS/SafetyProfileSequences
[Details] ERROR: No test cases for dds/DCPS/SafetyProfileSequenceVar
[Details] ERROR: No test cases for dds/DCPS/SafetyProfileStreams
[Details] ERROR: No test cases for dds/DCPS/Sample
[Details] ERROR: No test cases for dds/DCPS/security/AccessControl/DomainIdSet
[Details] ERROR: No test cases for dds/DCPS/security/AccessControl/Governance
[Details] ERROR: No test cases for dds/DCPS/security/AccessControl/LocalAccessCredentialData
[Details] ERROR: No test cases for dds/DCPS/security/AccessControl/Permissions
[Details] ERROR: No test cases for dds/DCPS/security/AccessControl/XmlUtils
[Details] ERROR: No test cases for dds/DCPS/security/Authentication/LocalAuthCredentialData
[Details] ERROR: No test cases for dds/DCPS/security/BuiltInPluginLoader
[Details] ERROR: No test cases for dds/DCPS/security/BuiltInPlugins
[Details] ERROR: No test cases for dds/DCPS/security/BuiltInSecurityPluginInst
[Details] ERROR: No test cases for dds/DCPS/security/CommonUtilities
[Details] ERROR: No test cases for dds/DCPS/security/framework/HandleRegistry
[Details] ERROR: No test cases for dds/DCPS/security/framework/Properties
[Details] ERROR: No test cases for dds/DCPS/security/framework/SecurityConfig
[Details] ERROR: No test cases for dds/DCPS/security/framework/SecurityConfigPropertyList
[Details] ERROR: No test cases for dds/DCPS/security/framework/SecurityConfig_rch
[Details] ERROR: No test cases for dds/DCPS/security/framework/SecurityPluginInst
[Details] ERROR: No test cases for dds/DCPS/security/framework/SecurityPluginInst_rch
[Details] ERROR: No test cases for dds/DCPS/security/framework/SecurityRegistry
[Details] ERROR: No test cases for dds/DCPS/security/OpenSSL_init
[Details] ERROR: No test cases for dds/DCPS/security/OpenSSL_legacy
[Details] ERROR: No test cases for dds/DCPS/security/SSL/Err
[Details] ERROR: No test cases for dds/DCPS/security/TokenReader
[Details] ERROR: No test cases for dds/DCPS/security/TokenWriter
[Details] ERROR: No test cases for dds/DCPS/security/Utility
[Details] ERROR: No test cases for dds/DCPS/security/UtilityImpl
[Details] ERROR: No test cases for dds/DCPS/SendStateDataSampleList
[Details] ERROR: No test cases for dds/DCPS/SequenceIterator
[Details] ERROR: No test cases for dds/DCPS/Service_Participant
[Details] ERROR: No test cases for dds/DCPS/StaticDiscovery
[Details] ERROR: No test cases for dds/DCPS/StaticIncludes
[Details] ERROR: No test cases for dds/DCPS/Stats_T
[Details] ERROR: No test cases for dds/DCPS/StatusConditionImpl
[Details] ERROR: No test cases for dds/DCPS/SubscriberImpl
[Details] ERROR: No test cases for dds/DCPS/SubscriptionInstance
[Details] ERROR: No test cases for dds/DCPS/ThreadStatusManager
[Details] ERROR: No test cases for dds/DCPS/TimePoint_T
[Details] ERROR: No test cases for dds/DCPS/TimeSource
[Details] ERROR: No test cases for dds/DCPS/TimeTypes
[Details] ERROR: No test cases for dds/DCPS/TopicCallbacks
[Details] ERROR: No test cases for dds/DCPS/TopicDescriptionImpl
[Details] ERROR: No test cases for dds/DCPS/TopicDetails
[Details] ERROR: No test cases for dds/DCPS/TopicExpressionGrammar
[Details] ERROR: No test cases for dds/DCPS/TopicImpl
[Details] ERROR: No test cases for dds/DCPS/Transient_Kludge
[Details] ERROR: No test cases for dds/DCPS/transport/framework/BasicQueue_T
[Details] ERROR: No test cases for dds/DCPS/transport/framework/BasicQueueVisitor_T
[Details] ERROR: No test cases for dds/DCPS/transport/framework/BuildChainVisitor
[Details] ERROR: No test cases for dds/DCPS/transport/framework/CopyChainVisitor
[Details] ERROR: No test cases for dds/DCPS/transport/framework/DataLink
[Details] ERROR: No test cases for dds/DCPS/transport/framework/DataLinkCleanupTask
[Details] ERROR: No test cases for dds/DCPS/transport/framework/DataLink_rch
[Details] ERROR: No test cases for dds/DCPS/transport/framework/DataLinkSet
[Details] ERROR: No test cases for dds/DCPS/transport/framework/DataLinkSet_rch
[Details] ERROR: No test cases for dds/DCPS/transport/framework/DirectPriorityMapper
[Details] ERROR: No test cases for dds/DCPS/transport/framework/EntryExit
[Details] ERROR: No test cases for dds/DCPS/transport/framework/NullSynch
[Details] ERROR: No test cases for dds/DCPS/transport/framework/NullSynchStrategy
[Details] ERROR: No test cases for dds/DCPS/transport/framework/PacketRemoveVisitor
[Details] ERROR: No test cases for dds/DCPS/transport/framework/PerConnectionSynch
[Details] ERROR: No test cases for dds/DCPS/transport/framework/PerConnectionSynchStrategy
[Details] ERROR: No test cases for dds/DCPS/transport/framework/PoolSynch
[Details] ERROR: No test cases for dds/DCPS/transport/framework/PoolSynchStrategy
[Details] ERROR: No test cases for dds/DCPS/transport/framework/PriorityKey
[Details] ERROR: No test cases for dds/DCPS/transport/framework/PriorityMapper
[Details] ERROR: No test cases for dds/DCPS/transport/framework/QueueRemoveVisitor
[Details] ERROR: No test cases for dds/DCPS/transport/framework/QueueTaskBase_T
[Details] ERROR: No test cases for dds/DCPS/transport/framework/ReactorSynch
[Details] ERROR: No test cases for dds/DCPS/transport/framework/ReactorSynchStrategy
[Details] ERROR: No test cases for dds/DCPS/transport/framework/ReceiveListenerSet
[Details] ERROR: No test cases for dds/DCPS/transport/framework/ReceiveListenerSetMap
[Details] ERROR: No test cases for dds/DCPS/transport/framework/ReceiveListenerSet_rch
[Details] ERROR: No test cases for dds/DCPS/transport/framework/RemoveAllVisitor
[Details] ERROR: No test cases for dds/DCPS/transport/framework/ScheduleOutputHandler
[Details] ERROR: No test cases for dds/DCPS/transport/framework/SendResponseListener
[Details] ERROR: No test cases for dds/DCPS/transport/framework/ThreadPerConnectionSendTask
[Details] ERROR: No test cases for dds/DCPS/transport/framework/ThreadPerConRemoveVisitor
[Details] ERROR: No test cases for dds/DCPS/transport/framework/ThreadSynch
[Details] ERROR: No test cases for dds/DCPS/transport/framework/ThreadSynchResource
[Details] ERROR: No test cases for dds/DCPS/transport/framework/ThreadSynchStrategy
[Details] ERROR: No test cases for dds/DCPS/transport/framework/ThreadSynchStrategy_rch
[Details] ERROR: No test cases for dds/DCPS/transport/framework/ThreadSynchWorker
[Details] ERROR: No test cases for dds/DCPS/transport/framework/TransportClient
[Details] ERROR: No test cases for dds/DCPS/transport/framework/TransportConfig
[Details] ERROR: No test cases for dds/DCPS/transport/framework/TransportConfig_rch
[Details] ERROR: No test cases for dds/DCPS/transport/framework/TransportControlElement
[Details] ERROR: No test cases for dds/DCPS/transport/framework/TransportCustomizedElement
[Details] ERROR: No test cases for dds/DCPS/transport/framework/TransportDebug
[Details] ERROR: No test cases for dds/DCPS/transport/framework/TransportDefs
[Details] ERROR: No test cases for dds/DCPS/transport/framework/TransportExceptions
[Details] ERROR: No test cases for dds/DCPS/transport/framework/TransportHeader
[Details] ERROR: No test cases for dds/DCPS/transport/framework/TransportImpl
[Details] ERROR: No test cases for dds/DCPS/transport/framework/TransportImpl_rch
[Details] ERROR: No test cases for dds/DCPS/transport/framework/TransportInst
[Details] ERROR: No test cases for dds/DCPS/transport/framework/TransportInst_rch
[Details] ERROR: No test cases for dds/DCPS/transport/framework/TransportQueueElement
[Details] ERROR: No test cases for dds/DCPS/transport/framework/TransportReceiveListener
[Details] ERROR: No test cases for dds/DCPS/transport/framework/TransportReceiveStrategy
[Details] ERROR: No test cases for dds/DCPS/transport/framework/TransportReceiveStrategy_rch
[Details] ERROR: No test cases for dds/DCPS/transport/framework/TransportReceiveStrategy_T
[Details] ERROR: No test cases for dds/DCPS/transport/framework/TransportRegistry
[Details] ERROR: No test cases for dds/DCPS/transport/framework/TransportReplacedElement
[Details] ERROR: No test cases for dds/DCPS/transport/framework/TransportRetainedElement
[Details] ERROR: No test cases for dds/DCPS/transport/framework/TransportSendBuffer
[Details] ERROR: No test cases for dds/DCPS/transport/framework/TransportSendControlElement
[Details] ERROR: No test cases for dds/DCPS/transport/framework/TransportSendElement
[Details] ERROR: No test cases for dds/DCPS/transport/framework/TransportSendListener
[Details] ERROR: No test cases for dds/DCPS/transport/framework/TransportSendStrategy
[Details] ERROR: No test cases for dds/DCPS/transport/framework/TransportSendStrategy_rch
[Details] ERROR: No test cases for dds/DCPS/transport/framework/TransportStatistics
[Details] ERROR: No test cases for dds/DCPS/transport/framework/TransportStrategy
[Details] ERROR: No test cases for dds/DCPS/transport/framework/TransportStrategy_rch
[Details] ERROR: No test cases for dds/DCPS/transport/framework/TransportType
[Details] ERROR: No test cases for dds/DCPS/transport/framework/TransportType_rch
[Details] ERROR: No test cases for dds/DCPS/transport/multicast/BestEffortSession
[Details] ERROR: No test cases for dds/DCPS/transport/multicast/BestEffortSessionFactory
[Details] ERROR: No test cases for dds/DCPS/transport/multicast/Multicast
[Details] ERROR: No test cases for dds/DCPS/transport/multicast/MulticastDataLink
[Details] ERROR: No test cases for dds/DCPS/transport/multicast/MulticastDataLink_rch
[Details] ERROR: No test cases for dds/DCPS/transport/multicast/MulticastInst
[Details] ERROR: No test cases for dds/DCPS/transport/multicast/MulticastInst_rch
[Details] ERROR: No test cases for dds/DCPS/transport/multicast/MulticastLoader
[Details] ERROR: No test cases for dds/DCPS/transport/multicast/MulticastReceiveStrategy
[Details] ERROR: No test cases for dds/DCPS/transport/multicast/MulticastReceiveStrategy_rch
[Details] ERROR: No test cases for dds/DCPS/transport/multicast/MulticastSendStrategy
[Details] ERROR: No test cases for dds/DCPS/transport/multicast/MulticastSendStrategy_rch
[Details] ERROR: No test cases for dds/DCPS/transport/multicast/MulticastSession
[Details] ERROR: No test cases for dds/DCPS/transport/multicast/MulticastSessionFactory
[Details] ERROR: No test cases for dds/DCPS/transport/multicast/MulticastSessionFactory_rch
[Details] ERROR: No test cases for dds/DCPS/transport/multicast/MulticastSession_rch
[Details] ERROR: No test cases for dds/DCPS/transport/multicast/MulticastTransport
[Details] ERROR: No test cases for dds/DCPS/transport/multicast/MulticastTypes
[Details] ERROR: No test cases for dds/DCPS/transport/multicast/ReliableSession
[Details] ERROR: No test cases for dds/DCPS/transport/multicast/ReliableSessionFactory
[Details] ERROR: No test cases for dds/DCPS/transport/rtps_udp/BundlingCacheKey
[Details] ERROR: No test cases for dds/DCPS/transport/rtps_udp/ConstSharedRepoIdSet
[Details] ERROR: No test cases for dds/DCPS/transport/rtps_udp/LocatorCacheKey
[Details] ERROR: No test cases for dds/DCPS/transport/rtps_udp/RoutedGuidPair
[Details] ERROR: No test cases for dds/DCPS/transport/rtps_udp/RtpsCustomizedElement
[Details] ERROR: No test cases for dds/DCPS/transport/rtps_udp/RtpsSampleHeader
[Details] ERROR: No test cases for dds/DCPS/transport/rtps_udp/RtpsTransportHeader
[Details] ERROR: No test cases for dds/DCPS/transport/rtps_udp/RtpsUdp
[Details] ERROR: No test cases for dds/DCPS/transport/rtps_udp/RtpsUdpDataLink
[Details] ERROR: No test cases for dds/DCPS/transport/rtps_udp/RtpsUdpDataLink_rch
[Details] ERROR: No test cases for dds/DCPS/transport/rtps_udp/RtpsUdpInst
[Details] ERROR: No test cases for dds/DCPS/transport/rtps_udp/RtpsUdpInst_rch
[Details] ERROR: No test cases for dds/DCPS/transport/rtps_udp/RtpsUdpLoader
[Details] ERROR: No test cases for dds/DCPS/transport/rtps_udp/RtpsUdpReceiveStrategy
[Details] ERROR: No test cases for dds/DCPS/transport/rtps_udp/RtpsUdpReceiveStrategy_rch
[Details] ERROR: No test cases for dds/DCPS/transport/rtps_udp/RtpsUdpSendStrategy
[Details] ERROR: No test cases for dds/DCPS/transport/rtps_udp/RtpsUdpSendStrategy_rch
[Details] ERROR: No test cases for dds/DCPS/transport/rtps_udp/RtpsUdpTransport
[Details] ERROR: No test cases for dds/DCPS/transport/shmem/Shmem
[Details] ERROR: No test cases for dds/DCPS/transport/shmem/ShmemDataLink
[Details] ERROR: No test cases for dds/DCPS/transport/shmem/ShmemDataLink_rch
[Details] ERROR: No test cases for dds/DCPS/transport/shmem/ShmemInst
[Details] ERROR: No test cases for dds/DCPS/transport/shmem/ShmemInst_rch
[Details] ERROR: No test cases for dds/DCPS/transport/shmem/ShmemLoader
[Details] ERROR: No test cases for dds/DCPS/transport/shmem/ShmemReceiveStrategy
[Details] ERROR: No test cases for dds/DCPS/transport/shmem/ShmemReceiveStrategy_rch
[Details] ERROR: No test cases for dds/DCPS/transport/shmem/ShmemSendStrategy
[Details] ERROR: No test cases for dds/DCPS/transport/shmem/ShmemSendStrategy_rch
[Details] ERROR: No test cases for dds/DCPS/transport/shmem/ShmemTransport
[Details] ERROR: No test cases for dds/DCPS/transport/tcp/Tcp
[Details] ERROR: No test cases for dds/DCPS/transport/tcp/TcpAcceptor
[Details] ERROR: No test cases for dds/DCPS/transport/tcp/TcpConnection
[Details] ERROR: No test cases for dds/DCPS/transport/tcp/TcpConnection_rch
[Details] ERROR: No test cases for dds/DCPS/transport/tcp/TcpDataLink
[Details] ERROR: No test cases for dds/DCPS/transport/tcp/TcpDataLink_rch
[Details] ERROR: No test cases for dds/DCPS/transport/tcp/TcpInst
[Details] ERROR: No test cases for dds/DCPS/transport/tcp/TcpInst_rch
[Details] ERROR: No test cases for dds/DCPS/transport/tcp/TcpLoader
[Details] ERROR: No test cases for dds/DCPS/transport/tcp/TcpReceiveStrategy
[Details] ERROR: No test cases for dds/DCPS/transport/tcp/TcpReceiveStrategy_rch
[Details] ERROR: No test cases for dds/DCPS/transport/tcp/TcpSendStrategy
[Details] ERROR: No test cases for dds/DCPS/transport/tcp/TcpSendStrategy_rch
[Details] ERROR: No test cases for dds/DCPS/transport/tcp/TcpSynchResource
[Details] ERROR: No test cases for dds/DCPS/transport/tcp/TcpTransport
[Details] ERROR: No test cases for dds/DCPS/transport/tcp/TcpTransport_rch
[Details] ERROR: No test cases for dds/DCPS/transport/udp/Udp
[Details] ERROR: No test cases for dds/DCPS/transport/udp/UdpDataLink
[Details] ERROR: No test cases for dds/DCPS/transport/udp/UdpDataLink_rch
[Details] ERROR: No test cases for dds/DCPS/transport/udp/UdpInst
[Details] ERROR: No test cases for dds/DCPS/transport/udp/UdpInst_rch
[Details] ERROR: No test cases for dds/DCPS/transport/udp/UdpLoader
[Details] ERROR: No test cases for dds/DCPS/transport/udp/UdpReceiveStrategy
[Details] ERROR: No test cases for dds/DCPS/transport/udp/UdpReceiveStrategy_rch
[Details] ERROR: No test cases for dds/DCPS/transport/udp/UdpSendStrategy
[Details] ERROR: No test cases for dds/DCPS/transport/udp/UdpSendStrategy_rch
[Details] ERROR: No test cases for dds/DCPS/transport/udp/UdpTransport
[Details] ERROR: No test cases for dds/DCPS/TypeSupportImpl
[Details] ERROR: No test cases for dds/DCPS/unique_ptr
[Details] ERROR: No test cases for dds/DCPS/Util
[Details] ERROR: No test cases for dds/DCPS/ValueDispatcher
[Details] ERROR: No test cases for dds/DCPS/ValueHelper
[Details] ERROR: No test cases for dds/DCPS/ValueReader
[Details] ERROR: No test cases for dds/DCPS/ValueWriter
[Details] ERROR: No test cases for dds/DCPS/WriteDataContainer
[Details] ERROR: No test cases for dds/DCPS/WriterDataSampleList
[Details] ERROR: No test cases for dds/DCPS/WriterInfo
[Details] ERROR: No test cases for dds/DCPS/XTypes/DynamicDataAdapter
[Details] ERROR: No test cases for dds/DCPS/XTypes/DynamicDataBase
[Details] ERROR: No test cases for dds/DCPS/XTypes/DynamicDataFactory
[Details] ERROR: No test cases for dds/DCPS/XTypes/DynamicDataImpl
[Details] ERROR: No test cases for dds/DCPS/XTypes/DynamicDataXcdrReadImpl
[Details] ERROR: No test cases for dds/DCPS/XTypes/DynamicTypeMemberImpl
[Details] ERROR: No test cases for dds/DCPS/XTypes/DynamicTypeSupport
[Details] ERROR: No test cases for dds/DCPS/XTypes/External
[Details] ERROR: No test cases for dds/DCPS/XTypes/MemberDescriptorImpl
[Details] ERROR: No test cases for dds/DCPS/XTypes/TypeDescriptorImpl
[Details] ERROR: No test cases for dds/DCPS/XTypes/TypeLookupService
[Details] ERROR: No test cases for dds/DCPS/ZeroCopyAllocator_T
[Details] ERROR: No test cases for dds/DCPS/ZeroCopyInfoSeq_T
[Details] ERROR: No test cases for dds/DCPS/ZeroCopySeqBase
[Details] ERROR: No test cases for dds/DCPS/ZeroCopySeq_T
[Details] ERROR: No test cases for dds/FACE/config/ConnectionSettings
[Details] ERROR: No test cases for dds/FACE/config/Parser
[Details] ERROR: No test cases for dds/FACE/config/QosSettings
[Details] ERROR: No test cases for dds/FACE/config/TopicSettings
[Details] ERROR: No test cases for dds/FACE/FaceTSS
[Details] ERROR: No test cases for dds/FACE/StringManager
[Details] ERROR: No test cases for dds/idl/annotations
[Details] ERROR: No test cases for dds/idl/be_extern
[Details] ERROR: No test cases for dds/idl/be_global
[Details] ERROR: No test cases for dds/idl/be_init
[Details] ERROR: No test cases for dds/idl/be_produce
[Details] ERROR: No test cases for dds/idl/be_util
[Details] ERROR: No test cases for dds/idl/dds_generator
[Details] ERROR: No test cases for dds/idl/dds_visitor
[Details] ERROR: No test cases for dds/idl/drv_args
[Details] ERROR: No test cases for dds/idl/drv_preproc
[Details] ERROR: No test cases for dds/idl/field_info
[Details] ERROR: No test cases for dds/idl/itl_generator
[Details] ERROR: No test cases for dds/idl/keys_generator
[Details] ERROR: No test cases for dds/idl/langmap_generator
[Details] ERROR: No test cases for dds/idl/marshal_generator
[Details] ERROR: No test cases for dds/idl/metaclass_generator
[Details] ERROR: No test cases for dds/idl/opendds_idl
[Details] ERROR: No test cases for dds/idl/topic_keys
[Details] ERROR: No test cases for dds/idl/ts_generator
[Details] ERROR: No test cases for dds/idl/typeobject_generator
[Details] ERROR: No test cases for dds/idl/value_reader_generator
[Details] ERROR: No test cases for dds/idl/value_writer_generator
[Details] ERROR: No test cases for dds/InfoRepo/DCPSInfo_i
[Details] ERROR: No test cases for dds/InfoRepo/DcpsInfo_pch
[Details] ERROR: No test cases for dds/InfoRepo/DCPSInfoRepo
[Details] ERROR: No test cases for dds/InfoRepo/DCPSInfoRepoServ
[Details] ERROR: No test cases for dds/InfoRepo/DCPS_IR_Domain
[Details] ERROR: No test cases for dds/InfoRepo/DCPS_IR_Participant
[Details] ERROR: No test cases for dds/InfoRepo/DCPS_IR_Publication
[Details] ERROR: No test cases for dds/InfoRepo/DCPS_IR_Subscription
[Details] ERROR: No test cases for dds/InfoRepo/DCPS_IR_Topic
[Details] ERROR: No test cases for dds/InfoRepo/DCPS_IR_Topic_Description
[Details] ERROR: No test cases for dds/InfoRepo/DefaultValues
[Details] ERROR: No test cases for dds/InfoRepo/DomainParticipantListener_i
[Details] ERROR: No test cases for dds/InfoRepo/FederationId
[Details] ERROR: No test cases for dds/InfoRepo/FederatorConfig
[Details] ERROR: No test cases for dds/InfoRepo/FederatorManagerImpl
[Details] ERROR: No test cases for dds/InfoRepo/FederatorManagerImpl_updates
[Details] ERROR: No test cases for dds/InfoRepo/InfoRepoMulticastResponder
[Details] ERROR: No test cases for dds/InfoRepo/PersistenceUpdater
[Details] ERROR: No test cases for dds/InfoRepo/ShutdownInterface
[Details] ERROR: No test cases for dds/InfoRepo/UpdateDataTypes
[Details] ERROR: No test cases for dds/InfoRepo/UpdateListener_T
[Details] ERROR: No test cases for dds/InfoRepo/UpdateManager
[Details] ERROR: No test cases for dds/InfoRepo/UpdateManager_T
[Details] ERROR: No test cases for dds/InfoRepo/UpdateProcessor_T
[Details] ERROR: No test cases for dds/InfoRepo/Updater
[Details] ERROR: No test cases for dds/InfoRepo/UpdateReceiver_T
[Details] ERROR: No test cases for dds/monitor/DPMonitorImpl
[Details] ERROR: No test cases for dds/monitor/DRMonitorImpl
[Details] ERROR: No test cases for dds/monitor/DRPeriodicMonitorImpl
[Details] ERROR: No test cases for dds/monitor/DWMonitorImpl
[Details] ERROR: No test cases for dds/monitor/DWPeriodicMonitorImpl
[Details] ERROR: No test cases for dds/monitor/MonitorFactoryImpl
[Details] ERROR: No test cases for dds/monitor/PublisherMonitorImpl
[Details] ERROR: No test cases for dds/monitor/SPMonitorImpl
[Details] ERROR: No test cases for dds/monitor/SubscriberMonitorImpl
[Details] ERROR: No test cases for dds/monitor/TopicMonitorImpl
[Details] ERROR: No test cases for dds/monitor/TransportMonitorImpl
[Details] ERROR: No test cases for dds/rc_common
[Details] ERROR: No test cases for dds/Version
[Details] ERROR: No test cases for dds/Versioned_Namespace
[Details] ERROR: No test cases for FACE/Fixed
[Details] ERROR: No test cases for FACE/Sequence
[Details] ERROR: No test cases for FACE/SequenceVar
[Details] ERROR: No test cases for FACE/StringManager
[Details] ERROR: No test cases for tools/dcpsinfo_dump/dump
[Details] ERROR: No test cases for tools/dissector/giop_base
[Details] ERROR: No test cases for tools/dissector/packet-datawriter
[Details] ERROR: No test cases for tools/dissector/packet-opendds
[Details] ERROR: No test cases for tools/dissector/packet-repo
[Details] ERROR: No test cases for tools/dissector/plugin
[Details] ERROR: No test cases for tools/dissector/sample_dissector
[Details] ERROR: No test cases for tools/dissector/sample_manager
[Details] ERROR: No test cases for tools/dissector/ws_common
[Details] ERROR: No test cases for tools/dissector/ws-wrapper-headers/config
[Details] ERROR: No test cases for tools/dissector/ws-wrapper-headers/packet-giop
[Details] ERROR: No test cases for tools/dissector/ws-wrapper-headers/packet-tcp
[Details] ERROR: No test cases for tools/dissector/ws-wrapper-headers/tvbuff
[Details] ERROR: No test cases for tools/excelRTD/resource
[Details] ERROR: No test cases for tools/excelRTD/RTDDataThread
[Details] ERROR: No test cases for tools/excelRTD/RTDMonitor
[Details] ERROR: No test cases for tools/excelRTD/RTDServer
[Details] ERROR: No test cases for tools/excelRTD/RTDServerDLL
[Details] ERROR: No test cases for tools/inspect/Inspect
[Details] ERROR: No test cases for tools/IntermediateTypeLang/cpp/main
[Details] ERROR: No test cases for tools/modeling/codegen/model/Application
[Details] ERROR: No test cases for tools/modeling/codegen/model/Config
[Details] ERROR: No test cases for tools/modeling/codegen/model/CopyQos
[Details] ERROR: No test cases for tools/modeling/codegen/model/Delegate
[Details] ERROR: No test cases for tools/modeling/codegen/model/Entities
[Details] ERROR: No test cases for tools/modeling/codegen/model/EntityProfiles
[Details] ERROR: No test cases for tools/modeling/codegen/model/Exceptions
[Details] ERROR: No test cases for tools/modeling/codegen/model/NullListener
[Details] ERROR: No test cases for tools/modeling/codegen/model/NullParticipantListener
[Details] ERROR: No test cases for tools/modeling/codegen/model/NullPublisherListener
[Details] ERROR: No test cases for tools/modeling/codegen/model/NullReaderListener
[Details] ERROR: No test cases for tools/modeling/codegen/model/NullSubscriberListener
[Details] ERROR: No test cases for tools/modeling/codegen/model/NullTopicListener
[Details] ERROR: No test cases for tools/modeling/codegen/model/NullWriterListener
[Details] ERROR: No test cases for tools/modeling/codegen/model/Service_T
[Details] ERROR: No test cases for tools/modeling/codegen/model/Sync
[Details] ERROR: No test cases for tools/modeling/codegen/model/TransportDirectives
[Details] ERROR: No test cases for tools/modeling/codegen/model/Utilities
[Details] ERROR: No test cases for tools/monitor/Edge
[Details] ERROR: No test cases for tools/monitor/GraphGenerator
[Details] ERROR: No test cases for tools/monitor/GvOptions
[Details] ERROR: No test cases for tools/monitor/MonitorData
[Details] ERROR: No test cases for tools/monitor/MonitorDataModel
[Details] ERROR: No test cases for tools/monitor/MonitorDataStorage
[Details] ERROR: No test cases for tools/monitor/Monitor_main
[Details] ERROR: No test cases for tools/monitor/MonitorTask
[Details] ERROR: No test cases for tools/monitor/Node
[Details] ERROR: No test cases for tools/monitor/NodeGenerator
[Details] ERROR: No test cases for tools/monitor/NodeOptions
[Details] ERROR: No test cases for tools/monitor/Options
[Details] ERROR: No test cases for tools/monitor/QosFormatter
[Details] ERROR: No test cases for tools/monitor/RepoSelect
[Details] ERROR: No test cases for tools/monitor/TreeNode
[Details] ERROR: No test cases for tools/monitor/Viewer
[Details] ERROR: No test cases for tools/repoctl/repoctl
[Details] ERROR: No test cases for tools/rtpsrelay/CommonIoStatsReportHelper
[Details] ERROR: No test cases for tools/rtpsrelay/Config
[Details] ERROR: No test cases for tools/rtpsrelay/GuidAddrSet
[Details] ERROR: No test cases for tools/rtpsrelay/GuidPartitionTable
[Details] ERROR: No test cases for tools/rtpsrelay/HandlerStatisticsReporter
[Details] ERROR: No test cases for tools/rtpsrelay/ListenerBase
[Details] ERROR: No test cases for tools/rtpsrelay/ParticipantListener
[Details] ERROR: No test cases for tools/rtpsrelay/ParticipantStatisticsReporter
[Details] ERROR: No test cases for tools/rtpsrelay/PublicationListener
[Details] ERROR: No test cases for tools/rtpsrelay/RelayAddressListener
[Details] ERROR: No test cases for tools/rtpsrelay/RelayHandler
[Details] ERROR: No test cases for tools/rtpsrelay/RelayHttpMetaDiscovery
[Details] ERROR: No test cases for tools/rtpsrelay/RelayParticipantStatusReporter
[Details] ERROR: No test cases for tools/rtpsrelay/RelayPartitionsListener
[Details] ERROR: No test cases for tools/rtpsrelay/RelayPartitionTable
[Details] ERROR: No test cases for tools/rtpsrelay/RelayStatisticsReporter
[Details] ERROR: No test cases for tools/rtpsrelay/RelayStatusReporter
[Details] ERROR: No test cases for tools/rtpsrelay/RelayThreadMonitor
[Details] ERROR: No test cases for tools/rtpsrelay/RtpsRelay
[Details] ERROR: No test cases for tools/rtpsrelay/SpdpReplayListener
[Details] ERROR: No test cases for tools/rtpsrelay/SubscriptionListener

dds_oci_tao-2_2_0_bedbug_win7-x64_vc11_d1o0

tests/DCPS/DpShutdown/run_test.pl t=shmem

[Details] 2022-12-02 22:11:05.932@LM_ERROR@(1756|5148) Sedp::remote_knows_about_local_i - could not find local publication 0103000c.2959e574.06dc0710.00000002(0a1cf9c2)
[Details] 2022-12-02 22:11:05.933@LM_ERROR@(1756|5148) Sedp::remote_knows_about_local_i - could not find local publication 0103000c.2959e574.06dc0710.00000002(0a1cf9c2)
[Details] test FAILED.
[Details] ERROR: client returned -1

dds_oci_tao-2_2_0_bee_win7_vc12_d1o0

tests/DCPS/Thrasher/run_test.pl aggressive rtps

[Details] ERROR: Thrasher timedout
[Details] 2022-12-03 04:14:33: ERROR: Thrasher timedout
[Details] test FAILED.

dds_oci_tao-2_2_0_navair_linux-sb_gcc_d1o0

tests/DCPS/WaitForAck/run_test.pl rtps

[Details] 2022-12-02 21:33:12: ERROR: pub finished and returned 2
[Details] 2022-12-02 21:32:36.254@LM_DEBUG@(-1|1159096096) ERROR: Publisher::run() - publication 1 wait failed with code: 10.
[Details] 2022-12-02 21:32:51.255@LM_DEBUG@(-1|1159096096) ERROR: Publisher::run() - publication 2 wait failed with code: 10.
[Details] test FAILED.
[Details] auto_run_tests.pl: ERROR: "tests/DCPS/WaitForAck/run_test.pl rtps" returned with status 1

dds_oci_tao-2_2_0_wasp_win10-x64_vs2017_d1o0

tests/unit-tests/run_test.pl

[Details] [ FAILED ] dds_DCPS_DispatchService.TimedDispatchSingleThreaded (125 ms)
[Details] [ FAILED ] 1 test, listed below:
[Details] [ FAILED ] dds_DCPS_DispatchService.TimedDispatchSingleThreaded
[Details] 1 FAILED TEST
[Details] 2022-12-02 23:03:18: ERROR: UnitTests finished and returned 1
[Details] test FAILED.

tests/DCPS/Instances/run_test.pl single_instance multiple_datawriter nokey

[Details] ERROR: subscriber timedout
[Details] 2022-12-03 00:17:28: ERROR: sub timedout
[Details] test FAILED.

tests/DCPS/Instances/run_test.pl multiple_instance multiple_datawriter nokey

[Details] ERROR: subscriber timedout
[Details] 2022-12-03 00:18:31: ERROR: sub timedout
[Details] test FAILED.