Failed Test Brief Log By Test


TAO/CIAO/tests/DAnCE/Executor-Destructor/run_test.pl

oci_tao-2_2_0_spider_linux_gcc_d1o0



[Details] /tao_builds/jenkins/workspace/oci_tao-2_2_0_spider_linux_gcc_d1o0/DAnCE/bin/dance_locality_manager: symbol lookup error: libExecutor_Destructor_Interceptor.so: undefined symbol: _ZN13ACE_SingletonIN10dance_test16Exec_Dest_StatusE14ACE_Null_MutexE8instanceEv
[Details] (18180|18180) [LM_ERROR] - 13:05:40.427958 - Plan_Launcher::launch_plan - Deployment failed, exception: Caught StartError exception while invoking startLaunch: locality_manager, Failed to startup LocalityManager
[Details] (18182|18182) [LM_ERROR] - 13:05:40.535562 - Plan_Launcher::teardown_plan - Application Teardown failed, exception: Nil ApplicationManager reference in teardown_application


TAO/orbsvcs/DevGuideExamples/NotifyService/EventSequence/run_test.pl

oci_tao-2_2_0_tick_linux_gcc_d0o1s1



[Details] ERROR: /tao_builds/jenkins/workspace/oci_tao-2_2_0_tick_linux_gcc_d0o1s1/TAO/orbsvcs/Notify_Service/tao_cosnotification timedout
[Details] ERROR: Notification Service returned -1
[Details] Error: TAO/orbsvcs/DevGuideExamples/NotifyService/EventSequence/run_test.pl returned with status 1

oci_tao-2_2_0_wiro_linux_gcc_d1o0s1



[Details] ERROR: /tao_builds/jenkins/workspace/oci_tao-2_2_0_wiro_linux_gcc_d1o0s1/TAO/orbsvcs/Notify_Service/tao_cosnotification timedout
[Details] 57 ./nptl/futex-internal.c: No such file or directory.
[Details] ERROR: Notification Service returned -1
[Details] Error: TAO/orbsvcs/DevGuideExamples/NotifyService/EventSequence/run_test.pl returned with status 1


TAO/orbsvcs/DevGuideExamples/NotifyService/Filtering/run_test.pl

oci_tao-2_2_0_tick_linux_gcc_d0o1s1



[Details] ERROR: /tao_builds/jenkins/workspace/oci_tao-2_2_0_tick_linux_gcc_d0o1s1/TAO/orbsvcs/Notify_Service/tao_cosnotification timedout
[Details] ERROR: Notification Service returned -1
[Details] Error: TAO/orbsvcs/DevGuideExamples/NotifyService/Filtering/run_test.pl returned with status 1

oci_tao-2_2_0_wiro_linux_gcc_d1o0s1



[Details] ERROR: /tao_builds/jenkins/workspace/oci_tao-2_2_0_wiro_linux_gcc_d1o0s1/TAO/orbsvcs/Notify_Service/tao_cosnotification timedout
[Details] 57 ./nptl/futex-internal.c: No such file or directory.
[Details] ERROR: Notification Service returned -1
[Details] Error: TAO/orbsvcs/DevGuideExamples/NotifyService/Filtering/run_test.pl returned with status 1


TAO/orbsvcs/DevGuideExamples/NotifyService/Messenger/run_test.pl

oci_tao-2_2_0_tick_linux_gcc_d0o1s1



[Details] ERROR: /tao_builds/jenkins/workspace/oci_tao-2_2_0_tick_linux_gcc_d0o1s1/TAO/orbsvcs/Notify_Service/tao_cosnotification timedout
[Details] ERROR: Notification Service returned -1
[Details] Error: TAO/orbsvcs/DevGuideExamples/NotifyService/Messenger/run_test.pl returned with status 1

oci_tao-2_2_0_wiro_linux_gcc_d1o0s1



[Details] ERROR: /tao_builds/jenkins/workspace/oci_tao-2_2_0_wiro_linux_gcc_d1o0s1/TAO/orbsvcs/Notify_Service/tao_cosnotification timedout
[Details] 57 ./nptl/futex-internal.c: No such file or directory.
[Details] ERROR: Notification Service returned -1
[Details] Error: TAO/orbsvcs/DevGuideExamples/NotifyService/Messenger/run_test.pl returned with status 1


TAO/orbsvcs/DevGuideExamples/NotifyService/OfferSubscriptions/run_test.pl

oci_tao-2_2_0_tick_linux_gcc_d0o1s1



[Details] ERROR: /tao_builds/jenkins/workspace/oci_tao-2_2_0_tick_linux_gcc_d0o1s1/TAO/orbsvcs/Notify_Service/tao_cosnotification timedout
[Details] ERROR: Notification Service returned -1
[Details] Error: TAO/orbsvcs/DevGuideExamples/NotifyService/OfferSubscriptions/run_test.pl returned with status 1

oci_tao-2_2_0_wiro_linux_gcc_d1o0s1



[Details] ERROR: /tao_builds/jenkins/workspace/oci_tao-2_2_0_wiro_linux_gcc_d1o0s1/TAO/orbsvcs/Notify_Service/tao_cosnotification timedout
[Details] 57 ./nptl/futex-internal.c: No such file or directory.
[Details] ERROR: Notification Service returned -1
[Details] Error: TAO/orbsvcs/DevGuideExamples/NotifyService/OfferSubscriptions/run_test.pl returned with status 1


TAO/orbsvcs/DevGuideExamples/NotifyService/QoSProperties/run_test.pl

oci_tao-2_2_0_tick_linux_gcc_d0o1s1



[Details] ERROR: /tao_builds/jenkins/workspace/oci_tao-2_2_0_tick_linux_gcc_d0o1s1/TAO/orbsvcs/Notify_Service/tao_cosnotification timedout
[Details] ERROR: Notification Service returned -1
[Details] Error: TAO/orbsvcs/DevGuideExamples/NotifyService/QoSProperties/run_test.pl returned with status 1

oci_tao-2_2_0_wiro_linux_gcc_d1o0s1



[Details] ERROR: /tao_builds/jenkins/workspace/oci_tao-2_2_0_wiro_linux_gcc_d1o0s1/TAO/orbsvcs/Notify_Service/tao_cosnotification timedout
[Details] 57 ./nptl/futex-internal.c: No such file or directory.
[Details] ERROR: Notification Service returned -1
[Details] Error: TAO/orbsvcs/DevGuideExamples/NotifyService/QoSProperties/run_test.pl returned with status 1


TAO/orbsvcs/DevGuideExamples/Security/ParticipatingApp/run_test.pl

oci_tao-2_2_0_ant_linux_gcc_s1d1o0i0



[Details] ACE_SSL (1533|1533) error code: 336151573 - error:14094415:SSL routines:SSL3_READ_BYTES:sslv3 alert certificate expired
[Details] (1534|1534) EXCEPTION, Client: main block
[Details] ERROR: client returned 1
[Details] ERROR: MessengerServer timedout
[Details] ERROR: server returned -1
[Details] Error: TAO/orbsvcs/DevGuideExamples/Security/ParticipatingApp/run_test.pl returned with status 1

oci_tao-2_2_0_cricket_win2012r2_vc10_s1d0o1



[Details] (2852|2908) EXCEPTION, Client: main block
[Details] ERROR: client returned 1
[Details] ERROR: MessengerServer timedout
[Details] ERROR: server returned -1

oci_tao-2_2_0_firefly_linux_gcc_s1d1o0



[Details] (734|734) EXCEPTION, Client: main block
[Details] ERROR: client returned 1
[Details] ERROR: MessengerServer timedout
[Details] ERROR: server returned -1
[Details] Error: TAO/orbsvcs/DevGuideExamples/Security/ParticipatingApp/run_test.pl returned with status 1

oci_tao-2_2_0_hornet_win7-x64_vc14_s1d1o0



[Details] (7084|5100) EXCEPTION, Client: main block
[Details] ERROR: client returned 1
[Details] ERROR: MessengerServer timedout
[Details] ERROR: server returned -1

oci_tao-2_2_0_mosquito_linux_gcc_s1i1d0o1



[Details] (17324|17324) EXCEPTION, Client: main block
[Details] ERROR: client returned 1
[Details] ERROR: MessengerServer timedout
[Details] ERROR: server returned -1
[Details] Error: TAO/orbsvcs/DevGuideExamples/Security/ParticipatingApp/run_test.pl returned with status 1

oci_tao-2_2_0_spider_linux_gcc_d1o0



[Details] (15505|15505) EXCEPTION, Client: main block
[Details] ERROR: client returned 1
[Details] ERROR: MessengerServer timedout
[Details] ERROR: server returned -1
[Details] Error: TAO/orbsvcs/DevGuideExamples/Security/ParticipatingApp/run_test.pl returned with status 1


TAO/orbsvcs/DevGuideExamples/Security/PolicyControllingApp/run_test.pl

oci_tao-2_2_0_ant_linux_gcc_s1d1o0i0



[Details] ACE_SSL (1541|1541) error code: 336151573 - error:14094415:SSL routines:SSL3_READ_BYTES:sslv3 alert certificate expired
[Details] (1542|1542) EXCEPTION, Client: main block
[Details] ERROR: Messenger Client returned 1
[Details] Error: TAO/orbsvcs/DevGuideExamples/Security/PolicyControllingApp/run_test.pl returned with status 1

oci_tao-2_2_0_cricket_win2012r2_vc10_s1d0o1



[Details] (4040|3800) EXCEPTION, Client: main block
[Details] ERROR: Messenger Client returned 1

oci_tao-2_2_0_firefly_linux_gcc_s1d1o0



[Details] (744|744) EXCEPTION, Client: main block
[Details] ERROR: Messenger Client returned 1
[Details] Error: TAO/orbsvcs/DevGuideExamples/Security/PolicyControllingApp/run_test.pl returned with status 1

oci_tao-2_2_0_hornet_win7-x64_vc14_s1d1o0



[Details] (3232|3704) EXCEPTION, Client: main block
[Details] ERROR: Messenger Client returned 1

oci_tao-2_2_0_mosquito_linux_gcc_s1i1d0o1



[Details] (17333|17333) EXCEPTION, Client: main block
[Details] ERROR: Messenger Client returned 1
[Details] Error: TAO/orbsvcs/DevGuideExamples/Security/PolicyControllingApp/run_test.pl returned with status 1

oci_tao-2_2_0_spider_linux_gcc_d1o0



[Details] (15513|15513) EXCEPTION, Client: main block
[Details] ERROR: Messenger Client returned 1
[Details] Error: TAO/orbsvcs/DevGuideExamples/Security/PolicyControllingApp/run_test.pl returned with status 1


TAO/orbsvcs/DevGuideExamples/Security/SecurityUnawareApp/run_test.pl

oci_tao-2_2_0_ant_linux_gcc_s1d1o0i0



[Details] ACE_SSL (1544|1544) error code: 336151573 - error:14094415:SSL routines:SSL3_READ_BYTES:sslv3 alert certificate expired
[Details] ERROR: Messenger Client1 returned 1
[Details] ERROR: Messenger Client2 returned 1
[Details] Error: TAO/orbsvcs/DevGuideExamples/Security/SecurityUnawareApp/run_test.pl returned with status 1

oci_tao-2_2_0_cricket_win2012r2_vc10_s1d0o1



[Details] ERROR: Messenger Client1 returned 1
[Details] ERROR: Messenger Client2 returned 1
[Details] ERROR: Messenger Server returned 4294967295

oci_tao-2_2_0_firefly_linux_gcc_s1d1o0



[Details] ERROR: Messenger Client1 returned 1
[Details] ERROR: Messenger Client2 returned 1
[Details] Error: TAO/orbsvcs/DevGuideExamples/Security/SecurityUnawareApp/run_test.pl returned with status 1

oci_tao-2_2_0_hornet_win7-x64_vc14_s1d1o0



[Details] ERROR: Messenger Client1 returned 1
[Details] ERROR: Messenger Client2 returned 1
[Details] ERROR: Messenger Server returned 4294967295

oci_tao-2_2_0_mosquito_linux_gcc_s1i1d0o1



[Details] ERROR: Messenger Client1 returned 1
[Details] ERROR: Messenger Client2 returned 1
[Details] Error: TAO/orbsvcs/DevGuideExamples/Security/SecurityUnawareApp/run_test.pl returned with status 1

oci_tao-2_2_0_spider_linux_gcc_d1o0



[Details] ERROR: Messenger Client1 returned 1
[Details] ERROR: Messenger Client2 returned 1
[Details] Error: TAO/orbsvcs/DevGuideExamples/Security/SecurityUnawareApp/run_test.pl returned with status 1


TAO/orbsvcs/examples/Notify/Filter/run_test.pl

oci_tao-2_2_0_tick_linux_gcc_d0o1s1



[Details] ERROR: /tao_builds/jenkins/workspace/oci_tao-2_2_0_tick_linux_gcc_d0o1s1/TAO/orbsvcs/Notify_Service/tao_cosnotification timedout
[Details] ERROR: Notification Service returned -1
[Details] Error: TAO/orbsvcs/examples/Notify/Filter/run_test.pl returned with status 1

oci_tao-2_2_0_wiro_linux_gcc_d1o0s1



[Details] ERROR: /tao_builds/jenkins/workspace/oci_tao-2_2_0_wiro_linux_gcc_d1o0s1/TAO/orbsvcs/Notify_Service/tao_cosnotification timedout
[Details] 57 ./nptl/futex-internal.c: No such file or directory.
[Details] ERROR: Notification Service returned -1
[Details] Error: TAO/orbsvcs/examples/Notify/Filter/run_test.pl returned with status 1


TAO/orbsvcs/examples/Notify/Subscribe/run_test.pl

oci_tao-2_2_0_tick_linux_gcc_d0o1s1



[Details] ERROR: /tao_builds/jenkins/workspace/oci_tao-2_2_0_tick_linux_gcc_d0o1s1/TAO/orbsvcs/Notify_Service/tao_cosnotification timedout
[Details] ERROR: Notification Service returned -1
[Details] Error: TAO/orbsvcs/examples/Notify/Subscribe/run_test.pl returned with status 1

oci_tao-2_2_0_wiro_linux_gcc_d1o0s1



[Details] ERROR: /tao_builds/jenkins/workspace/oci_tao-2_2_0_wiro_linux_gcc_d1o0s1/TAO/orbsvcs/Notify_Service/tao_cosnotification timedout
[Details] 57 ./nptl/futex-internal.c: No such file or directory.
[Details] ERROR: Notification Service returned -1
[Details] Error: TAO/orbsvcs/examples/Notify/Subscribe/run_test.pl returned with status 1


TAO/orbsvcs/tests/AVStreams/Asynch_Three_Stage/run_test.pl

oci_tao-2_2_0_mosquito_linux_gcc_s1i1d0o1



[Details] ERROR: <distributer> exited with coredump from signal 11 : SEGV
[Details] Program terminated with signal SIGSEGV, Segmentation fault.
[Details] ERROR: distributer returned 255
[Details] (14089|14089) EXCEPTION, TAO_StreamCtrl::bind_devs
[Details] (14089|14089) EXCEPTION, TAO_StreamCtrl::start
[Details] (14089|14089) EXCEPTION, receiver::init
[Details] (14090|14090) EXCEPTION, TAO_StreamCtrl::bind_devs
[Details] (14092|14092) EXCEPTION, TAO_StreamCtrl::bind_devs
[Details] ERROR: <distributer> exited with coredump from signal 11 : SEGV
[Details] Program terminated with signal SIGSEGV, Segmentation fault.
[Details] ERROR: distributer returned 255
[Details] ERROR: <receiver> failed:
[Details] ERROR: Receiver 1 returned 255
[Details] Error: TAO/orbsvcs/tests/AVStreams/Asynch_Three_Stage/run_test.pl returned with status 1


TAO/orbsvcs/tests/AVStreams/Component_Switching/run_test.pl

oci_tao-2_2_0_mosquito_linux_gcc_s1i1d0o1



[Details] (14109|14109) EXCEPTION, TAO_StreamCtrl::bind_devs
[Details] (14113|14113) EXCEPTION, TAO_StreamCtrl::bind_devs
[Details] (14114|14114) EXCEPTION, TAO_StreamCtrl::bind_devs
[Details] ERROR: <distributer> exited with coredump from signal 11 : SEGV
[Details] Program terminated with signal SIGSEGV, Segmentation fault.
[Details] ERROR: distributer 3 returned 255
[Details] ERROR: <distributer> exited with coredump from signal 11 : SEGV
[Details] Program terminated with signal SIGSEGV, Segmentation fault.
[Details] ERROR: distributer 2 returned 255
[Details] ERROR: <distributer> exited with coredump from signal 11 : SEGV
[Details] Program terminated with signal SIGSEGV, Segmentation fault.
[Details] ERROR: distributer 1 returned 255
[Details] ERROR: <distributer> exited with coredump from signal 11 : SEGV
[Details] Program terminated with signal SIGSEGV, Segmentation fault.
[Details] ERROR: distributer 4 returned 255
[Details] Error: TAO/orbsvcs/tests/AVStreams/Component_Switching/run_test.pl returned with status 1


TAO/orbsvcs/tests/AVStreams/Pluggable/run_test.pl -p TCP,UDP,RTP_UDP

oci_tao-2_2_0_katydid_win10-x64_vs2019_d1o0



[Details] (C:\tao_builds\jenkins\workspace\tao-2_2_0_vs2019_d1o0\TAO\orbsvcs\orbsvcs\AV\UDP.cpp,463) Error during connection setup: -1
[Details] (C:\tao_builds\jenkins\workspace\tao-2_2_0_vs2019_d1o0\TAO\orbsvcs\orbsvcs\AV\UDP.cpp,463) Error during connection setup: -1
[Details] ERROR: ftp returned 1

oci_tao-2_2_0_wasp_win10-x64_vs2017_d1o0



[Details] (c:\tao_builds\jenkins\workspace\tao-2_2_0_vs2017_d1o0\tao\orbsvcs\orbsvcs\av\udp.cpp,463) Error during connection setup: -1
[Details] (c:\tao_builds\jenkins\workspace\tao-2_2_0_vs2017_d1o0\tao\orbsvcs\orbsvcs\av\udp.cpp,463) Error during connection setup: -1
[Details] ERROR: ftp returned 1


TAO/orbsvcs/tests/AVStreams/Simple_Three_Stage/run_test.pl

oci_tao-2_2_0_mosquito_linux_gcc_s1i1d0o1



[Details] (14070|14070) EXCEPTION, TAO_StreamCtrl::bind_devs
[Details] ERROR: <distributer> failed: No such file or directory
[Details] ERROR: Distributer returned 255
[Details] ERROR: <sender> exited with coredump from signal 11 : SEGV
[Details] Program terminated with signal SIGSEGV, Segmentation fault.
[Details] ERROR: sender returned 255
[Details] Error: TAO/orbsvcs/tests/AVStreams/Simple_Three_Stage/run_test.pl returned with status 1


TAO/orbsvcs/tests/AVStreams/Simple_Two_Stage_With_QoS/run_test.pl -p TCP,UDP,RTP_UDP

oci_tao-2_2_0_katydid_win10-x64_vs2019_d1o0



[Details] (C:\tao_builds\jenkins\workspace\tao-2_2_0_vs2019_d1o0\TAO\orbsvcs\orbsvcs\AV\UDP.cpp,463) Error during connection setup: -1
[Details] (C:\tao_builds\jenkins\workspace\tao-2_2_0_vs2019_d1o0\TAO\orbsvcs\orbsvcs\AV\UDP.cpp,463) Error during connection setup: -1
[Details] ERROR: ftp returned 4294967295

oci_tao-2_2_0_wasp_win10-x64_vs2017_d1o0



[Details] (c:\tao_builds\jenkins\workspace\tao-2_2_0_vs2017_d1o0\tao\orbsvcs\orbsvcs\av\udp.cpp,463) Error during connection setup: -1
[Details] (c:\tao_builds\jenkins\workspace\tao-2_2_0_vs2017_d1o0\tao\orbsvcs\orbsvcs\av\udp.cpp,463) Error during connection setup: -1
[Details] ERROR: ftp returned 4294967295


TAO/orbsvcs/tests/Bug_2247_Regression/run_test.pl

oci_tao-2_2_0_bedbug_win7-x64_vc11_d0o1



[Details] ERROR: Manager 0 returned 255
[Details] ERROR: Manager 1 returned 255
[Details] ERROR: Manager 2 returned 255
[Details] ERROR: server 2 returned 3

oci_tao-2_2_0_cricket_win2012r2_vc10_s1d0o1



[Details] (3224|3472) ERROR: ACCESS VIOLATION
[Details] ERROR: Manager 0 returned 3221225477
[Details] (5968|4056) ERROR: ACCESS VIOLATION
[Details] ERROR: Manager 1 returned 3221225477
[Details] (876|5884) ERROR: ACCESS VIOLATION
[Details] ERROR: Manager 2 returned 3221225477
[Details] ERROR: server 2 returned 3

oci_tao-2_2_0_hornet_win7-x64_vc14_s1d1o0



[Details] ERROR: Manager 0 returned 255
[Details] ERROR: Manager 1 returned 255
[Details] ERROR: Manager 2 returned 255
[Details] ERROR: server 2 returned 3

oci_tao-2_2_0_katydid_win10-x64_vs2019_d1o0



[Details] ERROR: Manager 0 returned 3221225477
[Details] ERROR: Manager 1 returned 3221225477
[Details] ERROR: Manager 2 returned 3221225477
[Details] ERROR: server 2 returned 3

oci_tao-2_2_0_tick_linux_gcc_d0o1s1



[Details] ERROR: <Manager> exited with coredump from signal 11 : SEGV
[Details] ERROR: Manager 0 returned 255
[Details] ERROR: <Manager> exited with coredump from signal 11 : SEGV
[Details] ERROR: Manager 1 returned 255
[Details] ERROR: <Manager> exited with coredump from signal 11 : SEGV
[Details] ERROR: Manager 2 returned 255
[Details] Error: TAO/orbsvcs/tests/Bug_2247_Regression/run_test.pl returned with status 1

oci_tao-2_2_0_wasp_win10-x64_vs2017_d1o0



[Details] ERROR: Manager 0 returned 3221225477
[Details] ERROR: Manager 1 returned 3221225477
[Details] ERROR: Manager 2 returned 3221225477
[Details] ERROR: server 2 returned 3

oci_tao-2_2_0_wiro_linux_gcc_d1o0s1



[Details] ERROR: <Manager> exited with coredump from signal 11 : SEGV
[Details] ERROR: Manager 0 returned 255
[Details] ERROR: <Manager> exited with coredump from signal 11 : SEGV
[Details] ERROR: Manager 1 returned 255
[Details] ERROR: <Manager> exited with coredump from signal 11 : SEGV
[Details] ERROR: Manager 2 returned 255
[Details] Error: TAO/orbsvcs/tests/Bug_2247_Regression/run_test.pl returned with status 1


TAO/orbsvcs/tests/Bug_2248_Regression/run_test.pl

oci_tao-2_2_0_katydid_win10-x64_vs2019_d1o0



[Details] abort() has been calledERROR: client timedout
[Details] ERROR: client returned -1

oci_tao-2_2_0_wasp_win10-x64_vs2017_d1o0



[Details] abort() has been calledERROR: client timedout
[Details] ERROR: client returned -1


TAO/orbsvcs/tests/Bug_3444_Regression/run_test_ipv6.pl

oci_tao-2_2_0_mosquito_linux_gcc_s1i1d0o1



[Details] (17121|17121) EXCEPTION, Exception in server.cpp:
[Details] ERROR: cannot find file </tao_builds/jenkins/workspace/oci_tao-2_2_0_mosquito_linux_gcc_s1i1d0o1/TAO/orbsvcs/tests/Bug_3444_Regression/server.ior>
[Details] ERROR: <server> failed: No such file or directory
[Details] Error: TAO/orbsvcs/tests/Bug_3444_Regression/run_test_ipv6.pl returned with status 1


TAO/orbsvcs/tests/Bug_4118_Regression/run_test.pl

oci_tao-2_2_0_bedbug_win7-x64_vc11_d0o1



[Details] ERROR: Cannot Spawn: <C:\tao_builds\jenkins\workspace\oci_tao-2_2_0_bedbug_win7-x64_vc11_d0o1\TAO\orbsvcs\tests\Bug_4118_Regression\..\..\..\utils\nslist\Release\\tao_nsadd.EXE> not found
[Details] ERROR: ns_add returned -1
[Details] ERROR: Cannot Spawn: <C:\tao_builds\jenkins\workspace\oci_tao-2_2_0_bedbug_win7-x64_vc11_d0o1\TAO\orbsvcs\tests\Bug_4118_Regression\..\..\..\utils\nslist\Release\\tao_nsadd.EXE> not found
[Details] ERROR: ns_add returned -1

oci_tao-2_2_0_cricket_win2012r2_vc10_s1d0o1



[Details] ERROR: Cannot Spawn: <C:\tao_builds\jenkins\workspace\oci_tao-2_2_0_cricket_win2012r2_vc10_s1d0o1\TAO\orbsvcs\tests\Bug_4118_Regression\..\..\..\utils\nslist\Release\\tao_nsadd.EXE> not found
[Details] ERROR: ns_add returned -1
[Details] ERROR: Cannot Spawn: <C:\tao_builds\jenkins\workspace\oci_tao-2_2_0_cricket_win2012r2_vc10_s1d0o1\TAO\orbsvcs\tests\Bug_4118_Regression\..\..\..\utils\nslist\Release\\tao_nsadd.EXE> not found
[Details] ERROR: ns_add returned -1

oci_tao-2_2_0_hornet_win7-x64_vc14_s1d1o0



[Details] ERROR: Cannot Spawn: <C:\tao_builds\jenkins\workspace\tao-2_2_0_vc14_s1d1o0\TAO\orbsvcs\tests\Bug_4118_Regression\..\..\..\utils\nslist\.\\tao_nsadd.EXE> not found
[Details] ERROR: ns_add returned -1
[Details] ERROR: Cannot Spawn: <C:\tao_builds\jenkins\workspace\tao-2_2_0_vc14_s1d1o0\TAO\orbsvcs\tests\Bug_4118_Regression\..\..\..\utils\nslist\.\\tao_nsadd.EXE> not found
[Details] ERROR: ns_add returned -1

oci_tao-2_2_0_katydid_win10-x64_vs2019_d1o0



[Details] ERROR: Cannot Spawn: <C:\tao_builds\jenkins\workspace\tao-2_2_0_vs2019_d1o0\TAO\orbsvcs\tests\Bug_4118_Regression\..\..\..\utils\nslist\.\\tao_nsadd.EXE> not found
[Details] ERROR: ns_add returned -1
[Details] ERROR: Cannot Spawn: <C:\tao_builds\jenkins\workspace\tao-2_2_0_vs2019_d1o0\TAO\orbsvcs\tests\Bug_4118_Regression\..\..\..\utils\nslist\.\\tao_nsadd.EXE> not found
[Details] ERROR: ns_add returned -1

oci_tao-2_2_0_wasp_win10-x64_vs2017_d1o0



[Details] ERROR: Cannot Spawn: <C:\tao_builds\jenkins\workspace\tao-2_2_0_vs2017_d1o0\TAO\orbsvcs\tests\Bug_4118_Regression\..\..\..\utils\nslist\.\\tao_nsadd.EXE> not found
[Details] ERROR: ns_add returned -1
[Details] ERROR: Cannot Spawn: <C:\tao_builds\jenkins\workspace\tao-2_2_0_vs2017_d1o0\TAO\orbsvcs\tests\Bug_4118_Regression\..\..\..\utils\nslist\.\\tao_nsadd.EXE> not found
[Details] ERROR: ns_add returned -1


TAO/orbsvcs/tests/EC_Mcast/run_test.pl

oci_tao-2_2_0_mosquito_linux_gcc_s1i1d0o1



[Details] ERROR: EC_Mcast timedout
[Details] ERROR: server returned -1
[Details] Error: TAO/orbsvcs/tests/EC_Mcast/run_test.pl returned with status 1


TAO/orbsvcs/tests/Event/UDP/run_test.pl

oci_tao-2_2_0_bedbug_win7-x64_vc11_d0o1



[Details] Error receiving multicasted events.

oci_tao-2_2_0_hornet_win7-x64_vc14_s1d1o0



[Details] Error receiving multicasted events.


TAO/orbsvcs/tests/FT_Naming/Replication/run_test.pl

oci_tao-2_2_0_ant_linux_gcc_s1d1o0i0



[Details] (1853|1853) EXCEPTION, Unable to resolve object from replica.
[Details] (1853|1853) EXCEPTION, Unable to resolve object from replica.

oci_tao-2_2_0_firefly_linux_gcc_s1d1o0



[Details] (1082|1082) EXCEPTION, Unable to resolve object from replica.
[Details] (1082|1082) EXCEPTION, Unable to resolve object from replica.
[Details] (1082|1082) EXCEPTION, Unable to resolve object from replica.

oci_tao-2_2_0_mealworm_linux_gcc_d0o1



[Details] (14122|14122) EXCEPTION, Unable to resolve object from replica.
[Details] (14122|14122) EXCEPTION, Unable to resolve object from replica.

oci_tao-2_2_0_mealworm_linux_gcc_d0o1b32



[Details] (1075|1075) EXCEPTION, Unable to resolve object from replica.
[Details] (1075|1075) EXCEPTION, Unable to resolve object from replica.
[Details] (1075|1075) EXCEPTION, Unable to resolve object from replica.

oci_tao-2_2_0_mosquito_linux_gcc_s1i1d0o1



[Details] (17642|17642) EXCEPTION, Unable to resolve object from replica.
[Details] (17642|17642) EXCEPTION, Unable to resolve wide context object from replica.

oci_tao-2_2_0_spider_linux_gcc_d1o0



[Details] (15822|15822) EXCEPTION, Unable to resolve wide context object from replica.

oci_tao-2_2_0_tick_linux_gcc_d0o1s1



[Details] (27599|27599) EXCEPTION, Unable to resolve wide context object from replica.

oci_tao-2_2_0_wiro_linux_gcc_d1o0s1



[Details] (1425565|1425565) EXCEPTION, Unable to resolve wide context object from replica.


TAO/orbsvcs/tests/IOR_MCast/run_test_ipv6.pl

oci_tao-2_2_0_ant_linux_gcc_s1d1o0i0



[Details] ERROR: Unable to enable multicast on specified address.
[Details] (1165|1165) EXCEPTION, client
[Details] *** Error in `/tao_builds/jenkins/workspace/oci_tao-2_2_0_ant_linux_gcc_s1d1o0i0/TAO/orbsvcs/tests/IOR_MCast/server': munmap_chunk(): invalid pointer: 0x00007fffcbef240d ***

oci_tao-2_2_0_mosquito_linux_gcc_s1i1d0o1



[Details] ERROR: Unable to enable multicast on specified address.
[Details] (16959|16959) EXCEPTION, client
[Details] *** Error in `/tao_builds/jenkins/workspace/oci_tao-2_2_0_mosquito_linux_gcc_s1i1d0o1/TAO/orbsvcs/tests/IOR_MCast/server': free(): invalid pointer: 0xbf9cd3ba ***


TAO/orbsvcs/tests/ImplRepo/Bug_4152_Regression/run_test.pl

oci_tao-2_2_0_bedbug_win7-x64_vc11_d0o1



[Details] ERROR: tao_imr start returned 4
[Details] ERROR: expected 2 server pids, got 3

oci_tao-2_2_0_cricket_win2012r2_vc10_s1d0o1



[Details] ERROR: tao_imr start returned 4
[Details] ERROR: expected 2 server pids, got 3

oci_tao-2_2_0_hornet_win7-x64_vc14_s1d1o0



[Details] ERROR: tao_imr start returned 4
[Details] ERROR: expected 2 server pids, got 3

oci_tao-2_2_0_katydid_win10-x64_vs2019_d1o0



[Details] ERROR: tao_imr start returned 4
[Details] ERROR: expected 2 server pids, got 3

oci_tao-2_2_0_wasp_win10-x64_vs2017_d1o0



[Details] ERROR: tao_imr start returned 4
[Details] ERROR: expected 2 server pids, got 3


TAO/orbsvcs/tests/ImplRepo/kill_slow_server/run_test.pl

oci_tao-2_2_0_wiro_linux_gcc_d1o0s1



[Details] ERROR: expected 2 server pids, got 1


TAO/orbsvcs/tests/ImplRepo/manual_start/run_test.pl

oci_tao-2_2_0_tick_linux_gcc_d0o1s1



[Details] (25879|25879) ERROR: No ImR_Client library available but use IMR has been specified.
[Details] (25879|25879) EXCEPTION, Server main()
[Details] ERROR: <client> exited with coredump from signal 11 : SEGV
[Details] (25888|25888) ERROR: No ImR_Client library available but use IMR has been specified.
[Details] (25888|25888) EXCEPTION, Server main()

oci_tao-2_2_0_wiro_linux_gcc_d1o0s1



[Details] (1423780|1423780) ERROR: No ImR_Client library available but use IMR has been specified.
[Details] (1423780|1423780) EXCEPTION, Server main()
[Details] ACE_ASSERT: file client.cpp, line 42 assertion failed for '!CORBA::is_nil(test.in ())'.Aborting...
[Details] ERROR: <client> exited with coredump from signal 6 : ABRT
[Details] (1423785|1423785) ERROR: No ImR_Client library available but use IMR has been specified.
[Details] (1423785|1423785) EXCEPTION, Server main()


TAO/orbsvcs/tests/ImplRepo/servers_interact_on_startup/run_test.pl

oci_tao-2_2_0_mealworm_linux_gcc_d0o1



[Details] ERROR: client timedout
[Details] ERROR: client 0 not terminated correctly
[Details] ERROR: client timedout
[Details] ERROR: client 1 not terminated correctly
[Details] Error: TAO/orbsvcs/tests/ImplRepo/servers_interact_on_startup/run_test.pl returned with status 1

oci_tao-2_2_0_mealworm_linux_gcc_d0o1b32



[Details] ERROR: client timedout
[Details] ERROR: client 0 not terminated correctly
[Details] ERROR: client timedout
[Details] ERROR: client 1 not terminated correctly
[Details] Error: TAO/orbsvcs/tests/ImplRepo/servers_interact_on_startup/run_test.pl returned with status 1


TAO/orbsvcs/tests/ImplRepo/servers_interact_on_startup/run_test.pl -delay 20 -imr_start

oci_tao-2_2_0_mealworm_linux_gcc_d0o1



[Details] ERROR: /tao_builds/jenkins/workspace/oci_tao-2_2_0_mealworm_linux_gcc_d0o1/ACE/bin/tao_imr timedout
[Details] Error: TAO/orbsvcs/tests/ImplRepo/servers_interact_on_startup/run_test.pl -delay 20 -imr_start returned with status 255

oci_tao-2_2_0_mealworm_linux_gcc_d0o1b32



[Details] ERROR: /tao_builds/jenkins/workspace/oci_tao-2_2_0_mealworm_linux_gcc_d0o1/ACE/bin/tao_imr timedout
[Details] Error: TAO/orbsvcs/tests/ImplRepo/servers_interact_on_startup/run_test.pl -delay 20 -imr_start returned with status 255


TAO/orbsvcs/tests/ImplRepo/servers_interact_on_startup/run_test.pl -multistart

oci_tao-2_2_0_bedbug_win7-x64_vc11_d0o1



[Details] ERROR: cannot find file TestObject_1.status
[Details] (6800|7316) EXCEPTION, Exception
[Details] ERROR: server timedout
[Details] ERROR: Server 2 not terminated correctly
[Details] (7612|3084) EXCEPTION, Exception
[Details] (7112|7332) EXCEPTION, Exception
[Details] ERROR: IMR returned 4294967295

oci_tao-2_2_0_cricket_win2012r2_vc10_s1d0o1



[Details] ERROR: cannot find file TestObject_1.status
[Details] (3732|2888) EXCEPTION, Exception
[Details] ERROR: server timedout
[Details] ERROR: Server 2 not terminated correctly
[Details] (2504|5892) EXCEPTION, Exception
[Details] (5668|1528) EXCEPTION, Exception
[Details] ERROR: IMR returned 4294967295

oci_tao-2_2_0_mealworm_linux_gcc_d0o1



[Details] ERROR: /tao_builds/jenkins/workspace/oci_tao-2_2_0_mealworm_linux_gcc_d0o1/ACE/bin/tao_imr timedout
[Details] ERROR: /tao_builds/jenkins/workspace/oci_tao-2_2_0_mealworm_linux_gcc_d0o1/ACE/bin/tao_imr timedout
[Details] ERROR: /tao_builds/jenkins/workspace/oci_tao-2_2_0_mealworm_linux_gcc_d0o1/ACE/bin/tao_imr timedout
[Details] ERROR: cannot find file TestObject_1.status
[Details] (12250|12250) EXCEPTION, Exception
[Details] ERROR: server timedout
[Details] ERROR: Server 2 not terminated correctly
[Details] (12255|12255) EXCEPTION, Exception
[Details] (12256|12256) EXCEPTION, Exception
[Details] Error: TAO/orbsvcs/tests/ImplRepo/servers_interact_on_startup/run_test.pl -multistart returned with status 1

oci_tao-2_2_0_mealworm_linux_gcc_d0o1b32



[Details] ERROR: /tao_builds/jenkins/workspace/oci_tao-2_2_0_mealworm_linux_gcc_d0o1/ACE/bin/tao_imr timedout
[Details] ERROR: /tao_builds/jenkins/workspace/oci_tao-2_2_0_mealworm_linux_gcc_d0o1/ACE/bin/tao_imr timedout
[Details] ERROR: /tao_builds/jenkins/workspace/oci_tao-2_2_0_mealworm_linux_gcc_d0o1/ACE/bin/tao_imr timedout
[Details] ERROR: cannot find file TestObject_1.status
[Details] (31701|31701) EXCEPTION, Exception
[Details] ERROR: server timedout
[Details] ERROR: Server 2 not terminated correctly
[Details] (31709|31709) EXCEPTION, Exception
[Details] (31710|31710) EXCEPTION, Exception
[Details] Error: TAO/orbsvcs/tests/ImplRepo/servers_interact_on_startup/run_test.pl -multistart returned with status 1


TAO/orbsvcs/tests/InterfaceRepo/Persistence_Test/run_test.pl

oci_tao-2_2_0_ant_linux_gcc_s1d1o0i0



[Details] (31113|31113) EXCEPTION, Ptest::run
[Details] ERROR: <Persistence_Test> failed: No such file or directory
[Details] ERROR: client returned 255
[Details] ERROR: <../../../IFR_Service/tao_ifr_service> exited with coredump from signal 11 : SEGV
[Details] Program terminated with signal 11, Segmentation fault.
[Details] ERROR: server returned 255
[Details] Error: TAO/orbsvcs/tests/InterfaceRepo/Persistence_Test/run_test.pl returned with status 1

oci_tao-2_2_0_bedbug_win7-x64_vc11_d0o1



[Details] (6788|2428) ERROR: ACCESS VIOLATION
[Details] (5052|8148) EXCEPTION, Ptest::run
[Details] ERROR: client returned 4294967295
[Details] ERROR: server returned 3221225477

oci_tao-2_2_0_cricket_win2012r2_vc10_s1d0o1



[Details] (3672|3688) ERROR: ACCESS VIOLATION
[Details] (4768|2376) EXCEPTION, Ptest::run
[Details] ERROR: client returned 4294967295
[Details] ERROR: server returned 3221225477

oci_tao-2_2_0_firefly_linux_gcc_s1d1o0



[Details] (30348|30348) EXCEPTION, Ptest::run
[Details] ERROR: <Persistence_Test> failed: No such file or directory
[Details] ERROR: client returned 255
[Details] ERROR: <../../../IFR_Service/tao_ifr_service> exited with coredump from signal 11 : SEGV
[Details] Program terminated with signal SIGSEGV, Segmentation fault.
[Details] ERROR: server returned 255
[Details] Error: TAO/orbsvcs/tests/InterfaceRepo/Persistence_Test/run_test.pl returned with status 1

oci_tao-2_2_0_hornet_win7-x64_vc14_s1d1o0



[Details] (5588|5516) ERROR: ACCESS VIOLATION
[Details] (2228|6500) EXCEPTION, Ptest::run
[Details] ERROR: client returned 4294967295
[Details] ERROR: server returned 3221225477

oci_tao-2_2_0_katydid_win10-x64_vs2019_d1o0



[Details] (8952|8780) ERROR: ACCESS VIOLATION
[Details] (3552|4200) EXCEPTION, Ptest::run
[Details] ERROR: client returned 4294967295
[Details] ERROR: server returned 3221225477

oci_tao-2_2_0_mealworm_linux_gcc_d0o1



[Details] (11297|11297) EXCEPTION, Ptest::run
[Details] ERROR: <Persistence_Test> failed: No such file or directory
[Details] ERROR: client returned 255
[Details] ERROR: <../../../IFR_Service/tao_ifr_service> exited with coredump from signal 11 : SEGV
[Details] ERROR: server returned 255
[Details] Error: TAO/orbsvcs/tests/InterfaceRepo/Persistence_Test/run_test.pl returned with status 1

oci_tao-2_2_0_mealworm_linux_gcc_d0o1b32



[Details] (30747|30747) EXCEPTION, Ptest::run
[Details] ERROR: <Persistence_Test> failed: No such file or directory
[Details] ERROR: client returned 255
[Details] ERROR: <../../../IFR_Service/tao_ifr_service> exited with coredump from signal 11 : SEGV
[Details] ERROR: server returned 255
[Details] Error: TAO/orbsvcs/tests/InterfaceRepo/Persistence_Test/run_test.pl returned with status 1

oci_tao-2_2_0_mosquito_linux_gcc_s1i1d0o1



[Details] (14565|14565) EXCEPTION, Ptest::run
[Details] ERROR: <Persistence_Test> failed: No such file or directory
[Details] ERROR: client returned 255
[Details] ERROR: <../../../IFR_Service/tao_ifr_service> exited with coredump from signal 11 : SEGV
[Details] Program terminated with signal SIGSEGV, Segmentation fault.
[Details] ERROR: server returned 255
[Details] Error: TAO/orbsvcs/tests/InterfaceRepo/Persistence_Test/run_test.pl returned with status 1

oci_tao-2_2_0_spider_linux_gcc_d1o0



[Details] (12931|12931) EXCEPTION, Ptest::run
[Details] ERROR: <Persistence_Test> failed: No such file or directory
[Details] ERROR: client returned 255
[Details] ERROR: <../../../IFR_Service/tao_ifr_service> exited with coredump from signal 11 : SEGV
[Details] Program terminated with signal 11, Segmentation fault.
[Details] ERROR: server returned 255
[Details] Error: TAO/orbsvcs/tests/InterfaceRepo/Persistence_Test/run_test.pl returned with status 1

oci_tao-2_2_0_tick_linux_gcc_d0o1s1



[Details] (25274|25274) EXCEPTION, Ptest::run
[Details] ERROR: <Persistence_Test> failed: No such file or directory
[Details] ERROR: client returned 255
[Details] ERROR: <../../../IFR_Service/tao_ifr_service> exited with coredump from signal 11 : SEGV
[Details] ERROR: server returned 255
[Details] Error: TAO/orbsvcs/tests/InterfaceRepo/Persistence_Test/run_test.pl returned with status 1

oci_tao-2_2_0_wasp_win10-x64_vs2017_d1o0



[Details] (7952|2264) ERROR: ACCESS VIOLATION
[Details] (216|988) EXCEPTION, Ptest::run
[Details] ERROR: client returned 4294967295
[Details] ERROR: server returned 3221225477

oci_tao-2_2_0_wiro_linux_gcc_d1o0s1



[Details] (1423153|1423153) EXCEPTION, Ptest::run
[Details] ERROR: <Persistence_Test> failed: No such file or directory
[Details] ERROR: client returned 255
[Details] ERROR: <../../../IFR_Service/tao_ifr_service> exited with coredump from signal 11 : SEGV
[Details] ERROR: server returned 255
[Details] Error: TAO/orbsvcs/tests/InterfaceRepo/Persistence_Test/run_test.pl returned with status 1


TAO/orbsvcs/tests/InterfaceRepo/Union_Forward_Test/run_test.pl

oci_tao-2_2_0_tick_linux_gcc_d0o1s1



[Details] (25285|25285) EXCEPTION, ERROR : unexpected CORBA exception caugth :
[Details] ERROR: client returned 1
[Details] Error: TAO/orbsvcs/tests/InterfaceRepo/Union_Forward_Test/run_test.pl returned with status 1

oci_tao-2_2_0_wiro_linux_gcc_d1o0s1



[Details] (1423160|1423160) EXCEPTION, ERROR : unexpected CORBA exception caugth :
[Details] ERROR: client returned 1
[Details] Error: TAO/orbsvcs/tests/InterfaceRepo/Union_Forward_Test/run_test.pl returned with status 1


TAO/orbsvcs/tests/Notify/Basic/run_test.pl notify.mt.conf

oci_tao-2_2_0_wasp_win10-x64_vs2017_d1o0



[Details] ERROR: ./Simple timedout
[Details] ERROR: Simple returned -1


TAO/orbsvcs/tests/Notify/Basic/run_test_ipv6.pl notify.mt.conf

oci_tao-2_2_0_ant_linux_gcc_s1d1o0i0



[Details] (32538|32538) EXCEPTION, Error:
[Details] ERROR: AdminProperties returned 1
[Details] (32539|32539) EXCEPTION, Error:
[Details] ERROR: ConnectDisconnect returned 1
[Details] (32540|32540) EXCEPTION, Error:
[Details] ERROR: Events returned 1
[Details] (32541|32541) EXCEPTION, Error:
[Details] ERROR: IdAssignment returned 1
[Details] (32542|32542) EXCEPTION, Error:
[Details] ERROR: LifeCycle returned 1
[Details] (32543|32543) EXCEPTION, Error:
[Details] ERROR: Simple returned 1
[Details] (32545|32545) EXCEPTION, Error:
[Details] ERROR: MultiTypes returned 1
[Details] (32546|32546) EXCEPTION, Error:
[Details] ERROR: Filter returned 1
[Details] (32547|32547) EXCEPTION, Error:
[Details] ERROR: Updates returned 1
[Details] (32549|32549) EXCEPTION, Error:
[Details] ERROR: Sequence returned 1
[Details] (32552|32552) EXCEPTION, Error:
[Details] ERROR: AdminProperties returned 1
[Details] (32553|32553) EXCEPTION, Error:
[Details] ERROR: ConnectDisconnect returned 1
[Details] (32554|32554) EXCEPTION, Error:
[Details] ERROR: Events returned 1
[Details] (32555|32555) EXCEPTION, Error:
[Details] ERROR: IdAssignment returned 1
[Details] (32556|32556) EXCEPTION, Error:
[Details] ERROR: LifeCycle returned 1
[Details] (32557|32557) EXCEPTION, Error:
[Details] ERROR: Simple returned 1
[Details] (32558|32558) EXCEPTION, Error:
[Details] ERROR: MultiTypes returned 1
[Details] (32559|32559) EXCEPTION, Error:
[Details] ERROR: Filter returned 1
[Details] (32560|32560) EXCEPTION, Error:
[Details] ERROR: Updates returned 1
[Details] (32561|32561) EXCEPTION, Error:
[Details] ERROR: Sequence returned 1

oci_tao-2_2_0_mosquito_linux_gcc_s1i1d0o1



[Details] (15946|15946) EXCEPTION, Error:
[Details] ERROR: AdminProperties returned 1
[Details] (15947|15947) EXCEPTION, Error:
[Details] ERROR: ConnectDisconnect returned 1
[Details] (15948|15948) EXCEPTION, Error:
[Details] ERROR: Events returned 1
[Details] (15949|15949) EXCEPTION, Error:
[Details] ERROR: IdAssignment returned 1
[Details] (15950|15950) EXCEPTION, Error:
[Details] ERROR: LifeCycle returned 1
[Details] (15951|15951) EXCEPTION, Error:
[Details] ERROR: Simple returned 1
[Details] (15952|15952) EXCEPTION, Error:
[Details] ERROR: MultiTypes returned 1
[Details] (15954|15954) EXCEPTION, Error:
[Details] ERROR: Filter returned 1
[Details] (15955|15955) EXCEPTION, Error:
[Details] ERROR: Updates returned 1
[Details] (15956|15956) EXCEPTION, Error:
[Details] ERROR: Sequence returned 1
[Details] (15959|15959) EXCEPTION, Error:
[Details] ERROR: AdminProperties returned 1
[Details] (15960|15960) EXCEPTION, Error:
[Details] ERROR: ConnectDisconnect returned 1
[Details] (15961|15961) EXCEPTION, Error:
[Details] ERROR: Events returned 1
[Details] (15962|15962) EXCEPTION, Error:
[Details] ERROR: IdAssignment returned 1
[Details] (15963|15963) EXCEPTION, Error:
[Details] ERROR: LifeCycle returned 1
[Details] (15964|15964) EXCEPTION, Error:
[Details] ERROR: Simple returned 1
[Details] (15965|15965) EXCEPTION, Error:
[Details] ERROR: MultiTypes returned 1
[Details] (15966|15966) EXCEPTION, Error:
[Details] ERROR: Filter returned 1
[Details] (15967|15967) EXCEPTION, Error:
[Details] ERROR: Updates returned 1
[Details] (15968|15968) EXCEPTION, Error:
[Details] ERROR: Sequence returned 1


TAO/orbsvcs/tests/Notify/Basic/run_test_ipv6.pl notify.reactive.conf

oci_tao-2_2_0_ant_linux_gcc_s1d1o0i0



[Details] (32159|32159) EXCEPTION, Error:
[Details] ERROR: ConnectDisconnect returned 1
[Details] (32160|32160) EXCEPTION, Error:
[Details] ERROR: Events returned 1
[Details] (32161|32161) EXCEPTION, Error:
[Details] ERROR: IdAssignment returned 1
[Details] (32162|32162) EXCEPTION, Error:
[Details] ERROR: LifeCycle returned 1
[Details] (32163|32163) EXCEPTION, Error:
[Details] ERROR: Simple returned 1
[Details] (32164|32164) EXCEPTION, Error:
[Details] ERROR: MultiTypes returned 1
[Details] (32165|32165) EXCEPTION, Error:
[Details] ERROR: Filter returned 1
[Details] (32166|32166) EXCEPTION, Error:
[Details] ERROR: Updates returned 1
[Details] (32167|32167) EXCEPTION, Error:
[Details] ERROR: Sequence returned 1

oci_tao-2_2_0_mosquito_linux_gcc_s1i1d0o1



[Details] (15566|15566) EXCEPTION, Error:
[Details] ERROR: ConnectDisconnect returned 1
[Details] (15567|15567) EXCEPTION, Error:
[Details] ERROR: Events returned 1
[Details] (15568|15568) EXCEPTION, Error:
[Details] ERROR: IdAssignment returned 1
[Details] (15569|15569) EXCEPTION, Error:
[Details] ERROR: LifeCycle returned 1
[Details] (15570|15570) EXCEPTION, Error:
[Details] ERROR: Simple returned 1
[Details] (15571|15571) EXCEPTION, Error:
[Details] ERROR: MultiTypes returned 1
[Details] (15572|15572) EXCEPTION, Error:
[Details] ERROR: Filter returned 1
[Details] (15573|15573) EXCEPTION, Error:
[Details] ERROR: Updates returned 1
[Details] (15574|15574) EXCEPTION, Error:
[Details] ERROR: Sequence returned 1


TAO/orbsvcs/tests/Notify/Basic/run_test_ipv6.pl notify.rt.conf

oci_tao-2_2_0_ant_linux_gcc_s1d1o0i0



[Details] (32580|32580) EXCEPTION, Error:
[Details] ERROR: ConnectDisconnect returned 1
[Details] (32581|32581) EXCEPTION, Error:
[Details] ERROR: Events returned 1
[Details] (32582|32582) EXCEPTION, Error:
[Details] ERROR: IdAssignment returned 1
[Details] (32583|32583) EXCEPTION, Error:
[Details] ERROR: LifeCycle returned 1
[Details] (32584|32584) EXCEPTION, Error:
[Details] ERROR: Simple returned 1
[Details] (32585|32585) EXCEPTION, Error:
[Details] ERROR: MultiTypes returned 1
[Details] (32586|32586) EXCEPTION, Error:
[Details] ERROR: Filter returned 1
[Details] (32588|32588) EXCEPTION, Error:
[Details] ERROR: Updates returned 1
[Details] (32589|32589) EXCEPTION, Error:
[Details] ERROR: Sequence returned 1

oci_tao-2_2_0_mosquito_linux_gcc_s1i1d0o1



[Details] (15988|15988) EXCEPTION, Error:
[Details] ERROR: ConnectDisconnect returned 1
[Details] (15989|15989) EXCEPTION, Error:
[Details] ERROR: Events returned 1
[Details] (15990|15990) EXCEPTION, Error:
[Details] ERROR: IdAssignment returned 1
[Details] (15991|15991) EXCEPTION, Error:
[Details] ERROR: LifeCycle returned 1
[Details] (15992|15992) EXCEPTION, Error:
[Details] ERROR: Simple returned 1
[Details] (15993|15993) EXCEPTION, Error:
[Details] ERROR: MultiTypes returned 1
[Details] (15994|15994) EXCEPTION, Error:
[Details] ERROR: Filter returned 1
[Details] (15995|15995) EXCEPTION, Error:
[Details] ERROR: Updates returned 1
[Details] (15996|15996) EXCEPTION, Error:
[Details] ERROR: Sequence returned 1


TAO/orbsvcs/tests/Notify/Persistent_Filter/run_test.pl

oci_tao-2_2_0_bedbug_win7-x64_vc11_d0o1



[Details] (5532|3436) EXCEPTION, Consumer system error:
[Details] ERROR: Consumer returned 1


TAO/orbsvcs/tests/Notify/Sequence_Multi_Filter/run_test.pl

oci_tao-2_2_0_bedbug_win7-x64_vc11_d0o1



[Details] ERROR: Sequence_Consumer timedout
[Details] ERROR: Consumer returned -1
[Details] ERROR: <Sequence_Supplier> still running upon object destruction


TAO/orbsvcs/tests/Notify/Structured_Multi_Filter/run_test.pl

oci_tao-2_2_0_cricket_win2012r2_vc10_s1d0o1



[Details] (5580|5652) EXCEPTION,
[Details] Error: Consumer:
[Details] ERROR: Consumer returned 1
[Details] ERROR: <Structured_Supplier> still running upon object destruction


TAO/orbsvcs/tests/Notify/Timeout/run_test.pl

oci_tao-2_2_0_tick_linux_gcc_d0o1s1



[Details] ERROR: ../../../Notify_Service/tao_cosnotification timedout
[Details] ERROR: Notification Service returned -1
[Details] Error: TAO/orbsvcs/tests/Notify/Timeout/run_test.pl returned with status 1

oci_tao-2_2_0_wiro_linux_gcc_d1o0s1



[Details] ERROR: ../../../Notify_Service/tao_cosnotification timedout
[Details] 57 ./nptl/futex-internal.c: No such file or directory.
[Details] ERROR: Notification Service returned -1
[Details] Error: TAO/orbsvcs/tests/Notify/Timeout/run_test.pl returned with status 1


TAO/orbsvcs/tests/Redundant_Naming/run_test.pl

oci_tao-2_2_0_ant_linux_gcc_s1d1o0i0



[Details] ERROR: /tao_builds/jenkins/workspace/oci_tao-2_2_0_ant_linux_gcc_s1d1o0i0/TAO/orbsvcs/tests/Redundant_Naming/client timedout
[Details] ERROR: client returned -1
[Details] Error: TAO/orbsvcs/tests/Redundant_Naming/run_test.pl returned with status 1

oci_tao-2_2_0_spider_linux_gcc_d1o0



[Details] ERROR: /tao_builds/jenkins/workspace/oci_tao-2_2_0_spider_linux_gcc_d1o0/TAO/orbsvcs/tests/Redundant_Naming/client timedout
[Details] ERROR: client returned -1
[Details] Error: TAO/orbsvcs/tests/Redundant_Naming/run_test.pl returned with status 1

oci_tao-2_2_0_wiro_linux_gcc_d1o0s1



[Details] (1422968|1422968) EXCEPTION, Unable to resolve object from redundant server
[Details] ERROR: </tao_builds/jenkins/workspace/oci_tao-2_2_0_wiro_linux_gcc_d1o0s1/TAO/orbsvcs/tests/Redundant_Naming/client> failed: No such file or directory
[Details] ERROR: client returned 255
[Details] Error: TAO/orbsvcs/tests/Redundant_Naming/run_test.pl returned with status 1


TAO/orbsvcs/tests/Security/BiDirectional/run_test.pl

oci_tao-2_2_0_mosquito_linux_gcc_s1i1d0o1



[Details] ERROR: client timedout
[Details] ERROR: client returned -1
[Details] ERROR: <server> exited with coredump from signal 6 : ABRT
[Details] ERROR: server returned 255
[Details] Error: TAO/orbsvcs/tests/Security/BiDirectional/run_test.pl returned with status 1


TAO/orbsvcs/tests/Security/BiDirectional/run_test.pl -ecdh

oci_tao-2_2_0_mosquito_linux_gcc_s1i1d0o1



[Details] ERROR: client timedout
[Details] ERROR: client returned -1
[Details] ERROR: <server> exited with coredump from signal 6 : ABRT
[Details] ERROR: server returned 255
[Details] Error: TAO/orbsvcs/tests/Security/BiDirectional/run_test.pl -ecdh returned with status 1


TAO/orbsvcs/tests/Security/Big_Request/run_test.pl

oci_tao-2_2_0_ant_linux_gcc_s1d1o0i0



[Details] ACE_SSL (762|763) error code: 336151573 - error:14094415:SSL routines:SSL3_READ_BYTES:sslv3 alert certificate expired
[Details] (764|764) EXCEPTION, ERROR
[Details] ERROR: <client> failed: No such file or directory
[Details] ERROR: client returned 255
[Details] ERROR: server timedout
[Details] ERROR: server returned -1
[Details] Error: TAO/orbsvcs/tests/Security/Big_Request/run_test.pl returned with status 1

oci_tao-2_2_0_cricket_win2012r2_vc10_s1d0o1



[Details] (3944|4496) EXCEPTION, ERROR
[Details] ERROR: client returned 4294967295
[Details] ERROR: server timedout
[Details] ERROR: server returned -1

oci_tao-2_2_0_firefly_linux_gcc_s1d1o0



[Details] (32375|32375) EXCEPTION, ERROR
[Details] ERROR: <client> failed: No such file or directory
[Details] ERROR: client returned 255
[Details] ERROR: server timedout
[Details] ERROR: server returned -1
[Details] Error: TAO/orbsvcs/tests/Security/Big_Request/run_test.pl returned with status 1

oci_tao-2_2_0_hornet_win7-x64_vc14_s1d1o0



[Details] (3240|6248) EXCEPTION, ERROR
[Details] ERROR: client returned 4294967295
[Details] ERROR: server timedout
[Details] ERROR: server returned -1

oci_tao-2_2_0_mosquito_linux_gcc_s1i1d0o1



[Details] (16563|16563) EXCEPTION, ERROR
[Details] ERROR: <client> failed: No such file or directory
[Details] ERROR: client returned 255
[Details] ERROR: server timedout
[Details] ERROR: server returned -1
[Details] Error: TAO/orbsvcs/tests/Security/Big_Request/run_test.pl returned with status 1

oci_tao-2_2_0_spider_linux_gcc_d1o0



[Details] (14903|14903) EXCEPTION, ERROR
[Details] ERROR: <client> failed: No such file or directory
[Details] ERROR: client returned 255
[Details] ERROR: server timedout
[Details] ERROR: server returned -1
[Details] Error: TAO/orbsvcs/tests/Security/Big_Request/run_test.pl returned with status 1


TAO/orbsvcs/tests/Security/Bug_1107_Regression/run_test.pl

oci_tao-2_2_0_ant_linux_gcc_s1d1o0i0



[Details] (750|750) EXCEPTION, Caught unexpected exception (probable failure):
[Details] ERROR: client returned 1
[Details] ERROR: server timedout
[Details] ERROR: server returned -1
[Details] Error: TAO/orbsvcs/tests/Security/Bug_1107_Regression/run_test.pl returned with status 1

oci_tao-2_2_0_cricket_win2012r2_vc10_s1d0o1



[Details] (5440|2980) EXCEPTION, Caught unexpected exception (probable failure):
[Details] ERROR: client returned 1
[Details] ERROR: server timedout
[Details] ERROR: server returned -1

oci_tao-2_2_0_firefly_linux_gcc_s1d1o0



[Details] (32359|32359) EXCEPTION, Caught unexpected exception (probable failure):
[Details] ERROR: client returned 1
[Details] ERROR: server timedout
[Details] ERROR: server returned -1
[Details] Error: TAO/orbsvcs/tests/Security/Bug_1107_Regression/run_test.pl returned with status 1

oci_tao-2_2_0_hornet_win7-x64_vc14_s1d1o0



[Details] (2812|4724) EXCEPTION, Caught unexpected exception (probable failure):
[Details] ERROR: client returned 1
[Details] ERROR: server timedout
[Details] ERROR: server returned -1

oci_tao-2_2_0_mosquito_linux_gcc_s1i1d0o1



[Details] (16549|16549) EXCEPTION, Caught unexpected exception (probable failure):
[Details] ERROR: client returned 1
[Details] ERROR: server timedout
[Details] ERROR: server returned -1
[Details] Error: TAO/orbsvcs/tests/Security/Bug_1107_Regression/run_test.pl returned with status 1

oci_tao-2_2_0_spider_linux_gcc_d1o0



[Details] (14889|14889) EXCEPTION, Caught unexpected exception (probable failure):
[Details] ERROR: client returned 1
[Details] ERROR: server timedout
[Details] ERROR: server returned -1
[Details] Error: TAO/orbsvcs/tests/Security/Bug_1107_Regression/run_test.pl returned with status 1


TAO/orbsvcs/tests/Security/Callback/run_test.pl

oci_tao-2_2_0_ant_linux_gcc_s1d1o0i0



[Details] ACE_SSL (779|779) error code: 336151573 - error:14094415:SSL routines:SSL3_READ_BYTES:sslv3 alert certificate expired
[Details] (780|780) EXCEPTION, Caught exception
[Details] ERROR: <client> failed: No such file or directory
[Details] ERROR: client returned 255
[Details] ERROR: server timedout
[Details] ERROR: server returned -1
[Details] Error: TAO/orbsvcs/tests/Security/Callback/run_test.pl returned with status 1

oci_tao-2_2_0_cricket_win2012r2_vc10_s1d0o1



[Details] (1736|5256) EXCEPTION, Caught exception
[Details] ERROR: client returned 4294967295
[Details] ERROR: server timedout
[Details] ERROR: server returned -1

oci_tao-2_2_0_firefly_linux_gcc_s1d1o0



[Details] (32391|32391) EXCEPTION, Caught exception
[Details] ERROR: <client> failed: No such file or directory
[Details] ERROR: client returned 255
[Details] ERROR: server timedout
[Details] ERROR: server returned -1
[Details] Error: TAO/orbsvcs/tests/Security/Callback/run_test.pl returned with status 1

oci_tao-2_2_0_hornet_win7-x64_vc14_s1d1o0



[Details] (7024|4104) EXCEPTION, Caught exception
[Details] ERROR: client returned 4294967295
[Details] ERROR: server timedout
[Details] ERROR: server returned -1

oci_tao-2_2_0_mosquito_linux_gcc_s1i1d0o1



[Details] (16600|16600) EXCEPTION, Caught exception
[Details] ERROR: <client> failed: No such file or directory
[Details] ERROR: client returned 255
[Details] ERROR: server timedout
[Details] ERROR: server returned -1
[Details] Error: TAO/orbsvcs/tests/Security/Callback/run_test.pl returned with status 1

oci_tao-2_2_0_spider_linux_gcc_d1o0



[Details] (14917|14917) EXCEPTION, Caught exception
[Details] ERROR: <client> failed: No such file or directory
[Details] ERROR: client returned 255
[Details] ERROR: server timedout
[Details] ERROR: server returned -1
[Details] Error: TAO/orbsvcs/tests/Security/Callback/run_test.pl returned with status 1


TAO/orbsvcs/tests/Security/Crash_Test/run_test.pl

oci_tao-2_2_0_ant_linux_gcc_s1d1o0i0



[Details] ACE_SSL (861|861) error code: 336151573 - error:14094415:SSL routines:SSL3_READ_BYTES:sslv3 alert certificate expired
[Details] ACE_SSL (861|861) error code: 336151573 - error:14094415:SSL routines:SSL3_READ_BYTES:sslv3 alert certificate expired
[Details] ACE_SSL (861|861) error code: 336151573 - error:14094415:SSL routines:SSL3_READ_BYTES:sslv3 alert certificate expired
[Details] ACE_SSL (866|866) error code: 336151573 - error:14094415:SSL routines:SSL3_READ_BYTES:sslv3 alert certificate expired
[Details] (862|862) EXCEPTION, CLIENT (%P): Caught exception:
[Details] (864|864) EXCEPTION, CLIENT (%P): Caught exception:
[Details] ACE_SSL (866|866) error code: 336151573 - error:14094415:SSL routines:SSL3_READ_BYTES:sslv3 alert certificate expired
[Details] ACE_SSL (866|866) error code: 336151573 - error:14094415:SSL routines:SSL3_READ_BYTES:sslv3 alert certificate expired
[Details] (863|863) EXCEPTION, CLIENT (%P): Caught exception:
[Details] ERROR: Stopping client #1 returned 1
[Details] ERROR: Stopping client #2 returned 1
[Details] ERROR: Stopping client #3 returned 1
[Details] ERROR: server timedout
[Details] ERROR: server returned -1
[Details] Error: TAO/orbsvcs/tests/Security/Crash_Test/run_test.pl returned with status 1

oci_tao-2_2_0_cricket_win2012r2_vc10_s1d0o1



[Details] (5324|5008) EXCEPTION, CLIENT (%P): Caught exception:
[Details] (4208|4308) EXCEPTION, CLIENT (%P): Caught exception:
[Details] (5240|940) EXCEPTION, CLIENT (%P): Caught exception:
[Details] ERROR: Stopping client #1 returned 1
[Details] ERROR: Stopping client #2 returned 1
[Details] ERROR: Stopping client #3 returned 1
[Details] ERROR: server timedout
[Details] ERROR: server returned -1

oci_tao-2_2_0_firefly_linux_gcc_s1d1o0



[Details] (32467|32467) EXCEPTION, CLIENT (%P): Caught exception:
[Details] (32468|32468) EXCEPTION, CLIENT (%P): Caught exception:
[Details] (32469|32469) EXCEPTION, CLIENT (%P): Caught exception:
[Details] ERROR: Stopping client #1 returned 1
[Details] ERROR: Stopping client #2 returned 1
[Details] ERROR: Stopping client #3 returned 1
[Details] ERROR: server timedout
[Details] ERROR: server returned -1
[Details] Error: TAO/orbsvcs/tests/Security/Crash_Test/run_test.pl returned with status 1

oci_tao-2_2_0_hornet_win7-x64_vc14_s1d1o0



[Details] (4036|5740) EXCEPTION, CLIENT (%P): Caught exception:
[Details] (6280|4412) EXCEPTION, CLIENT (%P): Caught exception:
[Details] (2340|5940) EXCEPTION, CLIENT (%P): Caught exception:
[Details] ERROR: Stopping client #1 returned 1
[Details] ERROR: Stopping client #2 returned 1
[Details] ERROR: Stopping client #3 returned 1
[Details] ERROR: server timedout
[Details] ERROR: server returned -1

oci_tao-2_2_0_mosquito_linux_gcc_s1i1d0o1



[Details] (16691|16691) EXCEPTION, CLIENT (%P): Caught exception:
[Details] (16690|16690) EXCEPTION, CLIENT (%P): Caught exception:
[Details] (16692|16692) EXCEPTION, CLIENT (%P): Caught exception:
[Details] ERROR: Stopping client #1 returned 1
[Details] ERROR: Stopping client #2 returned 1
[Details] ERROR: Stopping client #3 returned 1
[Details] ERROR: server timedout
[Details] ERROR: server returned -1
[Details] Error: TAO/orbsvcs/tests/Security/Crash_Test/run_test.pl returned with status 1

oci_tao-2_2_0_spider_linux_gcc_d1o0



[Details] (15014|15014) EXCEPTION, CLIENT (%P): Caught exception:
[Details] (15012|15012) EXCEPTION, CLIENT (%P): Caught exception:
[Details] (15013|15013) EXCEPTION, CLIENT (%P): Caught exception:
[Details] ERROR: Stopping client #1 returned 1
[Details] ERROR: Stopping client #2 returned 1
[Details] ERROR: Stopping client #3 returned 1
[Details] ERROR: server timedout
[Details] ERROR: server returned -1
[Details] Error: TAO/orbsvcs/tests/Security/Crash_Test/run_test.pl returned with status 1


TAO/orbsvcs/tests/Security/MT_BiDir_SSL/run_test.pl

oci_tao-2_2_0_mosquito_linux_gcc_s1i1d0o1



[Details] (16718|16720) ERROR: New connections have been created
[Details] (16718|16720) ERROR: We will crash now...
[Details] ERROR: <server> exited with coredump from signal 6 : ABRT
[Details] ERROR: server returned 255
[Details] Error: TAO/orbsvcs/tests/Security/MT_BiDir_SSL/run_test.pl returned with status 1


TAO/orbsvcs/tests/Security/Null_Cipher/run_test.pl

oci_tao-2_2_0_ant_linux_gcc_s1d1o0i0



[Details] ACE_SSL (879|879) error code: 336151573 - error:14094415:SSL routines:SSL3_READ_BYTES:sslv3 alert certificate expired
[Details] (880|880) EXCEPTION, Caught exception:
[Details] ERROR: client returned 1
[Details] ERROR: server timedout
[Details] ERROR: server returned -1
[Details] Error: TAO/orbsvcs/tests/Security/Null_Cipher/run_test.pl returned with status 1

oci_tao-2_2_0_cricket_win2012r2_vc10_s1d0o1



[Details] (4200|3724) EXCEPTION, Caught exception:
[Details] ERROR: client returned 1
[Details] ERROR: server timedout
[Details] ERROR: server returned -1

oci_tao-2_2_0_firefly_linux_gcc_s1d1o0



[Details] (32485|32485) EXCEPTION, Caught exception:
[Details] ERROR: client returned 1
[Details] ERROR: server timedout
[Details] ERROR: server returned -1
[Details] Error: TAO/orbsvcs/tests/Security/Null_Cipher/run_test.pl returned with status 1

oci_tao-2_2_0_hornet_win7-x64_vc14_s1d1o0



[Details] (6908|3740) EXCEPTION, Caught exception:
[Details] ERROR: client returned 1
[Details] ERROR: server timedout
[Details] ERROR: server returned -1

oci_tao-2_2_0_mosquito_linux_gcc_s1i1d0o1



[Details] (16710|16710) EXCEPTION, Caught exception:
[Details] ERROR: client returned 1
[Details] ERROR: server timedout
[Details] ERROR: server returned -1
[Details] Error: TAO/orbsvcs/tests/Security/Null_Cipher/run_test.pl returned with status 1

oci_tao-2_2_0_spider_linux_gcc_d1o0



[Details] (15033|15033) EXCEPTION, Caught exception:
[Details] ERROR: client returned 1
[Details] ERROR: server timedout
[Details] ERROR: server returned -1
[Details] Error: TAO/orbsvcs/tests/Security/Null_Cipher/run_test.pl returned with status 1


TAO/orbsvcs/tests/Security/Secure_Invocation/run_test.pl

oci_tao-2_2_0_ant_linux_gcc_s1d1o0i0



[Details] ACE_SSL (738|738) error code: 336151573 - error:14094415:SSL routines:SSL3_READ_BYTES:sslv3 alert certificate expired
[Details] (739|739) EXCEPTION, Caught exception:
[Details] ERROR: client returned 1
[Details] ERROR: server timedout
[Details] ERROR: server returned -1
[Details] Error: TAO/orbsvcs/tests/Security/Secure_Invocation/run_test.pl returned with status 1

oci_tao-2_2_0_cricket_win2012r2_vc10_s1d0o1



[Details] (4148|960) EXCEPTION, Caught exception:
[Details] ERROR: client returned 1
[Details] ERROR: server timedout
[Details] ERROR: server returned -1

oci_tao-2_2_0_firefly_linux_gcc_s1d1o0



[Details] (32346|32346) EXCEPTION, Caught exception:
[Details] ERROR: client returned 1
[Details] ERROR: server timedout
[Details] ERROR: server returned -1
[Details] Error: TAO/orbsvcs/tests/Security/Secure_Invocation/run_test.pl returned with status 1

oci_tao-2_2_0_hornet_win7-x64_vc14_s1d1o0



[Details] (3560|1976) EXCEPTION, Caught exception:
[Details] ERROR: client returned 1
[Details] ERROR: server timedout
[Details] ERROR: server returned -1

oci_tao-2_2_0_mosquito_linux_gcc_s1i1d0o1



[Details] (16536|16536) EXCEPTION, Caught exception:
[Details] ERROR: client returned 1
[Details] ERROR: server timedout
[Details] ERROR: server returned -1
[Details] Error: TAO/orbsvcs/tests/Security/Secure_Invocation/run_test.pl returned with status 1

oci_tao-2_2_0_spider_linux_gcc_d1o0



[Details] (14878|14878) EXCEPTION, Caught exception:
[Details] ERROR: client returned 1
[Details] ERROR: server timedout
[Details] ERROR: server returned -1
[Details] Error: TAO/orbsvcs/tests/Security/Secure_Invocation/run_test.pl returned with status 1


TAO/orbsvcs/tests/Trading/run_test.pl

oci_tao-2_2_0_bedbug_win7-x64_vc11_d0o1



[Details] (4140|856) EXCEPTION, TAO_Offer_Importer::perform_queries
[Details] ERROR: client returned 4294967295

oci_tao-2_2_0_cricket_win2012r2_vc10_s1d0o1



[Details] (4916|6112) EXCEPTION, TAO_Offer_Importer::perform_queries
[Details] ERROR: client returned 4294967295

oci_tao-2_2_0_hornet_win7-x64_vc14_s1d1o0



[Details] (3240|7152) EXCEPTION, TAO_Offer_Importer::perform_queries
[Details] ERROR: client returned 4294967295

oci_tao-2_2_0_mealworm_linux_gcc_d0o1



[Details] ERROR: cannot find file </tao_builds/jenkins/workspace/oci_tao-2_2_0_mealworm_linux_gcc_d0o1/TAO/orbsvcs/tests/Trading/trading.ior>
[Details] Error: TAO/orbsvcs/tests/Trading/run_test.pl returned with status 1

oci_tao-2_2_0_mealworm_linux_gcc_d0o1b32



[Details] ERROR: cannot find file </tao_builds/jenkins/workspace/oci_tao-2_2_0_mealworm_linux_gcc_d0o1/TAO/orbsvcs/tests/Trading/trading.ior>
[Details] Error: TAO/orbsvcs/tests/Trading/run_test.pl returned with status 1

oci_tao-2_2_0_wasp_win10-x64_vs2017_d1o0



[Details] (4500|7608) EXCEPTION, TAO_Offer_Importer::perform_queries
[Details] ERROR: client returned 4294967295


TAO/tests/AMI/run_exclusive_rw.pl

oci_tao-2_2_0_cricket_win2012r2_vc10_s1d0o1



[Details] ERROR: client timedout
[Details] ERROR: client returned -1
[Details] ERROR: server timedout
[Details] ERROR: server returned -1


TAO/tests/BiDirectional/run_test3557.pl

oci_tao-2_2_0_bedbug_win7-x64_vc11_d0o1



[Details] ERROR: client timedout
[Details] ERROR: client returned -1
[Details] (5448|7792) EXCEPTION, Caught exception:
[Details] (5448|7792) ERROR: ACCESS VIOLATION
[Details] ERROR: server returned 3221225477

oci_tao-2_2_0_hornet_win7-x64_vc14_s1d1o0



[Details] ERROR: client timedout
[Details] ERROR: client returned -1
[Details] ERROR: server timedout
[Details] ERROR: server returned -1

oci_tao-2_2_0_tick_linux_gcc_d0o1s1



[Details] ERROR: client timedout
[Details] ERROR: client returned -1
[Details] ERROR: server timedout
[Details] ERROR: server returned -1
[Details] Error: TAO/tests/BiDirectional/run_test3557.pl returned with status 1


TAO/tests/Bug_1551_Regression/run_test.pl

oci_tao-2_2_0_ant_linux_gcc_s1d1o0i0



[Details] ERROR - Timeout waiting for client threads
[Details] pure virtual method called
[Details] ERROR - Timeout waiting for client threads
[Details] pure virtual method called
[Details] ERROR - Timeout waiting for client threads
[Details] pure virtual method called
[Details] ERROR - Timeout waiting for client threads
[Details] pure virtual method called
[Details] ERROR - Timeout waiting for client threads
[Details] pure virtual method called
[Details] ERROR - Timeout waiting for client threads
[Details] pure virtual method called
[Details] ERROR - Timeout waiting for client threads
[Details] pure virtual method called
[Details] ERROR - Timeout waiting for client threads
[Details] pure virtual method called
[Details] ERROR - Timeout waiting for client threads
[Details] pure virtual method called
[Details] ERROR - Timeout waiting for client threads
[Details] pure virtual method called
[Details] ERROR - Timeout waiting for client threads
[Details] pure virtual method called
[Details] ERROR - Timeout waiting for client threads
[Details] pure virtual method called
[Details] ERROR - Timeout waiting for client threads
[Details] pure virtual method called
[Details] ERROR - Timeout waiting for client threads
[Details] pure virtual method called

oci_tao-2_2_0_cricket_win2012r2_vc10_s1d0o1



[Details] ERROR - Timeout waiting for client threads
[Details] ERROR: client returned 1

oci_tao-2_2_0_firefly_linux_gcc_s1d1o0



[Details] ERROR - Timeout waiting for client threads
[Details] ERROR: client returned 1
[Details] Error: TAO/tests/Bug_1551_Regression/run_test.pl returned with status 1

oci_tao-2_2_0_wiro_linux_gcc_d1o0s1



[Details] ERROR - Timeout waiting for client threads
[Details] ERROR - Timeout waiting for client threads
[Details] ERROR - Timeout waiting for client threads
[Details] pure virtual method called
[Details] ERROR: client returned 1
[Details] Error: TAO/tests/Bug_1551_Regression/run_test.pl returned with status 1


TAO/tests/Bug_2085_Regression/run_test.pl

oci_tao-2_2_0_ant_linux_gcc_s1d1o0i0



[Details] (21505) ERROR, test_string_to_object for <> didn't result in minor code 7
[Details] (21505) ERROR, test_string_to_object for <> didn't result in minor code 8
[Details] (21505) ERROR, test_string_to_object for <> didn't result in minor code 9
[Details] (21505) ERROR, test_string_to_object for <> didn't result in minor code 10
[Details] ERROR: test returned 4
[Details] Error: TAO/tests/Bug_2085_Regression/run_test.pl returned with status 1


TAO/tests/Bug_2319_Regression/run_test.pl

oci_tao-2_2_0_ant_linux_gcc_s1d1o0i0



[Details] ERROR: <server> exited with coredump from signal 11 : SEGV
[Details] Program terminated with signal 11, Segmentation fault.
[Details] ERROR: test returned 255
[Details] Error: TAO/tests/Bug_2319_Regression/run_test.pl returned with status 1


TAO/tests/Bug_2543_Regression/run_test.pl

oci_tao-2_2_0_ant_linux_gcc_s1d1o0i0



[Details] Error: extract out of any failed
[Details] ERROR: test returned 1
[Details] Error: TAO/tests/Bug_2543_Regression/run_test.pl returned with status 1


TAO/tests/Bug_3558_Regression/run_test.pl

oci_tao-2_2_0_mosquito_linux_gcc_d0o1i0t0i0



[Details] Error spawning thread 1
[Details] ERROR: client returned 1
[Details] ERROR: server timedout
[Details] ERROR: server returned -1
[Details] ERROR: server timedout
[Details] ERROR: server returned -1
[Details] Error: TAO/tests/Bug_3558_Regression/run_test.pl returned with status 1


TAO/tests/Bug_3566_Regression/run_test.pl

oci_tao-2_2_0_ant_linux_gcc_s1d1o0i0



[Details] (23922|23922) EXCEPTION, Exception caught:


TAO/tests/Bug_3598a_Regression/run_test.pl

oci_tao-2_2_0_bedbug_win7-x64_vc11_d0o1



[Details] ACE (8132|7732) ERROR: SG::initialize - service 'OC_Endpoint_Selector_Factory' was not located.

oci_tao-2_2_0_cricket_win2012r2_vc10_s1d0o1



[Details] ACE (5600|608) ERROR: SG::initialize - service 'OC_Endpoint_Selector_Factory' was not located.

oci_tao-2_2_0_hornet_win7-x64_vc14_s1d1o0



[Details] ACE (1104|3812) ERROR: SG::initialize - service 'OC_Endpoint_Selector_Factory' was not located.

oci_tao-2_2_0_katydid_win10-x64_vs2019_d1o0



[Details] ACE (4104|6020) ERROR: SG::initialize - service 'OC_Endpoint_Selector_Factory' was not located.

oci_tao-2_2_0_tick_linux_gcc_d0o1s1



[Details] ACE (18180|18180) ERROR: SG::initialize - service 'OC_Endpoint_Selector_Factory' was not located.

oci_tao-2_2_0_wasp_win10-x64_vs2017_d1o0



[Details] ACE (8580|944) ERROR: SG::initialize - service 'OC_Endpoint_Selector_Factory' was not located.

oci_tao-2_2_0_wiro_linux_gcc_d1o0s1



[Details] ACE (1415883|1415883) ERROR: SG::initialize - service 'OC_Endpoint_Selector_Factory' was not located.


TAO/tests/Bug_4097_Regression/run_test.pl

oci_tao-2_2_0_mosquito_linux_gcc_d0o1i0t0i0



[Details] ERROR: Cannot Spawn: <././/Bug_4097_Regression> not found
[Details] ERROR: test returned -1
[Details] Error: TAO/tests/Bug_4097_Regression/run_test.pl returned with status 1


TAO/tests/CSD_Strategy_Tests/TP_Test_3/run_test.pl remote

oci_tao-2_2_0_bedbug_win7-x64_vc11_d0o1



[Details] (7384|6148) EXCEPTION, ClientTask::svc Caught exception from execute():
[Details] (6348|4528) EXCEPTION, ClientTask::svc Caught exception from execute():
[Details] ERROR: client 16 returned 4294967295
[Details] ERROR: client 23 returned 4294967295
[Details] ERROR: server_main timedout
[Details] ERROR: server returned -1


TAO/tests/CSD_Strategy_Tests/TP_Test_3/run_test.pl remote_csdthreads

oci_tao-2_2_0_bedbug_win7-x64_vc11_d0o1



[Details] (7572|3156) EXCEPTION, ClientTask::svc Caught exception from execute():
[Details] ERROR: client 12 returned 4294967295
[Details] ERROR: server_main timedout
[Details] ERROR: server returned -1

oci_tao-2_2_0_cricket_win2012r2_vc10_s1d0o1



[Details] (1292|4012) EXCEPTION, ClientTask::svc Caught exception from execute():
[Details] ERROR: client 6 returned 4294967295
[Details] ERROR: server_main timedout
[Details] ERROR: server returned -1


TAO/tests/DII_AMI_Forward/run_test.pl

oci_tao-2_2_0_tick_linux_gcc_d0o1s1



[Details] (21622|21622) EXCEPTION, ERROR : unexpected CORBA exception caugth :
[Details] ERROR: client returned 1
[Details] Error: TAO/tests/DII_AMI_Forward/run_test.pl returned with status 1

oci_tao-2_2_0_wiro_linux_gcc_d1o0s1



[Details] (1419340|1419340) EXCEPTION, ERROR : unexpected CORBA exception caugth :
[Details] ERROR: client returned 1
[Details] Error: TAO/tests/DII_AMI_Forward/run_test.pl returned with status 1


TAO/tests/Dynamic_TP/POA_Loader/Dynamic_TP_POA_Test_Dynamic/run_test.pl

oci_tao-2_2_0_ant_linux_gcc_s1d1o0i0



[Details] ERROR: min_pool_thread test failed w/6 instead of 5
[Details] Error: TAO/tests/Dynamic_TP/POA_Loader/Dynamic_TP_POA_Test_Dynamic/run_test.pl returned with status 1

oci_tao-2_2_0_mosquito_linux_gcc_s1i1d0o1



[Details] ERROR: client timedout
[Details] ERROR: client timedout
[Details] ERROR: max_pool_thread test failed w/0 instead of 4
[Details] ERROR: server timedout
[Details] ERROR: server returned -1
[Details] Error: TAO/tests/Dynamic_TP/POA_Loader/Dynamic_TP_POA_Test_Dynamic/run_test.pl returned with status 1


TAO/tests/Dynamic_TP/POA_Loader/Dynamic_TP_POA_Test_Static/run_test.pl

oci_tao-2_2_0_wiro_linux_gcc_d1o0s1



[Details] ERROR: client timedout
[Details] 69 ../sysdeps/unix/sysv/linux/select.c: No such file or directory.
[Details] ERROR: client timedout
[Details] 69 ../sysdeps/unix/sysv/linux/select.c: No such file or directory.
[Details] ERROR: max_pool_thread test failed w/0 instead of 4
[Details] ERROR: server timedout
[Details] 57 ./nptl/futex-internal.c: No such file or directory.
[Details] ERROR: server returned -1
[Details] Error: TAO/tests/Dynamic_TP/POA_Loader/Dynamic_TP_POA_Test_Static/run_test.pl returned with status 1


TAO/tests/HandleExhaustion/run_test.pl

oci_tao-2_2_0_mosquito_linux_gcc_d0o1i0t0i0



[Details] ERROR: client timedout
[Details] ERROR: client returned -1
[Details] ERROR: server timedout
[Details] ERROR: server returned -1
[Details] ERROR: The error situation was not achieved
[Details] ERROR: The acceptor was not reregistered
[Details] Error: TAO/tests/HandleExhaustion/run_test.pl returned with status 3

oci_tao-2_2_0_mosquito_linux_gcc_s1i1d0o1



[Details] ERROR: client timedout
[Details] ERROR: client returned -1
[Details] ERROR: server timedout
[Details] ERROR: server returned -1
[Details] ERROR: The error situation was not achieved
[Details] ERROR: The acceptor was not reregistered
[Details] Error: TAO/tests/HandleExhaustion/run_test.pl returned with status 3

oci_tao-2_2_0_wiro_linux_gcc_d1o0s1



[Details] ERROR: client timedout
[Details] 69 ../sysdeps/unix/sysv/linux/select.c: No such file or directory.
[Details] ERROR: client returned -1
[Details] ERROR: server timedout
[Details] 43 ./nptl/pthread_sigmask.c: No such file or directory.
[Details] ERROR: server returned -1
[Details] ERROR: The error situation was not achieved
[Details] ERROR: The acceptor was not reregistered
[Details] Error: TAO/tests/HandleExhaustion/run_test.pl returned with status 3


TAO/tests/Multiple_Retry_Tests/Retry_On_Reply_Failure/run_test.pl

oci_tao-2_2_0_mosquito_linux_gcc_d0o1i0t0i0



[Details] ERROR: client returned 1
[Details] ERROR: server timedout
[Details] ERROR: server returned -1
[Details] ERROR: client returned 1
[Details] ERROR: server timedout
[Details] ERROR: server returned -1
[Details] ERROR: client returned 1
[Details] ERROR: server timedout
[Details] ERROR: server returned -1
[Details] ERROR: client returned 1
[Details] ERROR: server timedout
[Details] ERROR: server returned -1
[Details] ERROR: client returned 1
[Details] ERROR: server timedout
[Details] ERROR: server returned -1
[Details] ERROR: client returned 1
[Details] ERROR: server timedout
[Details] ERROR: server returned -1
[Details] ERROR: client returned 1
[Details] ERROR: server timedout
[Details] ERROR: server returned -1
[Details] ERROR: client returned 1
[Details] ERROR: server timedout
[Details] ERROR: server returned -1
[Details] Error: TAO/tests/Multiple_Retry_Tests/Retry_On_Reply_Failure/run_test.pl returned with status 1


TAO/tests/NestedUpcall/MT_Client_Test/run_test.pl

oci_tao-2_2_0_katydid_win10-x64_vs2019_d1o0



[Details] (9016|8536) EXCEPTION, MT_Client::init

oci_tao-2_2_0_wasp_win10-x64_vs2017_d1o0



[Details] (4828|7656) EXCEPTION, MT_Client::init


TAO/tests/OBV/Collocated/Forward/run_test.pl

oci_tao-2_2_0_ant_linux_gcc_s1d1o0i0



[Details] ERROR: tc == tc_result


TAO/tests/Objref_Sequence_Test/run_test.pl

oci_tao-2_2_0_mosquito_linux_gcc_d0o1i0t0i0



[Details] (11292|11292) EXCEPTION,
[Details] ERROR: server timedout
[Details] ERROR: server returned -1
[Details] Error: TAO/tests/Objref_Sequence_Test/run_test.pl returned with status 1

oci_tao-2_2_0_wasp_win10-x64_vs2017_d1o0



[Details] ERROR: client timedout
[Details] ERROR: client returned -1
[Details] ERROR: server timedout
[Details] ERROR: server returned -1


TAO/tests/POA/Bug_1592_Regression/run_test.pl

oci_tao-2_2_0_ant_linux_gcc_s1d1o0i0



[Details] ERROR: PortableInterceptor::ServerRequestInterceptor
[Details] ERROR: ending interception point incorrectly called prior to
[Details] ERROR: PortableServer::ServantLocator::postinvoke().
[Details] ERROR: server returned 1
[Details] Error: TAO/tests/POA/Bug_1592_Regression/run_test.pl returned with status 1


TAO/tests/POA/EndpointPolicy/run_test.pl

oci_tao-2_2_0_ant_linux_gcc_s1d1o0i0



[Details] (26584|26584) EXCEPTION, cannot run server
[Details] ERROR: cannot find file </tao_builds/jenkins/workspace/oci_tao-2_2_0_ant_linux_gcc_s1d1o0i0/TAO/tests/POA/EndpointPolicy/good.ior>
[Details] Error: TAO/tests/POA/EndpointPolicy/run_test.pl returned with status 1


TAO/tests/Portable_Interceptors/Collocated/Dynamic/run_test.pl

oci_tao-2_2_0_tick_linux_gcc_d0o1s1



[Details] (22089|22089) ERROR: Server Side Interceptors not called properly, called 12 times, expected 10
[Details] (22089|22089) ERROR:Client Interceptors not called properly

oci_tao-2_2_0_wiro_linux_gcc_d1o0s1



[Details] (1419821|1419821) ERROR: Server Side Interceptors not called properly, called 12 times, expected 10
[Details] (1419821|1419821) ERROR:Client Interceptors not called properly


TAO/tests/SHMIOP/run_test.pl

oci_tao-2_2_0_mosquito_linux_gcc_d0o1i0t0i0



[Details] (12561|12561) EXCEPTION, Exception caught:
[Details] ERROR: cannot find file </tao_builds/jenkins/workspace/oci_tao-2_2_0_mosquito_linux_gcc_d0o1i0t0i0/TAO/tests/SHMIOP/server.ior>
[Details] Error: TAO/tests/SHMIOP/run_test.pl returned with status 1


TAO/tests/SHMIOP/run_test.pl with_collocated

oci_tao-2_2_0_mosquito_linux_gcc_d0o1i0t0i0



[Details] (12564|12564) EXCEPTION, Exception caught:
[Details] ERROR: cannot find file </tao_builds/jenkins/workspace/oci_tao-2_2_0_mosquito_linux_gcc_d0o1i0t0i0/TAO/tests/SHMIOP/server.ior>
[Details] Error: TAO/tests/SHMIOP/run_test.pl with_collocated returned with status 1


TAO/tests/SHMIOP/run_test_collocated.pl

oci_tao-2_2_0_mosquito_linux_gcc_d0o1i0t0i0



[Details] (12559|12559) EXCEPTION, Exception caught:
[Details] ERROR: Collocated test returned 1
[Details] Error: TAO/tests/SHMIOP/run_test_collocated.pl returned with status 1


tests/Array_Map_Test

oci_tao-2_2_0_hornet_win7-x64_vc14_s1d1o0



[Details] c:\program files (x86)\microsoft visual studio 14.0\vc\include\iterator(449) : Assertion failed: "_Myarray != 0 && _Myindex + _Off <= _Mysize" && 0
[Details] Error: Array_Map_Test FAILED with exit status 255 after Time:20s
[Details] Error (log/Array_Map_Test.log): no line with 'Ending'


tests/Bug_2434_Regression_Test

oci_tao-2_2_0_bedbug_win7-x64_vc11_d0o1



[Details] ACE_ASSERT: file Bug_2434_Regression_Test.cpp, line 56 assertion failed for 'tv1 == tv2'.Aborting...
[Details] Error: Bug_2434_Regression_Test FAILED with exit status 3 after Time:0s
[Details] Error: (log/Bug_2434_Regression_Test.log): ACE_ASSERT: file Bug_2434_Regression_Test.cpp, line 56 assertion failed for 'tv1 == tv2'.Aborting...
[Details] Error (log/Bug_2434_Regression_Test.log): no line with 'Ending'
[Details] 2023-01-28 13:50:31.799@LM_ERROR@ACE_ASSERT: file Bug_2434_Regression_Test.cpp, line 56 assertion failed for 'tv1 == tv2'.Aborting...

oci_tao-2_2_0_cricket_win2012r2_vc10_s1d0o1



[Details] ACE_ASSERT: file Bug_2434_Regression_Test.cpp, line 56 assertion failed for 'tv1 == tv2'.Aborting...
[Details] Error: Bug_2434_Regression_Test FAILED with exit status 3 after Time:0s
[Details] Error: (log/Bug_2434_Regression_Test.log): ACE_ASSERT: file Bug_2434_Regression_Test.cpp, line 56 assertion failed for 'tv1 == tv2'.Aborting...
[Details] Error (log/Bug_2434_Regression_Test.log): no line with 'Ending'
[Details] 2023-01-28 16:57:38.805@LM_ERROR@ACE_ASSERT: file Bug_2434_Regression_Test.cpp, line 56 assertion failed for 'tv1 == tv2'.Aborting...

oci_tao-2_2_0_hornet_win7-x64_vc14_s1d1o0



[Details] ACE_ASSERT: file c:\tao_builds\jenkins\workspace\tao-2_2_0_vc14_s1d1o0\ace\tests\bug_2434_regression_test.cpp, line 56 assertion failed for 'tv1 == tv2'.Aborting...
[Details] abort() has been calledError: Bug_2434_Regression_Test FAILED with exit status 3 after Time:0s
[Details] Error: (log/Bug_2434_Regression_Test.log): ACE_ASSERT: file c:\tao_builds\jenkins\workspace\tao-2_2_0_vc14_s1d1o0\ace\tests\bug_2434_regression_test.cpp, line 56 assertion failed for 'tv1 == tv2'.Aborting...
[Details] Error (log/Bug_2434_Regression_Test.log): no line with 'Ending'
[Details] 2023-01-28 06:50:35.496@LM_ERROR@ACE_ASSERT: file c:\tao_builds\jenkins\workspace\tao-2_2_0_vc14_s1d1o0\ace\tests\bug_2434_regression_test.cpp, line 56 assertion failed for 'tv1 == tv2'.Aborting...

oci_tao-2_2_0_katydid_win10-x64_vs2019_d1o0



[Details] ACE_ASSERT: file C:\tao_builds\jenkins\workspace\tao-2_2_0_vs2019_d1o0\ACE\tests\Bug_2434_Regression_Test.cpp, line 56 assertion failed for 'tv1 == tv2'.Aborting...
[Details] abort() has been calledError: Bug_2434_Regression_Test FAILED with exit status 3 after Time:0s
[Details] Error: (log/Bug_2434_Regression_Test.log): ACE_ASSERT: file C:\tao_builds\jenkins\workspace\tao-2_2_0_vs2019_d1o0\ACE\tests\Bug_2434_Regression_Test.cpp, line 56 assertion failed for 'tv1 == tv2'.Aborting...
[Details] Error (log/Bug_2434_Regression_Test.log): no line with 'Ending'
[Details] 2023-01-28 04:44:47.739@LM_ERROR@ACE_ASSERT: file C:\tao_builds\jenkins\workspace\tao-2_2_0_vs2019_d1o0\ACE\tests\Bug_2434_Regression_Test.cpp, line 56 assertion failed for 'tv1 == tv2'.Aborting...

oci_tao-2_2_0_wasp_win10-x64_vs2017_d1o0



[Details] ACE_ASSERT: file c:\tao_builds\jenkins\workspace\tao-2_2_0_vs2017_d1o0\ace\tests\bug_2434_regression_test.cpp, line 56 assertion failed for 'tv1 == tv2'.Aborting...
[Details] abort() has been calledError: Bug_2434_Regression_Test FAILED with exit status 3 after Time:0s
[Details] Error: (log/Bug_2434_Regression_Test.log): ACE_ASSERT: file c:\tao_builds\jenkins\workspace\tao-2_2_0_vs2017_d1o0\ace\tests\bug_2434_regression_test.cpp, line 56 assertion failed for 'tv1 == tv2'.Aborting...
[Details] Error (log/Bug_2434_Regression_Test.log): no line with 'Ending'
[Details] 2023-01-28 05:15:59.936@LM_ERROR@ACE_ASSERT: file c:\tao_builds\jenkins\workspace\tao-2_2_0_vs2017_d1o0\ace\tests\bug_2434_regression_test.cpp, line 56 assertion failed for 'tv1 == tv2'.Aborting...


tests/Bug_2610_Regression_Test

oci_tao-2_2_0_ant_linux_gcc_s1d1o0i0



[Details] Error: Bug_2610_Regression_Test FAILED with exit status 1 after Time:0s
[Details] Error: (log/Bug_2610_Regression_Test.log): Svc_Handler leakage detected, 3 objects remain
[Details] Error (log/Bug_2610_Regression_Test.log): no line with 'Ending'
[Details] 2023-01-28 04:16:01.485@LM_ERROR@Svc_Handler leakage detected, 3 objects remain


tests/Bug_2772_Regression_Test

oci_tao-2_2_0_ant_linux_gcc_s1d1o0i0



[Details] ERROR: Bug_2772_Regression_Test timedout
[Details] Error: Bug_2772_Regression_Test FAILED (time out after Time:322s)
[Details] Error (log/Bug_2772_Regression_Test.log): no line with 'Ending'


tests/Bug_3539_Regression_Test

oci_tao-2_2_0_navair_linux-sb_gcc_d1o0



[Details] ERROR: <Bug_3539_Regression_Test> exited with coredump from signal 11 : SEGV
[Details] Program terminated with signal 11, Segmentation fault.
[Details] Error: Bug_3539_Regression_Test FAILED with exit status 255 after Time:4s
[Details] Error: (log/Bug_3539_Regression_Test.log): Number created (5) != number deleted (4)
[Details] Error (log/Bug_3539_Regression_Test.log): no line with 'Ending'
[Details] 2023-01-27 21:01:20.799@LM_ERROR@Number created (5) != number deleted (4)


tests/Bug_3911_Regression_Test

oci_tao-2_2_0_ant_linux_gcc_s1d1o0i0



[Details] ERROR: <Bug_3911_Regression_Test> exited with coredump from signal 11 : SEGV
[Details] Program terminated with signal 11, Segmentation fault.
[Details] Error: Bug_3911_Regression_Test FAILED with exit status 255 after Time:0s
[Details] Error (log/Bug_3911_Regression_Test.log): no line with 'Ending'


tests/Bug_3943_Regression_Test

oci_tao-2_2_0_mosquito_linux_gcc_d0o1i0t0i0



[Details] Error: Bug_3943_Regression_Test FAILED with exit status 1 after Time:0s

oci_tao-2_2_0_tick_linux_gcc_d0o1s1



[Details] *** Error in `/tao_builds/jenkins/workspace/oci_tao-2_2_0_tick_linux_gcc_d0o1s1/ACE/tests/Bug_3943_Regression_Test': free(): invalid pointer: 0x00007feeb40000b8 ***
[Details] ERROR: <Bug_3943_Regression_Test> exited with coredump from signal 6 : ABRT
[Details] Error: Bug_3943_Regression_Test FAILED with exit status 255 after Time:58s
[Details] Error: (log/Bug_3943_Regression_Test.log): (4945|4947) ACE_OS::sendv: Bad address, identifying threshold send returned errno=14
[Details] Error: (log/Bug_3943_Regression_Test.log): (4945|4947) ACE_OS::sendv: Bad address, 2 iovecs combined to be too large remainder send returned errno = 14
[Details] Error (log/Bug_3943_Regression_Test.log): no line with 'Ending'
[Details] 2023-01-28 12:47:45.486@LM_ERROR@(4945|4947) ACE_OS::sendv: Bad address, identifying threshold send returned errno=14
[Details] 2023-01-28 12:47:45.487@LM_ERROR@(4945|4947) ACE_OS::sendv: Bad address, 2 iovecs combined to be too large remainder send returned errno = 14


tests/MT_Reference_Counted_Event_Handler_Test

oci_tao-2_2_0_mealworm_linux_gcc_d0o1



[Details] ERROR: MT_Reference_Counted_Event_Handler_Test timedout
[Details] Error: MT_Reference_Counted_Event_Handler_Test FAILED (time out after Time:318s)
[Details] Error: (log/MT_Reference_Counted_Event_Handler_Test.log): ACE_INET_Addr::ACE_INET_Addr: localhost: Unknown error 18446744073709551614
[Details] Error: (log/MT_Reference_Counted_Event_Handler_Test.log): 22560: work_pending_i: Interrupted system call
[Details] Error (log/MT_Reference_Counted_Event_Handler_Test.log): no line with 'Ending'
[Details] 2023-01-28 23:42:01.039@LM_ERROR@ACE_INET_Addr::ACE_INET_Addr: localhost: Unknown error 18446744073709551614
[Details] 2023-01-28 23:46:29.813@LM_ERROR@22560: work_pending_i: Interrupted system call

oci_tao-2_2_0_mealworm_linux_gcc_d0o1b32



[Details] ERROR: MT_Reference_Counted_Event_Handler_Test timedout
[Details] Error: MT_Reference_Counted_Event_Handler_Test FAILED (time out after Time:317s)
[Details] Error: (log/MT_Reference_Counted_Event_Handler_Test.log): ACE_INET_Addr::ACE_INET_Addr: localhost: Unknown error 4294967294
[Details] Error (log/MT_Reference_Counted_Event_Handler_Test.log): no line with 'Ending'
[Details] 2023-01-29 04:58:27.600@LM_ERROR@ACE_INET_Addr::ACE_INET_Addr: localhost: Unknown error 4294967294


tests/MT_SOCK_Test

oci_tao-2_2_0_ant_linux_gcc_s1d1o0i0



[Details] Error: (log/MT_SOCK_Test.log): (9887|9887) server: Incorrect # client connections. Expected:5-10 Actual:11
[Details] 2023-01-28 04:26:40.772@LM_ERROR@(9887|9887) server: Incorrect # client connections. Expected:5-10 Actual:11

oci_tao-2_2_0_firefly_linux_gcc_s1d1o0



[Details] Error: (log/MT_SOCK_Test.log): (11370|11370) server: Incorrect # client connections. Expected:5-10 Actual:12
[Details] 2023-01-28 12:19:55.173@LM_ERROR@(11370|11370) server: Incorrect # client connections. Expected:5-10 Actual:12

oci_tao-2_2_0_mosquito_linux_gcc_d0o1i0t0i0



[Details] Error: (log/MT_SOCK_Test.log): (10623|10623) server: Incorrect # client connections. Expected:5-10 Actual:14
[Details] 2023-01-27 22:32:37.309@LM_ERROR@(10623|10623) server: Incorrect # client connections. Expected:5-10 Actual:14

oci_tao-2_2_0_mosquito_linux_gcc_s1i1d0o1



[Details] ERROR: MT_SOCK_Test timedout
[Details] Error: MT_SOCK_Test FAILED (time out after Time:318s)
[Details] Error: (log/MT_SOCK_Test.log): (28713|28713) server: Incorrect # client connections. Expected:5-10 Actual:24
[Details] Error (log/MT_SOCK_Test.log): no line with 'Ending'
[Details] 2023-01-28 00:52:43.072@LM_ERROR@(28713|28713) server: Incorrect # client connections. Expected:5-10 Actual:24

oci_tao-2_2_0_spider_linux_gcc_d1o0



[Details] Error: (log/MT_SOCK_Test.log): (25051|25051) server: Incorrect # client connections. Expected:5-10 Actual:11
[Details] 2023-01-28 09:03:37.338@LM_ERROR@(25051|25051) server: Incorrect # client connections. Expected:5-10 Actual:11

oci_tao-2_2_0_tick_linux_gcc_d0o1s1



[Details] Error: (log/MT_SOCK_Test.log): (5338|5338) server: Incorrect # client connections. Expected:5-10 Actual:12
[Details] 2023-01-28 12:53:09.482@LM_ERROR@(5338|5338) server: Incorrect # client connections. Expected:5-10 Actual:12


tests/Multicast_Test

oci_tao-2_2_0_tick_linux_gcc_d0o1s1



[Details] Error: Multicast_Test FAILED with exit status 1 after Time:0s
[Details] Error: (log/Multicast_Test.log): Send to 239.255.0.10, send_dgram - error calling send on ACE_SOCK_Dgram.: Operation not permitted
[Details] Error: (log/Multicast_Test.log): Calling send_dgram.
[Details] Error: (log/Multicast_Test.log): Calling advance_addr.
[Details] Error: (log/Multicast_Test.log): Calling send_dgram.
[Details] Error: (log/Multicast_Test.log): Calling advance_addr.
[Details] Error: (log/Multicast_Test.log): Calling send_dgram.
[Details] Error: (log/Multicast_Test.log): Calling advance_addr.
[Details] Error: (log/Multicast_Test.log): Calling send_dgram.
[Details] Error: (log/Multicast_Test.log): Calling advance_addr.
[Details] Error: (log/Multicast_Test.log): Calling send_dgram.
[Details] Error: (log/Multicast_Test.log): Calling advance_addr.
[Details] Error: (log/Multicast_Test.log): Calling send_dgram.
[Details] Error: (log/Multicast_Test.log): Calling advance_addr.
[Details] Error: (log/Multicast_Test.log): Calling send_dgram.
[Details] Error: (log/Multicast_Test.log): Calling advance_addr.
[Details] Error: (log/Multicast_Test.log): Calling send_dgram.
[Details] Error: (log/Multicast_Test.log): Calling advance_addr.
[Details] Error: (log/Multicast_Test.log): Calling send_dgram.
[Details] Error: (log/Multicast_Test.log): Calling advance_addr.
[Details] Error: (log/Multicast_Test.log): Calling send_dgram.
[Details] Error: (log/Multicast_Test.log): Calling advance_addr.
[Details] Error: (log/Multicast_Test.log): Send to 239.255.0.10, send_dgram - error calling send on ACE_SOCK_Dgram.: Operation not permitted
[Details] Error: (log/Multicast_Test.log): Send to 239.255.0.10, send_dgram - error calling send on ACE_SOCK_Dgram.: Operation not permitted
[Details] Error: (log/Multicast_Test.log): Send to 239.255.0.10, send_dgram - error calling send on ACE_SOCK_Dgram.: Operation not permitted
[Details] Error: (log/Multicast_Test.log): Send to 239.255.0.10, send_dgram - error calling send on ACE_SOCK_Dgram.: Operation not permitted
[Details] Error: (log/Multicast_Test.log): Send to 239.255.0.10, send_dgram - error calling send on ACE_SOCK_Dgram.: Operation not permitted
[Details] 2023-01-28 12:53:49.440@LM_ERROR@Send to 239.255.0.10, send_dgram - error calling send on ACE_SOCK_Dgram.: Operation not permitted
[Details] 2023-01-28 12:53:49.440@LM_ERROR@Calling send_dgram.
[Details] 2023-01-28 12:53:49.440@LM_ERROR@Calling advance_addr.
[Details] 2023-01-28 12:53:49.440@LM_ERROR@Calling send_dgram.
[Details] 2023-01-28 12:53:49.440@LM_ERROR@Calling advance_addr.
[Details] 2023-01-28 12:53:49.440@LM_ERROR@Calling send_dgram.
[Details] 2023-01-28 12:53:49.440@LM_ERROR@Calling advance_addr.
[Details] 2023-01-28 12:53:49.440@LM_ERROR@Calling send_dgram.
[Details] 2023-01-28 12:53:49.440@LM_ERROR@Calling advance_addr.
[Details] 2023-01-28 12:53:49.440@LM_ERROR@Calling send_dgram.
[Details] 2023-01-28 12:53:49.440@LM_ERROR@Calling advance_addr.
[Details] 2023-01-28 12:53:49.440@LM_ERROR@Calling send_dgram.
[Details] 2023-01-28 12:53:49.440@LM_ERROR@Calling advance_addr.
[Details] 2023-01-28 12:53:49.441@LM_ERROR@Calling send_dgram.
[Details] 2023-01-28 12:53:49.441@LM_ERROR@Calling advance_addr.
[Details] 2023-01-28 12:53:49.441@LM_ERROR@Calling send_dgram.
[Details] 2023-01-28 12:53:49.441@LM_ERROR@Calling advance_addr.
[Details] 2023-01-28 12:53:49.441@LM_ERROR@Calling send_dgram.
[Details] 2023-01-28 12:53:49.441@LM_ERROR@Calling advance_addr.
[Details] 2023-01-28 12:53:49.441@LM_ERROR@Calling send_dgram.
[Details] 2023-01-28 12:53:49.441@LM_ERROR@Calling advance_addr.
[Details] 2023-01-28 12:53:49.441@LM_ERROR@Send to 239.255.0.10, send_dgram - error calling send on ACE_SOCK_Dgram.: Operation not permitted
[Details] 2023-01-28 12:53:49.442@LM_ERROR@Send to 239.255.0.10, send_dgram - error calling send on ACE_SOCK_Dgram.: Operation not permitted
[Details] 2023-01-28 12:53:49.444@LM_ERROR@Send to 239.255.0.10, send_dgram - error calling send on ACE_SOCK_Dgram.: Operation not permitted
[Details] 2023-01-28 12:53:49.445@LM_ERROR@Send to 239.255.0.10, send_dgram - error calling send on ACE_SOCK_Dgram.: Operation not permitted
[Details] 2023-01-28 12:53:49.446@LM_ERROR@Send to 239.255.0.10, send_dgram - error calling send on ACE_SOCK_Dgram.: Operation not permitted


tests/Proactor_Test

oci_tao-2_2_0_mealworm_linux_gcc_d0o1



[Details] *** glibc detected *** /tao_builds/jenkins/workspace/oci_tao-2_2_0_mealworm_linux_gcc_d0o1/ACE/tests/x86_64/Proactor_Test: double free or corruption (out): 0x00007fff977098c0 ***
[Details] ERROR: <Proactor_Test> exited with coredump from signal 6 : ABRT
[Details] Error: Proactor_Test FAILED with exit status 255 after Time:4s
[Details] Error (log/Proactor_Test.log): no line with 'Ending'


tests/Process_Env_Test

oci_tao-2_2_0_bedbug_win7-x64_vc11_d0o1



[Details] Error: Process_Env_Test FAILED with exit status 1 after Time:0s

oci_tao-2_2_0_cricket_win2012r2_vc10_s1d0o1



[Details] Error: Process_Env_Test FAILED with exit status 1 after Time:0s

oci_tao-2_2_0_hornet_win7-x64_vc14_s1d1o0



[Details] Error: Process_Env_Test FAILED with exit status 1 after Time:1s

oci_tao-2_2_0_katydid_win10-x64_vs2019_d1o0



[Details] Error: Process_Env_Test FAILED with exit status 1 after Time:0s

oci_tao-2_2_0_wasp_win10-x64_vs2017_d1o0



[Details] Error: Process_Env_Test FAILED with exit status 1 after Time:0s


tests/Process_Manual_Event_Test

oci_tao-2_2_0_wiro_linux_gcc_d1o0s1



[Details] Error: (log/Process_Manual_Event_Test.log): (1308193) Acquire pong timed out
[Details] 2023-01-28 21:22:29.473@LM_ERROR@(1308193) Acquire pong timed out


tests/Reactor_Fairness_Test

oci_tao-2_2_0_ant_linux_gcc_s1d1o0i0



[Details] Error: Reactor_Fairness_Test FAILED with exit status 1 after Time:91s
[Details] Error: (log/Reactor_Fairness_Test.log): Too much unfairness (max 226308, min 0)
[Details] 2023-01-28 04:30:04.965@LM_ERROR@Too much unfairness (max 226308, min 0)


tests/SSL/SSL_Asynch_Stream_Test

oci_tao-2_2_0_ant_linux_gcc_s1d1o0i0



[Details] ERROR: <SSL_Asynch_Stream_Test> exited with coredump from signal 11 : SEGV
[Details] Program terminated with signal 11, Segmentation fault.
[Details] Error: SSL_Asynch_Stream_Test FAILED with exit status 255 after Time:1s
[Details] Error (log/SSL_Asynch_Stream_Test.log): no line with 'Ending'

oci_tao-2_2_0_cricket_win2012r2_vc10_s1d0o1



[Details] ERROR: SSL_Asynch_Stream_Test timedout
[Details] Error: SSL_Asynch_Stream_Test FAILED (time out after Time:315s)
[Details] Error: (log/SSL_Asynch_Stream_Test.log):
[Details] Error: (log/SSL_Asynch_Stream_Test.log):
[Details] Error (log/SSL_Asynch_Stream_Test.log): no line with 'Ending'
[Details] 2023-01-28 17:16:14.792@LM_ERROR@
[Details] (4964|2716) ERROR: ACCESS VIOLATION
[Details] 2023-01-28 17:16:14.798@LM_ERROR@
[Details] (4964|1908) ERROR: ACCESS VIOLATION

oci_tao-2_2_0_firefly_linux_gcc_s1d1o0



[Details] ERROR: SSL_Asynch_Stream_Test timedout
[Details] Error: SSL_Asynch_Stream_Test FAILED (time out after Time:319s)
[Details] Error: (log/SSL_Asynch_Stream_Test.log): ACE_SSL (15903|15903) error code: 337092801 - error:1417A0C1:SSL routines:tls_post_process_client_hello:no shared cipher
[Details] Error: (log/SSL_Asynch_Stream_Test.log): ACE_SSL (15903|15903) error code: 336462231 - error:140E0197:SSL routines:SSL_shutdown:shutdown while in init
[Details] Error: (log/SSL_Asynch_Stream_Test.log): (15903) accept: Unknown error 336462231
[Details] Error: (log/SSL_Asynch_Stream_Test.log): ACE_SSL (15903|15908) error code: 336151568 - error:14094410:SSL routines:ssl3_read_bytes:sslv3 alert handshake failure
[Details] Error: (log/SSL_Asynch_Stream_Test.log): ACE_SSL (15903|15908) error code: 336462231 - error:140E0197:SSL routines:SSL_shutdown:shutdown while in init
[Details] Error: (log/SSL_Asynch_Stream_Test.log): (15908) connect: Unknown error 336462231
[Details] Error: (log/SSL_Asynch_Stream_Test.log): (15908) connect: Connection refused
[Details] Error: (log/SSL_Asynch_Stream_Test.log): (15908) connect: Connection refused
[Details] Error: (log/SSL_Asynch_Stream_Test.log): (15908) connect: Connection refused
[Details] Error: (log/SSL_Asynch_Stream_Test.log): (15908) connect: Connection refused
[Details] Error: (log/SSL_Asynch_Stream_Test.log): (15908) connect: Connection refused
[Details] Error: (log/SSL_Asynch_Stream_Test.log): (15908) connect: Connection refused
[Details] Error: (log/SSL_Asynch_Stream_Test.log): (15908) connect: Connection refused
[Details] Error: (log/SSL_Asynch_Stream_Test.log): (15908) connect: Connection refused
[Details] Error: (log/SSL_Asynch_Stream_Test.log): (15908) connect: Connection refused
[Details] Error (log/SSL_Asynch_Stream_Test.log): no line with 'Ending'
[Details] 2023-01-28 12:28:57.442@LM_ERROR@ACE_SSL (15903|15903) error code: 337092801 - error:1417A0C1:SSL routines:tls_post_process_client_hello:no shared cipher
[Details] 2023-01-28 12:28:57.442@LM_ERROR@ACE_SSL (15903|15903) error code: 336462231 - error:140E0197:SSL routines:SSL_shutdown:shutdown while in init
[Details] 2023-01-28 12:28:57.442@LM_ERROR@(15903) accept: Unknown error 336462231
[Details] 2023-01-28 12:28:57.442@LM_ERROR@ACE_SSL (15903|15908) error code: 336151568 - error:14094410:SSL routines:ssl3_read_bytes:sslv3 alert handshake failure
[Details] 2023-01-28 12:28:57.442@LM_ERROR@ACE_SSL (15903|15908) error code: 336462231 - error:140E0197:SSL routines:SSL_shutdown:shutdown while in init
[Details] 2023-01-28 12:28:57.442@LM_ERROR@(15908) connect: Unknown error 336462231
[Details] 2023-01-28 12:28:57.443@LM_ERROR@(15908) connect: Connection refused
[Details] 2023-01-28 12:28:57.443@LM_ERROR@(15908) connect: Connection refused
[Details] 2023-01-28 12:28:57.443@LM_ERROR@(15908) connect: Connection refused
[Details] 2023-01-28 12:28:57.443@LM_ERROR@(15908) connect: Connection refused
[Details] 2023-01-28 12:28:57.443@LM_ERROR@(15908) connect: Connection refused
[Details] 2023-01-28 12:28:57.443@LM_ERROR@(15908) connect: Connection refused
[Details] 2023-01-28 12:28:57.443@LM_ERROR@(15908) connect: Connection refused
[Details] 2023-01-28 12:28:57.443@LM_ERROR@(15908) connect: Connection refused
[Details] 2023-01-28 12:28:57.443@LM_ERROR@(15908) connect: Connection refused

oci_tao-2_2_0_hornet_win7-x64_vc14_s1d1o0



[Details] ERROR: SSL_Asynch_Stream_Test timedout
[Details] Error: SSL_Asynch_Stream_Test FAILED (time out after Time:315s)
[Details] Error: (log/SSL_Asynch_Stream_Test.log): ACE_SSL (6648|4960) error code: 337092801 - error:1417A0C1:SSL routines:tls_post_process_client_hello:no shared cipher
[Details] Error: (log/SSL_Asynch_Stream_Test.log): ACE_SSL (6648|4960) error code: 336462231 - error:140E0197:SSL routines:SSL_shutdown:shutdown while in init
[Details] Error: (log/SSL_Asynch_Stream_Test.log): ACE_SSL (6648|5200) error code: 336151568 - error:14094410:SSL routines:ssl3_read_bytes:sslv3 alert handshake failure
[Details] Error: (log/SSL_Asynch_Stream_Test.log): ACE_SSL (6648|5200) error code: 336462231 - error:140E0197:SSL routines:SSL_shutdown:shutdown while in init
[Details] Error: (log/SSL_Asynch_Stream_Test.log): (4960) accept: unknown error: 336462231
[Details] Error: (log/SSL_Asynch_Stream_Test.log): (5200) connect: unknown error: 336462231
[Details] Error: (log/SSL_Asynch_Stream_Test.log): (5200) connect: connection refused
[Details] Error: (log/SSL_Asynch_Stream_Test.log): (5200) connect: connection refused
[Details] Error: (log/SSL_Asynch_Stream_Test.log): (5200) connect: connection refused
[Details] Error: (log/SSL_Asynch_Stream_Test.log): (5200) connect: connection refused
[Details] Error: (log/SSL_Asynch_Stream_Test.log): (5200) connect: connection refused
[Details] Error: (log/SSL_Asynch_Stream_Test.log): (5200) connect: connection refused
[Details] Error: (log/SSL_Asynch_Stream_Test.log): (5200) connect: connection refused
[Details] Error: (log/SSL_Asynch_Stream_Test.log): (5200) connect: connection refused
[Details] Error: (log/SSL_Asynch_Stream_Test.log): (5200) connect: connection refused
[Details] Error (log/SSL_Asynch_Stream_Test.log): no line with 'Ending'
[Details] 2023-01-28 07:12:31.104@LM_ERROR@ACE_SSL (6648|4960) error code: 337092801 - error:1417A0C1:SSL routines:tls_post_process_client_hello:no shared cipher
[Details] 2023-01-28 07:12:31.105@LM_ERROR@ACE_SSL (6648|4960) error code: 336462231 - error:140E0197:SSL routines:SSL_shutdown:shutdown while in init
[Details] 2023-01-28 07:12:31.105@LM_ERROR@ACE_SSL (6648|5200) error code: 336151568 - error:14094410:SSL routines:ssl3_read_bytes:sslv3 alert handshake failure
[Details] 2023-01-28 07:12:31.105@LM_ERROR@ACE_SSL (6648|5200) error code: 336462231 - error:140E0197:SSL routines:SSL_shutdown:shutdown while in init
[Details] 2023-01-28 07:12:31.105@LM_ERROR@(4960) accept: unknown error: 336462231
[Details] 2023-01-28 07:12:31.106@LM_ERROR@(5200) connect: unknown error: 336462231
[Details] 2023-01-28 07:12:32.126@LM_ERROR@(5200) connect: connection refused
[Details] 2023-01-28 07:12:33.189@LM_ERROR@(5200) connect: connection refused
[Details] 2023-01-28 07:12:34.190@LM_ERROR@(5200) connect: connection refused
[Details] 2023-01-28 07:12:35.192@LM_ERROR@(5200) connect: connection refused
[Details] 2023-01-28 07:12:36.193@LM_ERROR@(5200) connect: connection refused
[Details] 2023-01-28 07:12:37.194@LM_ERROR@(5200) connect: connection refused
[Details] 2023-01-28 07:12:38.197@LM_ERROR@(5200) connect: connection refused
[Details] 2023-01-28 07:12:39.199@LM_ERROR@(5200) connect: connection refused
[Details] 2023-01-28 07:12:40.200@LM_ERROR@(5200) connect: connection refused

oci_tao-2_2_0_mosquito_linux_gcc_s1i1d0o1



[Details] ERROR: SSL_Asynch_Stream_Test timedout
[Details] Error: SSL_Asynch_Stream_Test FAILED (time out after Time:317s)
[Details] Error: (log/SSL_Asynch_Stream_Test.log): ACE_SSL (1931|1931) error code: 337092801 - error:1417A0C1:SSL routines:tls_post_process_client_hello:no shared cipher
[Details] Error: (log/SSL_Asynch_Stream_Test.log): ACE_SSL (1931|1936) error code: 336151568 - error:14094410:SSL routines:ssl3_read_bytes:sslv3 alert handshake failure
[Details] Error: (log/SSL_Asynch_Stream_Test.log): ACE_SSL (1931|1931) error code: 336462231 - error:140E0197:SSL routines:SSL_shutdown:shutdown while in init
[Details] Error: (log/SSL_Asynch_Stream_Test.log): ACE_SSL (1931|1936) error code: 336462231 - error:140E0197:SSL routines:SSL_shutdown:shutdown while in init
[Details] Error: (log/SSL_Asynch_Stream_Test.log): (1931) accept: Unknown error 336462231
[Details] Error: (log/SSL_Asynch_Stream_Test.log): (1936) connect: Unknown error 336462231
[Details] Error: (log/SSL_Asynch_Stream_Test.log): (1936) connect: Connection refused
[Details] Error: (log/SSL_Asynch_Stream_Test.log): (1936) connect: Connection refused
[Details] Error: (log/SSL_Asynch_Stream_Test.log): (1936) connect: Connection refused
[Details] Error: (log/SSL_Asynch_Stream_Test.log): (1936) connect: Connection refused
[Details] Error: (log/SSL_Asynch_Stream_Test.log): (1936) connect: Connection refused
[Details] Error: (log/SSL_Asynch_Stream_Test.log): (1936) connect: Connection refused
[Details] Error: (log/SSL_Asynch_Stream_Test.log): (1936) connect: Connection refused
[Details] Error: (log/SSL_Asynch_Stream_Test.log): (1936) connect: Connection refused
[Details] Error: (log/SSL_Asynch_Stream_Test.log): (1936) connect: Connection refused
[Details] Error (log/SSL_Asynch_Stream_Test.log): no line with 'Ending'
[Details] 2023-01-28 01:06:14.457@LM_ERROR@ACE_SSL (1931|1931) error code: 337092801 - error:1417A0C1:SSL routines:tls_post_process_client_hello:no shared cipher
[Details] 2023-01-28 01:06:14.457@LM_ERROR@ACE_SSL (1931|1936) error code: 336151568 - error:14094410:SSL routines:ssl3_read_bytes:sslv3 alert handshake failure
[Details] 2023-01-28 01:06:14.457@LM_ERROR@ACE_SSL (1931|1931) error code: 336462231 - error:140E0197:SSL routines:SSL_shutdown:shutdown while in init
[Details] 2023-01-28 01:06:14.457@LM_ERROR@ACE_SSL (1931|1936) error code: 336462231 - error:140E0197:SSL routines:SSL_shutdown:shutdown while in init
[Details] 2023-01-28 01:06:14.457@LM_ERROR@(1931) accept: Unknown error 336462231
[Details] 2023-01-28 01:06:14.457@LM_ERROR@(1936) connect: Unknown error 336462231
[Details] 2023-01-28 01:06:14.457@LM_ERROR@(1936) connect: Connection refused
[Details] 2023-01-28 01:06:14.457@LM_ERROR@(1936) connect: Connection refused
[Details] 2023-01-28 01:06:14.457@LM_ERROR@(1936) connect: Connection refused
[Details] 2023-01-28 01:06:14.457@LM_ERROR@(1936) connect: Connection refused
[Details] 2023-01-28 01:06:14.457@LM_ERROR@(1936) connect: Connection refused
[Details] 2023-01-28 01:06:14.457@LM_ERROR@(1936) connect: Connection refused
[Details] 2023-01-28 01:06:14.457@LM_ERROR@(1936) connect: Connection refused
[Details] 2023-01-28 01:06:14.457@LM_ERROR@(1936) connect: Connection refused
[Details] 2023-01-28 01:06:14.457@LM_ERROR@(1936) connect: Connection refused

oci_tao-2_2_0_spider_linux_gcc_d1o0



[Details] ERROR: <SSL_Asynch_Stream_Test> exited with coredump from signal 11 : SEGV
[Details] Program terminated with signal 11, Segmentation fault.
[Details] Error: SSL_Asynch_Stream_Test FAILED with exit status 255 after Time:3s
[Details] Error (log/SSL_Asynch_Stream_Test.log): no line with 'Ending'


tests/SSL/Thread_Pool_Reactor_SSL_Test

oci_tao-2_2_0_firefly_linux_gcc_s1d1o0



[Details] ERROR: Thread_Pool_Reactor_SSL_Test timedout
[Details] Error: Thread_Pool_Reactor_SSL_Test FAILED (time out after Time:317s)
[Details] Error: (log/Thread_Pool_Reactor_SSL_Test.log): ACE_SSL (15967|15968) error code: 337092801 - error:1417A0C1:SSL routines:tls_post_process_client_hello:no shared cipher
[Details] Error: (log/Thread_Pool_Reactor_SSL_Test.log): ACE_SSL (15967|15968) error code: 336462231 - error:140E0197:SSL routines:SSL_shutdown:shutdown while in init
[Details] Error: (log/Thread_Pool_Reactor_SSL_Test.log): ACE_SSL (15967|15973) error code: 336151568 - error:14094410:SSL routines:ssl3_read_bytes:sslv3 alert handshake failure
[Details] Error: (log/Thread_Pool_Reactor_SSL_Test.log): (15968) Handler 0xe8002a90: Expected 4 messages; got 0
[Details] Error: (log/Thread_Pool_Reactor_SSL_Test.log): ACE_SSL (15967|15973) error code: 336462231 - error:140E0197:SSL routines:SSL_shutdown:shutdown while in init
[Details] Error: (log/Thread_Pool_Reactor_SSL_Test.log): (15973) connect: Unknown error 336462231
[Details] Error: (log/Thread_Pool_Reactor_SSL_Test.log): ACE_SSL (15967|15973) error code: 336462231 - error:140E0197:SSL routines:SSL_shutdown:shutdown while in init
[Details] Error: (log/Thread_Pool_Reactor_SSL_Test.log): ACE_SSL (15967|15970) error code: 337092801 - error:1417A0C1:SSL routines:tls_post_process_client_hello:no shared cipher
[Details] Error: (log/Thread_Pool_Reactor_SSL_Test.log): ACE_SSL (15967|15970) error code: 336462231 - error:140E0197:SSL routines:SSL_shutdown:shutdown while in init
[Details] Error: (log/Thread_Pool_Reactor_SSL_Test.log): (15970) Handler 0xe4002990: Expected 4 messages; got 0
[Details] Error: (log/Thread_Pool_Reactor_SSL_Test.log): (15973) connect: Unknown error 336462231
[Details] Error: (log/Thread_Pool_Reactor_SSL_Test.log): ACE_SSL (15967|15975) error code: 336151568 - error:14094410:SSL routines:ssl3_read_bytes:sslv3 alert handshake failure
[Details] Error: (log/Thread_Pool_Reactor_SSL_Test.log): ACE_SSL (15967|15975) error code: 336462231 - error:140E0197:SSL routines:SSL_shutdown:shutdown while in init
[Details] Error: (log/Thread_Pool_Reactor_SSL_Test.log): (15975) connect: Unknown error 336462231
[Details] Error: (log/Thread_Pool_Reactor_SSL_Test.log): ACE_SSL (15967|15971) error code: 337092801 - error:1417A0C1:SSL routines:tls_post_process_client_hello:no shared cipher
[Details] Error: (log/Thread_Pool_Reactor_SSL_Test.log): ACE_SSL (15967|15971) error code: 336462231 - error:140E0197:SSL routines:SSL_shutdown:shutdown while in init
[Details] Error: (log/Thread_Pool_Reactor_SSL_Test.log): (15971) Handler 0xd8002990: Expected 4 messages; got 0
[Details] Error: (log/Thread_Pool_Reactor_SSL_Test.log): ACE_SSL (15967|15969) error code: 337092801 - error:1417A0C1:SSL routines:tls_post_process_client_hello:no shared cipher
[Details] Error: (log/Thread_Pool_Reactor_SSL_Test.log): ACE_SSL (15967|15974) error code: 336151568 - error:14094410:SSL routines:ssl3_read_bytes:sslv3 alert handshake failure
[Details] Error: (log/Thread_Pool_Reactor_SSL_Test.log): ACE_SSL (15967|15969) error code: 336462231 - error:140E0197:SSL routines:SSL_shutdown:shutdown while in init
[Details] Error: (log/Thread_Pool_Reactor_SSL_Test.log): (15969) Handler 0xe0002990: Expected 4 messages; got 0
[Details] Error: (log/Thread_Pool_Reactor_SSL_Test.log): ACE_SSL (15967|15974) error code: 336462231 - error:140E0197:SSL routines:SSL_shutdown:shutdown while in init
[Details] Error: (log/Thread_Pool_Reactor_SSL_Test.log): (15974) connect: Unknown error 336462231
[Details] Error: (log/Thread_Pool_Reactor_SSL_Test.log): ACE_SSL (15967|15971) error code: 336462231 - error:140E0197:SSL routines:SSL_shutdown:shutdown while in init
[Details] Error: (log/Thread_Pool_Reactor_SSL_Test.log): ACE_SSL (15967|15974) error code: 336462231 - error:140E0197:SSL routines:SSL_shutdown:shutdown while in init
[Details] Error: (log/Thread_Pool_Reactor_SSL_Test.log): (15971) Handler 0xd8002990: Expected 4 messages; got 0
[Details] Error: (log/Thread_Pool_Reactor_SSL_Test.log): (15974) connect: Unknown error 336462231
[Details] Error: (log/Thread_Pool_Reactor_SSL_Test.log): ACE_SSL (15967|15974) error code: 336462231 - error:140E0197:SSL routines:SSL_shutdown:shutdown while in init
[Details] Error: (log/Thread_Pool_Reactor_SSL_Test.log): (15974) connect: Unknown error 336462231
[Details] Error: (log/Thread_Pool_Reactor_SSL_Test.log): ACE_SSL (15967|15976) error code: 336151568 - error:14094410:SSL routines:ssl3_read_bytes:sslv3 alert handshake failure
[Details] Error: (log/Thread_Pool_Reactor_SSL_Test.log): ACE_SSL (15967|15976) error code: 336462231 - error:140E0197:SSL routines:SSL_shutdown:shutdown while in init
[Details] Error: (log/Thread_Pool_Reactor_SSL_Test.log): (15976) connect: Unknown error 336462231
[Details] Error: (log/Thread_Pool_Reactor_SSL_Test.log): ACE_SSL (15967|15973) error code: 336462231 - error:140E0197:SSL routines:SSL_shutdown:shutdown while in init
[Details] Error: (log/Thread_Pool_Reactor_SSL_Test.log): (15973) connect: Unknown error 336462231
[Details] Error: (log/Thread_Pool_Reactor_SSL_Test.log): ACE_SSL (15967|15968) error code: 336462231 - error:140E0197:SSL routines:SSL_shutdown:shutdown while in init
[Details] Error: (log/Thread_Pool_Reactor_SSL_Test.log): (15968) Handler 0xe8002a90: Expected 4 messages; got 0
[Details] Error: (log/Thread_Pool_Reactor_SSL_Test.log): ACE_SSL (15967|15974) error code: 336462231 - error:140E0197:SSL routines:SSL_shutdown:shutdown while in init
[Details] Error: (log/Thread_Pool_Reactor_SSL_Test.log): (15974) connect: Unknown error 336462231
[Details] Error: (log/Thread_Pool_Reactor_SSL_Test.log): ACE_SSL (15967|15974) error code: 336462231 - error:140E0197:SSL routines:SSL_shutdown:shutdown while in init
[Details] Error: (log/Thread_Pool_Reactor_SSL_Test.log): (15974) connect: Unknown error 336462231
[Details] Error (log/Thread_Pool_Reactor_SSL_Test.log): no line with 'Ending'
[Details] 2023-01-28 12:34:20.703@LM_ERROR@ACE_SSL (15967|15968) error code: 337092801 - error:1417A0C1:SSL routines:tls_post_process_client_hello:no shared cipher
[Details] 2023-01-28 12:34:20.704@LM_ERROR@ACE_SSL (15967|15968) error code: 336462231 - error:140E0197:SSL routines:SSL_shutdown:shutdown while in init
[Details] 2023-01-28 12:34:20.704@LM_ERROR@ACE_SSL (15967|15973) error code: 336151568 - error:14094410:SSL routines:ssl3_read_bytes:sslv3 alert handshake failure
[Details] 2023-01-28 12:34:20.704@LM_ERROR@(15968) Handler 0xe8002a90: Expected 4 messages; got 0
[Details] 2023-01-28 12:34:20.704@LM_ERROR@ACE_SSL (15967|15973) error code: 336462231 - error:140E0197:SSL routines:SSL_shutdown:shutdown while in init
[Details] 2023-01-28 12:34:20.704@LM_ERROR@(15973) connect: Unknown error 336462231
[Details] 2023-01-28 12:34:20.704@LM_ERROR@ACE_SSL (15967|15973) error code: 336462231 - error:140E0197:SSL routines:SSL_shutdown:shutdown while in init
[Details] 2023-01-28 12:34:20.704@LM_ERROR@ACE_SSL (15967|15970) error code: 337092801 - error:1417A0C1:SSL routines:tls_post_process_client_hello:no shared cipher
[Details] 2023-01-28 12:34:20.704@LM_ERROR@ACE_SSL (15967|15970) error code: 336462231 - error:140E0197:SSL routines:SSL_shutdown:shutdown while in init
[Details] 2023-01-28 12:34:20.704@LM_ERROR@(15970) Handler 0xe4002990: Expected 4 messages; got 0
[Details] 2023-01-28 12:34:20.704@LM_ERROR@(15973) connect: Unknown error 336462231
[Details] 2023-01-28 12:34:20.704@LM_ERROR@ACE_SSL (15967|15975) error code: 336151568 - error:14094410:SSL routines:ssl3_read_bytes:sslv3 alert handshake failure
[Details] 2023-01-28 12:34:20.705@LM_ERROR@ACE_SSL (15967|15975) error code: 336462231 - error:140E0197:SSL routines:SSL_shutdown:shutdown while in init
[Details] 2023-01-28 12:34:20.705@LM_ERROR@(15975) connect: Unknown error 336462231
[Details] 2023-01-28 12:34:20.705@LM_ERROR@ACE_SSL (15967|15971) error code: 337092801 - error:1417A0C1:SSL routines:tls_post_process_client_hello:no shared cipher
[Details] 2023-01-28 12:34:20.705@LM_ERROR@ACE_SSL (15967|15971) error code: 336462231 - error:140E0197:SSL routines:SSL_shutdown:shutdown while in init
[Details] 2023-01-28 12:34:20.705@LM_ERROR@(15971) Handler 0xd8002990: Expected 4 messages; got 0
[Details] 2023-01-28 12:34:20.705@LM_ERROR@ACE_SSL (15967|15969) error code: 337092801 - error:1417A0C1:SSL routines:tls_post_process_client_hello:no shared cipher
[Details] 2023-01-28 12:34:20.705@LM_ERROR@ACE_SSL (15967|15974) error code: 336151568 - error:14094410:SSL routines:ssl3_read_bytes:sslv3 alert handshake failure
[Details] 2023-01-28 12:34:20.705@LM_ERROR@ACE_SSL (15967|15969) error code: 336462231 - error:140E0197:SSL routines:SSL_shutdown:shutdown while in init
[Details] 2023-01-28 12:34:20.705@LM_ERROR@(15969) Handler 0xe0002990: Expected 4 messages; got 0
[Details] 2023-01-28 12:34:20.705@LM_ERROR@ACE_SSL (15967|15974) error code: 336462231 - error:140E0197:SSL routines:SSL_shutdown:shutdown while in init
[Details] 2023-01-28 12:34:20.706@LM_ERROR@(15974) connect: Unknown error 336462231
[Details] 2023-01-28 12:34:20.706@LM_ERROR@ACE_SSL (15967|15971) error code: 336462231 - error:140E0197:SSL routines:SSL_shutdown:shutdown while in init
[Details] 2023-01-28 12:34:20.706@LM_ERROR@ACE_SSL (15967|15974) error code: 336462231 - error:140E0197:SSL routines:SSL_shutdown:shutdown while in init
[Details] 2023-01-28 12:34:20.706@LM_ERROR@(15971) Handler 0xd8002990: Expected 4 messages; got 0
[Details] 2023-01-28 12:34:20.706@LM_ERROR@(15974) connect: Unknown error 336462231
[Details] 2023-01-28 12:34:20.706@LM_ERROR@ACE_SSL (15967|15974) error code: 336462231 - error:140E0197:SSL routines:SSL_shutdown:shutdown while in init
[Details] 2023-01-28 12:34:20.706@LM_ERROR@(15974) connect: Unknown error 336462231
[Details] 2023-01-28 12:34:20.706@LM_ERROR@ACE_SSL (15967|15976) error code: 336151568 - error:14094410:SSL routines:ssl3_read_bytes:sslv3 alert handshake failure
[Details] 2023-01-28 12:34:20.706@LM_ERROR@ACE_SSL (15967|15976) error code: 336462231 - error:140E0197:SSL routines:SSL_shutdown:shutdown while in init
[Details] 2023-01-28 12:34:20.706@LM_ERROR@(15976) connect: Unknown error 336462231
[Details] 2023-01-28 12:34:20.706@LM_ERROR@ACE_SSL (15967|15973) error code: 336462231 - error:140E0197:SSL routines:SSL_shutdown:shutdown while in init
[Details] 2023-01-28 12:34:20.706@LM_ERROR@(15973) connect: Unknown error 336462231
[Details] 2023-01-28 12:34:20.707@LM_ERROR@ACE_SSL (15967|15968) error code: 336462231 - error:140E0197:SSL routines:SSL_shutdown:shutdown while in init
[Details] 2023-01-28 12:34:20.707@LM_ERROR@(15968) Handler 0xe8002a90: Expected 4 messages; got 0
[Details] 2023-01-28 12:34:20.707@LM_ERROR@ACE_SSL (15967|15974) error code: 336462231 - error:140E0197:SSL routines:SSL_shutdown:shutdown while in init
[Details] 2023-01-28 12:34:20.707@LM_ERROR@(15974) connect: Unknown error 336462231
[Details] 2023-01-28 12:34:20.707@LM_ERROR@ACE_SSL (15967|15974) error code: 336462231 - error:140E0197:SSL routines:SSL_shutdown:shutdown while in init
[Details] 2023-01-28 12:34:20.707@LM_ERROR@(15974) connect: Unknown error 336462231

oci_tao-2_2_0_hornet_win7-x64_vc14_s1d1o0



[Details] ERROR: Thread_Pool_Reactor_SSL_Test timedout
[Details] Error: Thread_Pool_Reactor_SSL_Test FAILED (time out after Time:315s)
[Details] Error: (log/Thread_Pool_Reactor_SSL_Test.log): ACE_SSL (5776|3520) error code: 336151568 - error:14094410:SSL routines:ssl3_read_bytes:sslv3 alert handshake failure
[Details] Error: (log/Thread_Pool_Reactor_SSL_Test.log): ACE_SSL (5776|3520) error code: 336462231 - error:140E0197:SSL routines:SSL_shutdown:shutdown while in init
[Details] Error: (log/Thread_Pool_Reactor_SSL_Test.log): ACE_SSL (5776|6236) error code: 337092801 - error:1417A0C1:SSL routines:tls_post_process_client_hello:no shared cipher
[Details] Error: (log/Thread_Pool_Reactor_SSL_Test.log): ACE_SSL (5776|6236) error code: 336462231 - error:140E0197:SSL routines:SSL_shutdown:shutdown while in init
[Details] Error: (log/Thread_Pool_Reactor_SSL_Test.log): (6236) Handler 0x1915e0: Expected 4 messages; got 0
[Details] Error: (log/Thread_Pool_Reactor_SSL_Test.log): (3520) connect: unknown error: 336462231
[Details] Error: (log/Thread_Pool_Reactor_SSL_Test.log): ACE_SSL (5776|3520) error code: 336462231 - error:140E0197:SSL routines:SSL_shutdown:shutdown while in init
[Details] Error: (log/Thread_Pool_Reactor_SSL_Test.log): (3520) connect: unknown error: 336462231
[Details] Error: (log/Thread_Pool_Reactor_SSL_Test.log): ACE_SSL (5776|3520) error code: 336462231 - error:140E0197:SSL routines:SSL_shutdown:shutdown while in init
[Details] Error: (log/Thread_Pool_Reactor_SSL_Test.log): (3520) connect: unknown error: 336462231
[Details] Error: (log/Thread_Pool_Reactor_SSL_Test.log): ACE_SSL (5776|5628) error code: 336151568 - error:14094410:SSL routines:ssl3_read_bytes:sslv3 alert handshake failure
[Details] Error: (log/Thread_Pool_Reactor_SSL_Test.log): ACE_SSL (5776|5628) error code: 336462231 - error:140E0197:SSL routines:SSL_shutdown:shutdown while in init
[Details] Error: (log/Thread_Pool_Reactor_SSL_Test.log): ACE_SSL (5776|4804) error code: 337092801 - error:1417A0C1:SSL routines:tls_post_process_client_hello:no shared cipher
[Details] Error: (log/Thread_Pool_Reactor_SSL_Test.log): ACE_SSL (5776|4804) error code: 336462231 - error:140E0197:SSL routines:SSL_shutdown:shutdown while in init
[Details] Error: (log/Thread_Pool_Reactor_SSL_Test.log): ACE_SSL (5776|3520) error code: 336462231 - error:140E0197:SSL routines:SSL_shutdown:shutdown while in init
[Details] Error: (log/Thread_Pool_Reactor_SSL_Test.log): (3520) connect: unknown error: 336462231
[Details] Error: (log/Thread_Pool_Reactor_SSL_Test.log): ACE_SSL (5776|3520) error code: 336462231 - error:140E0197:SSL routines:SSL_shutdown:shutdown while in init
[Details] Error: (log/Thread_Pool_Reactor_SSL_Test.log): (3520) connect: unknown error: 336462231
[Details] Error: (log/Thread_Pool_Reactor_SSL_Test.log): ACE_SSL (5776|3520) error code: 336462231 - error:140E0197:SSL routines:SSL_shutdown:shutdown while in init
[Details] Error: (log/Thread_Pool_Reactor_SSL_Test.log): (3520) connect: unknown error: 336462231
[Details] Error: (log/Thread_Pool_Reactor_SSL_Test.log): ACE_SSL (5776|3520) error code: 336462231 - error:140E0197:SSL routines:SSL_shutdown:shutdown while in init
[Details] Error: (log/Thread_Pool_Reactor_SSL_Test.log): (3520) connect: unknown error: 336462231
[Details] Error: (log/Thread_Pool_Reactor_SSL_Test.log): ACE_SSL (5776|3520) error code: 336462231 - error:140E0197:SSL routines:SSL_shutdown:shutdown while in init
[Details] Error: (log/Thread_Pool_Reactor_SSL_Test.log): (3520) connect: unknown error: 336462231
[Details] Error: (log/Thread_Pool_Reactor_SSL_Test.log): ACE_SSL (5776|3520) error code: 336462231 - error:140E0197:SSL routines:SSL_shutdown:shutdown while in init
[Details] Error: (log/Thread_Pool_Reactor_SSL_Test.log): (3520) connect: unknown error: 336462231
[Details] Error: (log/Thread_Pool_Reactor_SSL_Test.log): ACE_SSL (5776|3520) error code: 336462231 - error:140E0197:SSL routines:SSL_shutdown:shutdown while in init
[Details] Error: (log/Thread_Pool_Reactor_SSL_Test.log): (3520) connect: unknown error: 336462231
[Details] Error: (log/Thread_Pool_Reactor_SSL_Test.log): (5628) connect: unknown error: 336462231
[Details] Error: (log/Thread_Pool_Reactor_SSL_Test.log): ACE_SSL (5776|5628) error code: 336462231 - error:140E0197:SSL routines:SSL_shutdown:shutdown while in init
[Details] Error: (log/Thread_Pool_Reactor_SSL_Test.log): (5628) connect: unknown error: 336462231
[Details] Error: (log/Thread_Pool_Reactor_SSL_Test.log): ACE_SSL (5776|5628) error code: 336462231 - error:140E0197:SSL routines:SSL_shutdown:shutdown while in init
[Details] Error: (log/Thread_Pool_Reactor_SSL_Test.log): (5628) connect: unknown error: 336462231
[Details] Error: (log/Thread_Pool_Reactor_SSL_Test.log): ACE_SSL (5776|5628) error code: 336462231 - error:140E0197:SSL routines:SSL_shutdown:shutdown while in init
[Details] Error: (log/Thread_Pool_Reactor_SSL_Test.log): (5628) connect: unknown error: 336462231
[Details] Error: (log/Thread_Pool_Reactor_SSL_Test.log): ACE_SSL (5776|5628) error code: 336462231 - error:140E0197:SSL routines:SSL_shutdown:shutdown while in init
[Details] Error: (log/Thread_Pool_Reactor_SSL_Test.log): (5628) connect: unknown error: 336462231
[Details] Error: (log/Thread_Pool_Reactor_SSL_Test.log): ACE_SSL (5776|5628) error code: 336462231 - error:140E0197:SSL routines:SSL_shutdown:shutdown while in init
[Details] Error: (log/Thread_Pool_Reactor_SSL_Test.log): (5628) connect: unknown error: 336462231
[Details] Error: (log/Thread_Pool_Reactor_SSL_Test.log): ACE_SSL (5776|5628) error code: 336462231 - error:140E0197:SSL routines:SSL_shutdown:shutdown while in init
[Details] Error: (log/Thread_Pool_Reactor_SSL_Test.log): (5628) connect: unknown error: 336462231
[Details] Error: (log/Thread_Pool_Reactor_SSL_Test.log): ACE_SSL (5776|5628) error code: 336462231 - error:140E0197:SSL routines:SSL_shutdown:shutdown while in init
[Details] Error: (log/Thread_Pool_Reactor_SSL_Test.log): (5628) connect: unknown error: 336462231
[Details] Error: (log/Thread_Pool_Reactor_SSL_Test.log): ACE_SSL (5776|5628) error code: 336462231 - error:140E0197:SSL routines:SSL_shutdown:shutdown while in init
[Details] Error: (log/Thread_Pool_Reactor_SSL_Test.log): (5628) connect: unknown error: 336462231
[Details] Error: (log/Thread_Pool_Reactor_SSL_Test.log): ACE_SSL (5776|5628) error code: 336462231 - error:140E0197:SSL routines:SSL_shutdown:shutdown while in init
[Details] Error: (log/Thread_Pool_Reactor_SSL_Test.log): (5628) connect: unknown error: 336462231
[Details] Error: (log/Thread_Pool_Reactor_SSL_Test.log): (4804) Handler 0x192ca0: Expected 4 messages; got 0
[Details] Error: (log/Thread_Pool_Reactor_SSL_Test.log): ACE_SSL (5776|3136) error code: 337092801 - error:1417A0C1:SSL routines:tls_post_process_client_hello:no shared cipher
[Details] Error: (log/Thread_Pool_Reactor_SSL_Test.log): ACE_SSL (5776|3452) error code: 336151568 - error:14094410:SSL routines:ssl3_read_bytes:sslv3 alert handshake failure
[Details] Error: (log/Thread_Pool_Reactor_SSL_Test.log): ACE_SSL (5776|3136) error code: 336462231 - error:140E0197:SSL routines:SSL_shutdown:shutdown while in init
[Details] Error: (log/Thread_Pool_Reactor_SSL_Test.log): (3136) Handler 0x1c77a0: Expected 4 messages; got 0
[Details] Error: (log/Thread_Pool_Reactor_SSL_Test.log): ACE_SSL (5776|3452) error code: 336462231 - error:140E0197:SSL routines:SSL_shutdown:shutdown while in init
[Details] Error: (log/Thread_Pool_Reactor_SSL_Test.log): ACE_SSL (5776|4804) error code: 336462231 - error:140E0197:SSL routines:SSL_shutdown:shutdown while in init
[Details] Error: (log/Thread_Pool_Reactor_SSL_Test.log): (3452) connect: unknown error: 336462231
[Details] Error: (log/Thread_Pool_Reactor_SSL_Test.log): (4804) Handler 0x1c77a0: Expected 4 messages; got 0
[Details] Error: (log/Thread_Pool_Reactor_SSL_Test.log): ACE_SSL (5776|3452) error code: 336462231 - error:140E0197:SSL routines:SSL_shutdown:shutdown while in init
[Details] Error: (log/Thread_Pool_Reactor_SSL_Test.log): (3452) connect: unknown error: 336462231
[Details] Error: (log/Thread_Pool_Reactor_SSL_Test.log): ACE_SSL (5776|3452) error code: 336462231 - error:140E0197:SSL routines:SSL_shutdown:shutdown while in init
[Details] Error: (log/Thread_Pool_Reactor_SSL_Test.log): (3452) connect: unknown error: 336462231
[Details] Error: (log/Thread_Pool_Reactor_SSL_Test.log): ACE_SSL (5776|1200) error code: 336151568 - error:14094410:SSL routines:ssl3_read_bytes:sslv3 alert handshake failure
[Details] Error: (log/Thread_Pool_Reactor_SSL_Test.log): ACE_SSL (5776|1200) error code: 336462231 - error:140E0197:SSL routines:SSL_shutdown:shutdown while in init
[Details] Error: (log/Thread_Pool_Reactor_SSL_Test.log): ACE_SSL (5776|4936) error code: 337092801 - error:1417A0C1:SSL routines:tls_post_process_client_hello:no shared cipher
[Details] Error: (log/Thread_Pool_Reactor_SSL_Test.log): ACE_SSL (5776|4936) error code: 336462231 - error:140E0197:SSL routines:SSL_shutdown:shutdown while in init
[Details] Error: (log/Thread_Pool_Reactor_SSL_Test.log): (1200) connect: unknown error: 336462231
[Details] Error: (log/Thread_Pool_Reactor_SSL_Test.log): (4936) Handler 0x1c77a0: Expected 4 messages; got 0
[Details] Error: (log/Thread_Pool_Reactor_SSL_Test.log): ACE_SSL (5776|1200) error code: 336462231 - error:140E0197:SSL routines:SSL_shutdown:shutdown while in init
[Details] Error: (log/Thread_Pool_Reactor_SSL_Test.log): (1200) connect: unknown error: 336462231
[Details] Error: (log/Thread_Pool_Reactor_SSL_Test.log): ACE_SSL (5776|1200) error code: 336462231 - error:140E0197:SSL routines:SSL_shutdown:shutdown while in init
[Details] Error: (log/Thread_Pool_Reactor_SSL_Test.log): (1200) connect: unknown error: 336462231
[Details] Error: (log/Thread_Pool_Reactor_SSL_Test.log): ACE_SSL (5776|1200) error code: 336462231 - error:140E0197:SSL routines:SSL_shutdown:shutdown while in init
[Details] Error: (log/Thread_Pool_Reactor_SSL_Test.log): (1200) connect: unknown error: 336462231
[Details] Error: (log/Thread_Pool_Reactor_SSL_Test.log): ACE_SSL (5776|1200) error code: 336462231 - error:140E0197:SSL routines:SSL_shutdown:shutdown while in init
[Details] Error: (log/Thread_Pool_Reactor_SSL_Test.log): (1200) connect: unknown error: 336462231
[Details] Error: (log/Thread_Pool_Reactor_SSL_Test.log): ACE_SSL (5776|1200) error code: 336462231 - error:140E0197:SSL routines:SSL_shutdown:shutdown while in init
[Details] Error: (log/Thread_Pool_Reactor_SSL_Test.log): (1200) connect: unknown error: 336462231
[Details] Error: (log/Thread_Pool_Reactor_SSL_Test.log): ACE_SSL (5776|1200) error code: 336462231 - error:140E0197:SSL routines:SSL_shutdown:shutdown while in init
[Details] Error: (log/Thread_Pool_Reactor_SSL_Test.log): (1200) connect: unknown error: 336462231
[Details] Error: (log/Thread_Pool_Reactor_SSL_Test.log): ACE_SSL (5776|1200) error code: 336462231 - error:140E0197:SSL routines:SSL_shutdown:shutdown while in init
[Details] Error: (log/Thread_Pool_Reactor_SSL_Test.log): (1200) connect: unknown error: 336462231
[Details] Error: (log/Thread_Pool_Reactor_SSL_Test.log): ACE_SSL (5776|1200) error code: 336462231 - error:140E0197:SSL routines:SSL_shutdown:shutdown while in init
[Details] Error: (log/Thread_Pool_Reactor_SSL_Test.log): (1200) connect: unknown error: 336462231
[Details] Error: (log/Thread_Pool_Reactor_SSL_Test.log): ACE_SSL (5776|1200) error code: 336462231 - error:140E0197:SSL routines:SSL_shutdown:shutdown while in init
[Details] Error: (log/Thread_Pool_Reactor_SSL_Test.log): (1200) connect: unknown error: 336462231
[Details] Error: (log/Thread_Pool_Reactor_SSL_Test.log): ACE_SSL (5776|4804) error code: 336462231 - error:140E0197:SSL routines:SSL_shutdown:shutdown while in init
[Details] Error: (log/Thread_Pool_Reactor_SSL_Test.log): (4804) Handler 0x198940: Expected 4 messages; got 0
[Details] Error: (log/Thread_Pool_Reactor_SSL_Test.log): ACE_SSL (5776|4936) error code: 336462231 - error:140E0197:SSL routines:SSL_shutdown:shutdown while in init
[Details] Error: (log/Thread_Pool_Reactor_SSL_Test.log): (4936) Handler 0x198940: Expected 4 messages; got 0
[Details] Error: (log/Thread_Pool_Reactor_SSL_Test.log): ACE_SSL (5776|3136) error code: 336462231 - error:140E0197:SSL routines:SSL_shutdown:shutdown while in init
[Details] Error: (log/Thread_Pool_Reactor_SSL_Test.log): (3136) Handler 0x198940: Expected 4 messages; got 0
[Details] Error: (log/Thread_Pool_Reactor_SSL_Test.log): ACE_SSL (5776|4804) error code: 336462231 - error:140E0197:SSL routines:SSL_shutdown:shutdown while in init
[Details] Error: (log/Thread_Pool_Reactor_SSL_Test.log): (4804) Handler 0x198940: Expected 4 messages; got 0
[Details] Error: (log/Thread_Pool_Reactor_SSL_Test.log): ACE_SSL (5776|3136) error code: 336462231 - error:140E0197:SSL routines:SSL_shutdown:shutdown while in init
[Details] Error: (log/Thread_Pool_Reactor_SSL_Test.log): (3136) Handler 0x198940: Expected 4 messages; got 0
[Details] Error: (log/Thread_Pool_Reactor_SSL_Test.log): ACE_SSL (5776|6236) error code: 336462231 - error:140E0197:SSL routines:SSL_shutdown:shutdown while in init
[Details] Error: (log/Thread_Pool_Reactor_SSL_Test.log): (6236) Handler 0x198940: Expected 4 messages; got 0
[Details] Error: (log/Thread_Pool_Reactor_SSL_Test.log): ACE_SSL (5776|3136) error code: 336462231 - error:140E0197:SSL routines:SSL_shutdown:shutdown while in init
[Details] Error: (log/Thread_Pool_Reactor_SSL_Test.log): (3136) Handler 0x198940: Expected 4 messages; got 0
[Details] Error: (log/Thread_Pool_Reactor_SSL_Test.log): ACE_SSL (5776|6236) error code: 336462231 - error:140E0197:SSL routines:SSL_shutdown:shutdown while in init
[Details] Error: (log/Thread_Pool_Reactor_SSL_Test.log): (6236) Handler 0x198940: Expected 4 messages; got 0
[Details] Error: (log/Thread_Pool_Reactor_SSL_Test.log): ACE_SSL (5776|3136) error code: 336462231 - error:140E0197:SSL routines:SSL_shutdown:shutdown while in init
[Details] Error: (log/Thread_Pool_Reactor_SSL_Test.log): (3136) Handler 0x198940: Expected 4 messages; got 0
[Details] Error: (log/Thread_Pool_Reactor_SSL_Test.log): ACE_SSL (5776|6236) error code: 336462231 - error:140E0197:SSL routines:SSL_shutdown:shutdown while in init
[Details] Error: (log/Thread_Pool_Reactor_SSL_Test.log): (6236) Handler 0x198940: Expected 4 messages; got 0
[Details] Error: (log/Thread_Pool_Reactor_SSL_Test.log): ACE_SSL (5776|3136) error code: 336462231 - error:140E0197:SSL routines:SSL_shutdown:shutdown while in init
[Details] Error: (log/Thread_Pool_Reactor_SSL_Test.log): (3136) Handler 0x198940: Expected 4 messages; got 0
[Details] Error: (log/Thread_Pool_Reactor_SSL_Test.log): ACE_SSL (5776|6236) error code: 336462231 - error:140E0197:SSL routines:SSL_shutdown:shutdown while in init
[Details] Error: (log/Thread_Pool_Reactor_SSL_Test.log): (6236) Handler 0x198940: Expected 4 messages; got 0
[Details] Error: (log/Thread_Pool_Reactor_SSL_Test.log): ACE_SSL (5776|3136) error code: 336462231 - error:140E0197:SSL routines:SSL_shutdown:shutdown while in init
[Details] Error: (log/Thread_Pool_Reactor_SSL_Test.log): (3136) Handler 0x198940: Expected 4 messages; got 0
[Details] Error: (log/Thread_Pool_Reactor_SSL_Test.log): ACE_SSL (5776|6236) error code: 336462231 - error:140E0197:SSL routines:SSL_shutdown:shutdown while in init
[Details] Error: (log/Thread_Pool_Reactor_SSL_Test.log): (6236) Handler 0x198940: Expected 4 messages; got 0
[Details] Error: (log/Thread_Pool_Reactor_SSL_Test.log): ACE_SSL (5776|3136) error code: 336462231 - error:140E0197:SSL routines:SSL_shutdown:shutdown while in init
[Details] Error: (log/Thread_Pool_Reactor_SSL_Test.log): (3136) Handler 0x198940: Expected 4 messages; got 0
[Details] Error: (log/Thread_Pool_Reactor_SSL_Test.log): ACE_SSL (5776|6236) error code: 336462231 - error:140E0197:SSL routines:SSL_shutdown:shutdown while in init
[Details] Error: (log/Thread_Pool_Reactor_SSL_Test.log): (6236) Handler 0x198940: Expected 4 messages; got 0
[Details] Error: (log/Thread_Pool_Reactor_SSL_Test.log): ACE_SSL (5776|3136) error code: 336462231 - error:140E0197:SSL routines:SSL_shutdown:shutdown while in init
[Details] Error: (log/Thread_Pool_Reactor_SSL_Test.log): (3136) Handler 0x198940: Expected 4 messages; got 0
[Details] Error: (log/Thread_Pool_Reactor_SSL_Test.log): ACE_SSL (5776|6236) error code: 336462231 - error:140E0197:SSL routines:SSL_shutdown:shutdown while in init
[Details] Error: (log/Thread_Pool_Reactor_SSL_Test.log): (6236) Handler 0x198940: Expected 4 messages; got 0
[Details] Error: (log/Thread_Pool_Reactor_SSL_Test.log): ACE_SSL (5776|3136) error code: 336462231 - error:140E0197:SSL routines:SSL_shutdown:shutdown while in init
[Details] Error: (log/Thread_Pool_Reactor_SSL_Test.log): (3136) Handler 0x198940: Expected 4 messages; got 0
[Details] Error (log/Thread_Pool_Reactor_SSL_Test.log): no line with 'Ending'
[Details] 2023-01-28 07:17:48.934@LM_ERROR@ACE_SSL (5776|3520) error code: 336151568 - error:14094410:SSL routines:ssl3_read_bytes:sslv3 alert handshake failure
[Details] 2023-01-28 07:17:48.934@LM_ERROR@ACE_SSL (5776|3520) error code: 336462231 - error:140E0197:SSL routines:SSL_shutdown:shutdown while in init
[Details] 2023-01-28 07:17:48.934@LM_ERROR@ACE_SSL (5776|6236) error code: 337092801 - error:1417A0C1:SSL routines:tls_post_process_client_hello:no shared cipher
[Details] 2023-01-28 07:17:48.934@LM_ERROR@ACE_SSL (5776|6236) error code: 336462231 - error:140E0197:SSL routines:SSL_shutdown:shutdown while in init
[Details] 2023-01-28 07:17:48.935@LM_ERROR@(6236) Handler 0x1915e0: Expected 4 messages; got 0
[Details] 2023-01-28 07:17:48.934@LM_ERROR@(3520) connect: unknown error: 336462231
[Details] 2023-01-28 07:17:48.937@LM_ERROR@ACE_SSL (5776|3520) error code: 336462231 - error:140E0197:SSL routines:SSL_shutdown:shutdown while in init
[Details] 2023-01-28 07:17:48.937@LM_ERROR@(3520) connect: unknown error: 336462231
[Details] 2023-01-28 07:17:48.937@LM_ERROR@ACE_SSL (5776|3520) error code: 336462231 - error:140E0197:SSL routines:SSL_shutdown:shutdown while in init
[Details] 2023-01-28 07:17:48.937@LM_ERROR@(3520) connect: unknown error: 336462231
[Details] 2023-01-28 07:17:48.938@LM_ERROR@ACE_SSL (5776|5628) error code: 336151568 - error:14094410:SSL routines:ssl3_read_bytes:sslv3 alert handshake failure
[Details] 2023-01-28 07:17:48.938@LM_ERROR@ACE_SSL (5776|5628) error code: 336462231 - error:140E0197:SSL routines:SSL_shutdown:shutdown while in init
[Details] 2023-01-28 07:17:48.938@LM_ERROR@ACE_SSL (5776|4804) error code: 337092801 - error:1417A0C1:SSL routines:tls_post_process_client_hello:no shared cipher
[Details] 2023-01-28 07:17:48.938@LM_ERROR@ACE_SSL (5776|4804) error code: 336462231 - error:140E0197:SSL routines:SSL_shutdown:shutdown while in init
[Details] 2023-01-28 07:17:48.938@LM_ERROR@ACE_SSL (5776|3520) error code: 336462231 - error:140E0197:SSL routines:SSL_shutdown:shutdown while in init
[Details] 2023-01-28 07:17:48.938@LM_ERROR@(3520) connect: unknown error: 336462231
[Details] 2023-01-28 07:17:48.939@LM_ERROR@ACE_SSL (5776|3520) error code: 336462231 - error:140E0197:SSL routines:SSL_shutdown:shutdown while in init
[Details] 2023-01-28 07:17:48.939@LM_ERROR@(3520) connect: unknown error: 336462231
[Details] 2023-01-28 07:17:48.939@LM_ERROR@ACE_SSL (5776|3520) error code: 336462231 - error:140E0197:SSL routines:SSL_shutdown:shutdown while in init
[Details] 2023-01-28 07:17:48.939@LM_ERROR@(3520) connect: unknown error: 336462231
[Details] 2023-01-28 07:17:48.940@LM_ERROR@ACE_SSL (5776|3520) error code: 336462231 - error:140E0197:SSL routines:SSL_shutdown:shutdown while in init
[Details] 2023-01-28 07:17:48.940@LM_ERROR@(3520) connect: unknown error: 336462231
[Details] 2023-01-28 07:17:48.940@LM_ERROR@ACE_SSL (5776|3520) error code: 336462231 - error:140E0197:SSL routines:SSL_shutdown:shutdown while in init
[Details] 2023-01-28 07:17:48.940@LM_ERROR@(3520) connect: unknown error: 336462231
[Details] 2023-01-28 07:17:48.941@LM_ERROR@ACE_SSL (5776|3520) error code: 336462231 - error:140E0197:SSL routines:SSL_shutdown:shutdown while in init
[Details] 2023-01-28 07:17:48.941@LM_ERROR@(3520) connect: unknown error: 336462231
[Details] 2023-01-28 07:17:48.941@LM_ERROR@ACE_SSL (5776|3520) error code: 336462231 - error:140E0197:SSL routines:SSL_shutdown:shutdown while in init
[Details] 2023-01-28 07:17:48.941@LM_ERROR@(3520) connect: unknown error: 336462231
[Details] 2023-01-28 07:17:48.938@LM_ERROR@(5628) connect: unknown error: 336462231
[Details] 2023-01-28 07:17:48.941@LM_ERROR@ACE_SSL (5776|5628) error code: 336462231 - error:140E0197:SSL routines:SSL_shutdown:shutdown while in init
[Details] 2023-01-28 07:17:48.941@LM_ERROR@(5628) connect: unknown error: 336462231
[Details] 2023-01-28 07:17:48.942@LM_ERROR@ACE_SSL (5776|5628) error code: 336462231 - error:140E0197:SSL routines:SSL_shutdown:shutdown while in init
[Details] 2023-01-28 07:17:48.942@LM_ERROR@(5628) connect: unknown error: 336462231
[Details] 2023-01-28 07:17:48.942@LM_ERROR@ACE_SSL (5776|5628) error code: 336462231 - error:140E0197:SSL routines:SSL_shutdown:shutdown while in init
[Details] 2023-01-28 07:17:48.942@LM_ERROR@(5628) connect: unknown error: 336462231
[Details] 2023-01-28 07:17:48.943@LM_ERROR@ACE_SSL (5776|5628) error code: 336462231 - error:140E0197:SSL routines:SSL_shutdown:shutdown while in init
[Details] 2023-01-28 07:17:48.943@LM_ERROR@(5628) connect: unknown error: 336462231
[Details] 2023-01-28 07:17:48.943@LM_ERROR@ACE_SSL (5776|5628) error code: 336462231 - error:140E0197:SSL routines:SSL_shutdown:shutdown while in init
[Details] 2023-01-28 07:17:48.944@LM_ERROR@(5628) connect: unknown error: 336462231
[Details] 2023-01-28 07:17:48.944@LM_ERROR@ACE_SSL (5776|5628) error code: 336462231 - error:140E0197:SSL routines:SSL_shutdown:shutdown while in init
[Details] 2023-01-28 07:17:48.944@LM_ERROR@(5628) connect: unknown error: 336462231
[Details] 2023-01-28 07:17:48.944@LM_ERROR@ACE_SSL (5776|5628) error code: 336462231 - error:140E0197:SSL routines:SSL_shutdown:shutdown while in init
[Details] 2023-01-28 07:17:48.945@LM_ERROR@(5628) connect: unknown error: 336462231
[Details] 2023-01-28 07:17:48.945@LM_ERROR@ACE_SSL (5776|5628) error code: 336462231 - error:140E0197:SSL routines:SSL_shutdown:shutdown while in init
[Details] 2023-01-28 07:17:48.945@LM_ERROR@(5628) connect: unknown error: 336462231
[Details] 2023-01-28 07:17:48.945@LM_ERROR@ACE_SSL (5776|5628) error code: 336462231 - error:140E0197:SSL routines:SSL_shutdown:shutdown while in init
[Details] 2023-01-28 07:17:48.946@LM_ERROR@(5628) connect: unknown error: 336462231
[Details] 2023-01-28 07:17:48.938@LM_ERROR@(4804) Handler 0x192ca0: Expected 4 messages; got 0
[Details] 2023-01-28 07:17:48.947@LM_ERROR@ACE_SSL (5776|3136) error code: 337092801 - error:1417A0C1:SSL routines:tls_post_process_client_hello:no shared cipher
[Details] 2023-01-28 07:17:48.947@LM_ERROR@ACE_SSL (5776|3452) error code: 336151568 - error:14094410:SSL routines:ssl3_read_bytes:sslv3 alert handshake failure
[Details] 2023-01-28 07:17:48.947@LM_ERROR@ACE_SSL (5776|3136) error code: 336462231 - error:140E0197:SSL routines:SSL_shutdown:shutdown while in init
[Details] 2023-01-28 07:17:48.947@LM_ERROR@(3136) Handler 0x1c77a0: Expected 4 messages; got 0
[Details] 2023-01-28 07:17:48.947@LM_ERROR@ACE_SSL (5776|3452) error code: 336462231 - error:140E0197:SSL routines:SSL_shutdown:shutdown while in init
[Details] 2023-01-28 07:17:48.948@LM_ERROR@ACE_SSL (5776|4804) error code: 336462231 - error:140E0197:SSL routines:SSL_shutdown:shutdown while in init
[Details] 2023-01-28 07:17:48.948@LM_ERROR@(3452) connect: unknown error: 336462231
[Details] 2023-01-28 07:17:48.949@LM_ERROR@(4804) Handler 0x1c77a0: Expected 4 messages; got 0
[Details] 2023-01-28 07:17:48.949@LM_ERROR@ACE_SSL (5776|3452) error code: 336462231 - error:140E0197:SSL routines:SSL_shutdown:shutdown while in init
[Details] 2023-01-28 07:17:48.949@LM_ERROR@(3452) connect: unknown error: 336462231
[Details] 2023-01-28 07:17:48.949@LM_ERROR@ACE_SSL (5776|3452) error code: 336462231 - error:140E0197:SSL routines:SSL_shutdown:shutdown while in init
[Details] 2023-01-28 07:17:48.950@LM_ERROR@(3452) connect: unknown error: 336462231
[Details] 2023-01-28 07:17:48.950@LM_ERROR@ACE_SSL (5776|1200) error code: 336151568 - error:14094410:SSL routines:ssl3_read_bytes:sslv3 alert handshake failure
[Details] 2023-01-28 07:17:48.950@LM_ERROR@ACE_SSL (5776|1200) error code: 336462231 - error:140E0197:SSL routines:SSL_shutdown:shutdown while in init
[Details] 2023-01-28 07:17:48.950@LM_ERROR@ACE_SSL (5776|4936) error code: 337092801 - error:1417A0C1:SSL routines:tls_post_process_client_hello:no shared cipher
[Details] 2023-01-28 07:17:48.951@LM_ERROR@ACE_SSL (5776|4936) error code: 336462231 - error:140E0197:SSL routines:SSL_shutdown:shutdown while in init
[Details] 2023-01-28 07:17:48.951@LM_ERROR@(1200) connect: unknown error: 336462231
[Details] 2023-01-28 07:17:48.951@LM_ERROR@(4936) Handler 0x1c77a0: Expected 4 messages; got 0
[Details] 2023-01-28 07:17:48.951@LM_ERROR@ACE_SSL (5776|1200) error code: 336462231 - error:140E0197:SSL routines:SSL_shutdown:shutdown while in init
[Details] 2023-01-28 07:17:48.951@LM_ERROR@(1200) connect: unknown error: 336462231
[Details] 2023-01-28 07:17:48.952@LM_ERROR@ACE_SSL (5776|1200) error code: 336462231 - error:140E0197:SSL routines:SSL_shutdown:shutdown while in init
[Details] 2023-01-28 07:17:48.952@LM_ERROR@(1200) connect: unknown error: 336462231
[Details] 2023-01-28 07:17:48.952@LM_ERROR@ACE_SSL (5776|1200) error code: 336462231 - error:140E0197:SSL routines:SSL_shutdown:shutdown while in init
[Details] 2023-01-28 07:17:48.952@LM_ERROR@(1200) connect: unknown error: 336462231
[Details] 2023-01-28 07:17:48.953@LM_ERROR@ACE_SSL (5776|1200) error code: 336462231 - error:140E0197:SSL routines:SSL_shutdown:shutdown while in init
[Details] 2023-01-28 07:17:48.953@LM_ERROR@(1200) connect: unknown error: 336462231
[Details] 2023-01-28 07:17:48.953@LM_ERROR@ACE_SSL (5776|1200) error code: 336462231 - error:140E0197:SSL routines:SSL_shutdown:shutdown while in init
[Details] 2023-01-28 07:17:48.954@LM_ERROR@(1200) connect: unknown error: 336462231
[Details] 2023-01-28 07:17:48.954@LM_ERROR@ACE_SSL (5776|1200) error code: 336462231 - error:140E0197:SSL routines:SSL_shutdown:shutdown while in init
[Details] 2023-01-28 07:17:48.954@LM_ERROR@(1200) connect: unknown error: 336462231
[Details] 2023-01-28 07:17:48.954@LM_ERROR@ACE_SSL (5776|1200) error code: 336462231 - error:140E0197:SSL routines:SSL_shutdown:shutdown while in init
[Details] 2023-01-28 07:17:48.955@LM_ERROR@(1200) connect: unknown error: 336462231
[Details] 2023-01-28 07:17:48.955@LM_ERROR@ACE_SSL (5776|1200) error code: 336462231 - error:140E0197:SSL routines:SSL_shutdown:shutdown while in init
[Details] 2023-01-28 07:17:48.955@LM_ERROR@(1200) connect: unknown error: 336462231
[Details] 2023-01-28 07:17:48.956@LM_ERROR@ACE_SSL (5776|1200) error code: 336462231 - error:140E0197:SSL routines:SSL_shutdown:shutdown while in init
[Details] 2023-01-28 07:17:48.956@LM_ERROR@(1200) connect: unknown error: 336462231
[Details] 2023-01-28 07:17:48.957@LM_ERROR@ACE_SSL (5776|4804) error code: 336462231 - error:140E0197:SSL routines:SSL_shutdown:shutdown while in init
[Details] 2023-01-28 07:17:48.957@LM_ERROR@(4804) Handler 0x198940: Expected 4 messages; got 0
[Details] 2023-01-28 07:17:48.958@LM_ERROR@ACE_SSL (5776|4936) error code: 336462231 - error:140E0197:SSL routines:SSL_shutdown:shutdown while in init
[Details] 2023-01-28 07:17:48.958@LM_ERROR@(4936) Handler 0x198940: Expected 4 messages; got 0
[Details] 2023-01-28 07:17:48.959@LM_ERROR@ACE_SSL (5776|3136) error code: 336462231 - error:140E0197:SSL routines:SSL_shutdown:shutdown while in init
[Details] 2023-01-28 07:17:48.959@LM_ERROR@(3136) Handler 0x198940: Expected 4 messages; got 0
[Details] 2023-01-28 07:17:48.966@LM_ERROR@ACE_SSL (5776|4804) error code: 336462231 - error:140E0197:SSL routines:SSL_shutdown:shutdown while in init
[Details] 2023-01-28 07:17:48.966@LM_ERROR@(4804) Handler 0x198940: Expected 4 messages; got 0
[Details] 2023-01-28 07:17:48.967@LM_ERROR@ACE_SSL (5776|3136) error code: 336462231 - error:140E0197:SSL routines:SSL_shutdown:shutdown while in init
[Details] 2023-01-28 07:17:48.967@LM_ERROR@(3136) Handler 0x198940: Expected 4 messages; got 0
[Details] 2023-01-28 07:17:48.968@LM_ERROR@ACE_SSL (5776|6236) error code: 336462231 - error:140E0197:SSL routines:SSL_shutdown:shutdown while in init
[Details] 2023-01-28 07:17:48.968@LM_ERROR@(6236) Handler 0x198940: Expected 4 messages; got 0
[Details] 2023-01-28 07:17:48.969@LM_ERROR@ACE_SSL (5776|3136) error code: 336462231 - error:140E0197:SSL routines:SSL_shutdown:shutdown while in init
[Details] 2023-01-28 07:17:48.969@LM_ERROR@(3136) Handler 0x198940: Expected 4 messages; got 0
[Details] 2023-01-28 07:17:48.970@LM_ERROR@ACE_SSL (5776|6236) error code: 336462231 - error:140E0197:SSL routines:SSL_shutdown:shutdown while in init
[Details] 2023-01-28 07:17:48.970@LM_ERROR@(6236) Handler 0x198940: Expected 4 messages; got 0
[Details] 2023-01-28 07:17:48.971@LM_ERROR@ACE_SSL (5776|3136) error code: 336462231 - error:140E0197:SSL routines:SSL_shutdown:shutdown while in init
[Details] 2023-01-28 07:17:48.971@LM_ERROR@(3136) Handler 0x198940: Expected 4 messages; got 0
[Details] 2023-01-28 07:17:48.972@LM_ERROR@ACE_SSL (5776|6236) error code: 336462231 - error:140E0197:SSL routines:SSL_shutdown:shutdown while in init
[Details] 2023-01-28 07:17:48.972@LM_ERROR@(6236) Handler 0x198940: Expected 4 messages; got 0
[Details] 2023-01-28 07:17:48.973@LM_ERROR@ACE_SSL (5776|3136) error code: 336462231 - error:140E0197:SSL routines:SSL_shutdown:shutdown while in init
[Details] 2023-01-28 07:17:48.973@LM_ERROR@(3136) Handler 0x198940: Expected 4 messages; got 0
[Details] 2023-01-28 07:17:48.974@LM_ERROR@ACE_SSL (5776|6236) error code: 336462231 - error:140E0197:SSL routines:SSL_shutdown:shutdown while in init
[Details] 2023-01-28 07:17:48.975@LM_ERROR@(6236) Handler 0x198940: Expected 4 messages; got 0
[Details] 2023-01-28 07:17:48.975@LM_ERROR@ACE_SSL (5776|3136) error code: 336462231 - error:140E0197:SSL routines:SSL_shutdown:shutdown while in init
[Details] 2023-01-28 07:17:48.976@LM_ERROR@(3136) Handler 0x198940: Expected 4 messages; got 0
[Details] 2023-01-28 07:17:48.976@LM_ERROR@ACE_SSL (5776|6236) error code: 336462231 - error:140E0197:SSL routines:SSL_shutdown:shutdown while in init
[Details] 2023-01-28 07:17:48.977@LM_ERROR@(6236) Handler 0x198940: Expected 4 messages; got 0
[Details] 2023-01-28 07:17:48.978@LM_ERROR@ACE_SSL (5776|3136) error code: 336462231 - error:140E0197:SSL routines:SSL_shutdown:shutdown while in init
[Details] 2023-01-28 07:17:48.978@LM_ERROR@(3136) Handler 0x198940: Expected 4 messages; got 0
[Details] 2023-01-28 07:17:48.979@LM_ERROR@ACE_SSL (5776|6236) error code: 336462231 - error:140E0197:SSL routines:SSL_shutdown:shutdown while in init
[Details] 2023-01-28 07:17:48.979@LM_ERROR@(6236) Handler 0x198940: Expected 4 messages; got 0
[Details] 2023-01-28 07:17:48.980@LM_ERROR@ACE_SSL (5776|3136) error code: 336462231 - error:140E0197:SSL routines:SSL_shutdown:shutdown while in init
[Details] 2023-01-28 07:17:48.980@LM_ERROR@(3136) Handler 0x198940: Expected 4 messages; got 0
[Details] 2023-01-28 07:17:48.981@LM_ERROR@ACE_SSL (5776|6236) error code: 336462231 - error:140E0197:SSL routines:SSL_shutdown:shutdown while in init
[Details] 2023-01-28 07:17:48.981@LM_ERROR@(6236) Handler 0x198940: Expected 4 messages; got 0
[Details] 2023-01-28 07:17:48.982@LM_ERROR@ACE_SSL (5776|3136) error code: 336462231 - error:140E0197:SSL routines:SSL_shutdown:shutdown while in init
[Details] 2023-01-28 07:17:48.982@LM_ERROR@(3136) Handler 0x198940: Expected 4 messages; got 0

oci_tao-2_2_0_mosquito_linux_gcc_s1i1d0o1



[Details] ERROR: Thread_Pool_Reactor_SSL_Test timedout
[Details] Error: Thread_Pool_Reactor_SSL_Test FAILED (time out after Time:317s)
[Details] Error: (log/Thread_Pool_Reactor_SSL_Test.log): ACE_SSL (1957|1958) error code: 337092801 - error:1417A0C1:SSL routines:tls_post_process_client_hello:no shared cipher
[Details] Error: (log/Thread_Pool_Reactor_SSL_Test.log): ACE_SSL (1957|1958) error code: 336462231 - error:140E0197:SSL routines:SSL_shutdown:shutdown while in init
[Details] Error: (log/Thread_Pool_Reactor_SSL_Test.log): ACE_SSL (1957|1965) error code: 336151568 - error:14094410:SSL routines:ssl3_read_bytes:sslv3 alert handshake failure
[Details] Error: (log/Thread_Pool_Reactor_SSL_Test.log): (1958) Handler 0xb4d02580: Expected 4 messages; got 0
[Details] Error: (log/Thread_Pool_Reactor_SSL_Test.log): ACE_SSL (1957|1965) error code: 336462231 - error:140E0197:SSL routines:SSL_shutdown:shutdown while in init
[Details] Error: (log/Thread_Pool_Reactor_SSL_Test.log): (1965) connect: Unknown error 336462231
[Details] Error: (log/Thread_Pool_Reactor_SSL_Test.log): ACE_SSL (1957|1961) error code: 337092801 - error:1417A0C1:SSL routines:tls_post_process_client_hello:no shared cipher
[Details] Error: (log/Thread_Pool_Reactor_SSL_Test.log): ACE_SSL (1957|1966) error code: 336151568 - error:14094410:SSL routines:ssl3_read_bytes:sslv3 alert handshake failure
[Details] Error: (log/Thread_Pool_Reactor_SSL_Test.log): ACE_SSL (1957|1966) error code: 336462231 - error:140E0197:SSL routines:SSL_shutdown:shutdown while in init
[Details] Error: (log/Thread_Pool_Reactor_SSL_Test.log): ACE_SSL (1957|1961) error code: 336462231 - error:140E0197:SSL routines:SSL_shutdown:shutdown while in init
[Details] Error: (log/Thread_Pool_Reactor_SSL_Test.log): (1966) connect: Unknown error 336462231
[Details] Error: (log/Thread_Pool_Reactor_SSL_Test.log): (1961) Handler 0xb41024e8: Expected 4 messages; got 0
[Details] Error: (log/Thread_Pool_Reactor_SSL_Test.log): ACE_SSL (1957|1966) error code: 336462231 - error:140E0197:SSL routines:SSL_shutdown:shutdown while in init
[Details] Error: (log/Thread_Pool_Reactor_SSL_Test.log): (1966) connect: Unknown error 336462231
[Details] Error: (log/Thread_Pool_Reactor_SSL_Test.log): ACE_SSL (1957|1966) error code: 336462231 - error:140E0197:SSL routines:SSL_shutdown:shutdown while in init
[Details] Error: (log/Thread_Pool_Reactor_SSL_Test.log): (1966) connect: Unknown error 336462231
[Details] Error: (log/Thread_Pool_Reactor_SSL_Test.log): ACE_SSL (1957|1966) error code: 336462231 - error:140E0197:SSL routines:SSL_shutdown:shutdown while in init
[Details] Error: (log/Thread_Pool_Reactor_SSL_Test.log): (1966) connect: Unknown error 336462231
[Details] Error: (log/Thread_Pool_Reactor_SSL_Test.log): ACE_SSL (1957|1958) error code: 337092801 - error:1417A0C1:SSL routines:tls_post_process_client_hello:no shared cipher
[Details] Error: (log/Thread_Pool_Reactor_SSL_Test.log): ACE_SSL (1957|1958) error code: 336462231 - error:140E0197:SSL routines:SSL_shutdown:shutdown while in init
[Details] Error: (log/Thread_Pool_Reactor_SSL_Test.log): (1958) Handler 0xb4d02580: Expected 4 messages; got 0
[Details] Error: (log/Thread_Pool_Reactor_SSL_Test.log): ACE_SSL (1957|1966) error code: 336462231 - error:140E0197:SSL routines:SSL_shutdown:shutdown while in init
[Details] Error: (log/Thread_Pool_Reactor_SSL_Test.log): (1966) connect: Unknown error 336462231
[Details] Error: (log/Thread_Pool_Reactor_SSL_Test.log): ACE_SSL (1957|1967) error code: 336151568 - error:14094410:SSL routines:ssl3_read_bytes:sslv3 alert handshake failure
[Details] Error: (log/Thread_Pool_Reactor_SSL_Test.log): ACE_SSL (1957|1966) error code: 336462231 - error:140E0197:SSL routines:SSL_shutdown:shutdown while in init
[Details] Error: (log/Thread_Pool_Reactor_SSL_Test.log): ACE_SSL (1957|1967) error code: 336462231 - error:140E0197:SSL routines:SSL_shutdown:shutdown while in init
[Details] Error: (log/Thread_Pool_Reactor_SSL_Test.log): (1966) connect: Unknown error 336462231
[Details] Error: (log/Thread_Pool_Reactor_SSL_Test.log): ACE_SSL (1957|1961) error code: 337092801 - error:1417A0C1:SSL routines:tls_post_process_client_hello:no shared cipher
[Details] Error: (log/Thread_Pool_Reactor_SSL_Test.log): (1967) connect: Unknown error 336462231
[Details] Error: (log/Thread_Pool_Reactor_SSL_Test.log): ACE_SSL (1957|1964) error code: 336151568 - error:14094410:SSL routines:ssl3_read_bytes:sslv3 alert handshake failure
[Details] Error: (log/Thread_Pool_Reactor_SSL_Test.log): ACE_SSL (1957|1964) error code: 336462231 - error:140E0197:SSL routines:SSL_shutdown:shutdown while in init
[Details] Error: (log/Thread_Pool_Reactor_SSL_Test.log): ACE_SSL (1957|1961) error code: 336462231 - error:140E0197:SSL routines:SSL_shutdown:shutdown while in init
[Details] Error: (log/Thread_Pool_Reactor_SSL_Test.log): (1964) connect: Unknown error 336462231
[Details] Error: (log/Thread_Pool_Reactor_SSL_Test.log): ACE_SSL (1957|1966) error code: 336462231 - error:140E0197:SSL routines:SSL_shutdown:shutdown while in init
[Details] Error: (log/Thread_Pool_Reactor_SSL_Test.log): (1966) connect: Unknown error 336462231
[Details] Error: (log/Thread_Pool_Reactor_SSL_Test.log): (1961) Handler 0xb41024e8: Expected 4 messages; got 0
[Details] Error (log/Thread_Pool_Reactor_SSL_Test.log): no line with 'Ending'
[Details] 2023-01-28 01:11:35.418@LM_ERROR@ACE_SSL (1957|1958) error code: 337092801 - error:1417A0C1:SSL routines:tls_post_process_client_hello:no shared cipher
[Details] 2023-01-28 01:11:35.432@LM_ERROR@ACE_SSL (1957|1958) error code: 336462231 - error:140E0197:SSL routines:SSL_shutdown:shutdown while in init
[Details] 2023-01-28 01:11:35.418@LM_ERROR@ACE_SSL (1957|1965) error code: 336151568 - error:14094410:SSL routines:ssl3_read_bytes:sslv3 alert handshake failure
[Details] 2023-01-28 01:11:35.433@LM_ERROR@(1958) Handler 0xb4d02580: Expected 4 messages; got 0
[Details] 2023-01-28 01:11:35.433@LM_ERROR@ACE_SSL (1957|1965) error code: 336462231 - error:140E0197:SSL routines:SSL_shutdown:shutdown while in init
[Details] 2023-01-28 01:11:35.433@LM_ERROR@(1965) connect: Unknown error 336462231
[Details] 2023-01-28 01:11:35.433@LM_ERROR@ACE_SSL (1957|1961) error code: 337092801 - error:1417A0C1:SSL routines:tls_post_process_client_hello:no shared cipher
[Details] 2023-01-28 01:11:35.433@LM_ERROR@ACE_SSL (1957|1966) error code: 336151568 - error:14094410:SSL routines:ssl3_read_bytes:sslv3 alert handshake failure
[Details] 2023-01-28 01:11:35.433@LM_ERROR@ACE_SSL (1957|1966) error code: 336462231 - error:140E0197:SSL routines:SSL_shutdown:shutdown while in init
[Details] 2023-01-28 01:11:35.433@LM_ERROR@ACE_SSL (1957|1961) error code: 336462231 - error:140E0197:SSL routines:SSL_shutdown:shutdown while in init
[Details] 2023-01-28 01:11:35.433@LM_ERROR@(1966) connect: Unknown error 336462231
[Details] 2023-01-28 01:11:35.433@LM_ERROR@(1961) Handler 0xb41024e8: Expected 4 messages; got 0
[Details] 2023-01-28 01:11:35.433@LM_ERROR@ACE_SSL (1957|1966) error code: 336462231 - error:140E0197:SSL routines:SSL_shutdown:shutdown while in init
[Details] 2023-01-28 01:11:35.433@LM_ERROR@(1966) connect: Unknown error 336462231
[Details] 2023-01-28 01:11:35.434@LM_ERROR@ACE_SSL (1957|1966) error code: 336462231 - error:140E0197:SSL routines:SSL_shutdown:shutdown while in init
[Details] 2023-01-28 01:11:35.434@LM_ERROR@(1966) connect: Unknown error 336462231
[Details] 2023-01-28 01:11:35.434@LM_ERROR@ACE_SSL (1957|1966) error code: 336462231 - error:140E0197:SSL routines:SSL_shutdown:shutdown while in init
[Details] 2023-01-28 01:11:35.434@LM_ERROR@(1966) connect: Unknown error 336462231
[Details] 2023-01-28 01:11:35.434@LM_ERROR@ACE_SSL (1957|1958) error code: 337092801 - error:1417A0C1:SSL routines:tls_post_process_client_hello:no shared cipher
[Details] 2023-01-28 01:11:35.434@LM_ERROR@ACE_SSL (1957|1958) error code: 336462231 - error:140E0197:SSL routines:SSL_shutdown:shutdown while in init
[Details] 2023-01-28 01:11:35.434@LM_ERROR@(1958) Handler 0xb4d02580: Expected 4 messages; got 0
[Details] 2023-01-28 01:11:35.434@LM_ERROR@ACE_SSL (1957|1966) error code: 336462231 - error:140E0197:SSL routines:SSL_shutdown:shutdown while in init
[Details] 2023-01-28 01:11:35.434@LM_ERROR@(1966) connect: Unknown error 336462231
[Details] 2023-01-28 01:11:35.434@LM_ERROR@ACE_SSL (1957|1967) error code: 336151568 - error:14094410:SSL routines:ssl3_read_bytes:sslv3 alert handshake failure
[Details] 2023-01-28 01:11:35.434@LM_ERROR@ACE_SSL (1957|1966) error code: 336462231 - error:140E0197:SSL routines:SSL_shutdown:shutdown while in init
[Details] 2023-01-28 01:11:35.434@LM_ERROR@ACE_SSL (1957|1967) error code: 336462231 - error:140E0197:SSL routines:SSL_shutdown:shutdown while in init
[Details] 2023-01-28 01:11:35.434@LM_ERROR@(1966) connect: Unknown error 336462231
[Details] 2023-01-28 01:11:35.434@LM_ERROR@ACE_SSL (1957|1961) error code: 337092801 - error:1417A0C1:SSL routines:tls_post_process_client_hello:no shared cipher
[Details] 2023-01-28 01:11:35.434@LM_ERROR@(1967) connect: Unknown error 336462231
[Details] 2023-01-28 01:11:35.434@LM_ERROR@ACE_SSL (1957|1964) error code: 336151568 - error:14094410:SSL routines:ssl3_read_bytes:sslv3 alert handshake failure
[Details] 2023-01-28 01:11:35.435@LM_ERROR@ACE_SSL (1957|1964) error code: 336462231 - error:140E0197:SSL routines:SSL_shutdown:shutdown while in init
[Details] 2023-01-28 01:11:35.435@LM_ERROR@ACE_SSL (1957|1961) error code: 336462231 - error:140E0197:SSL routines:SSL_shutdown:shutdown while in init
[Details] 2023-01-28 01:11:35.435@LM_ERROR@(1964) connect: Unknown error 336462231
[Details] 2023-01-28 01:11:35.435@LM_ERROR@ACE_SSL (1957|1966) error code: 336462231 - error:140E0197:SSL routines:SSL_shutdown:shutdown while in init
[Details] 2023-01-28 01:11:35.435@LM_ERROR@(1966) connect: Unknown error 336462231
[Details] 2023-01-28 01:11:35.435@LM_ERROR@(1961) Handler 0xb41024e8: Expected 4 messages; got 0


tests/Service_Config_Stream_Test

oci_tao-2_2_0_ant_linux_gcc_s1d1o0i0



[Details] ERROR: <Service_Config_Stream_Test> exited with coredump from signal 11 : SEGV
[Details] Program terminated with signal 11, Segmentation fault.
[Details] Error: Service_Config_Stream_Test FAILED with exit status 255 after Time:1s


tests/Task_Wait_Test

oci_tao-2_2_0_bedbug_win7-x64_vc11_d0o1



[Details] ERROR: Task_Wait_Test timedout
[Details] Error: Task_Wait_Test FAILED (time out after Time:315s)
[Details] Error (log/Task_Wait_Test.log): no line with 'Ending'

oci_tao-2_2_0_cricket_win2012r2_vc10_s1d0o1



[Details] ERROR: Task_Wait_Test timedout
[Details] Error: Task_Wait_Test FAILED (time out after Time:315s)
[Details] Error (log/Task_Wait_Test.log): no line with 'Ending'

oci_tao-2_2_0_hornet_win7-x64_vc14_s1d1o0



[Details] ERROR: Task_Wait_Test timedout
[Details] Error: Task_Wait_Test FAILED (time out after Time:315s)
[Details] Error (log/Task_Wait_Test.log): no line with 'Ending'

oci_tao-2_2_0_katydid_win10-x64_vs2019_d1o0



[Details] ERROR: Task_Wait_Test timedout
[Details] Error: Task_Wait_Test FAILED (time out after Time:315s)
[Details] Error (log/Task_Wait_Test.log): no line with 'Ending'

oci_tao-2_2_0_wasp_win10-x64_vs2017_d1o0



[Details] ERROR: Task_Wait_Test timedout
[Details] Error: Task_Wait_Test FAILED (time out after Time:315s)
[Details] Error (log/Task_Wait_Test.log): no line with 'Ending'