Daily Build Log (Brief)


Compile


/tao_builds/jenkins/workspace/doc_ace6tao2_wiro_linux_clang_d1o0/TAO/TAO_IDL/GNUmakefile.TAO_IDL_BE

[Details] /tao_builds/jenkins/workspace/doc_ace6tao2_wiro_linux_clang_d1o0/TAO/TAO_IDL/be/be_codegen.cpp:3767:36: warning: implicit conversion from 'int' to 'float' changes value from 2147483647 to 2147483648 [-Wimplicit-const-int-float-conversion]
[Details] /usr/include/stdlib.h:87:18: note: expanded from macro 'RAND_MAX'
[Details] 1 warning generated.

/tao_builds/jenkins/workspace/doc_ace6tao2_wiro_linux_clang_d1o0/TAO/orbsvcs/orbsvcs/GNUmakefile.CosTrading_Serv

[Details] /tao_builds/jenkins/workspace/doc_ace6tao2_wiro_linux_clang_d1o0/TAO/orbsvcs/orbsvcs/Trader/Constraint_Nodes.cpp:454:29: warning: implicit conversion from 'unsigned long long' to 'double' changes value from 18446744073709551615 to 18446744073709551616 [-Wimplicit-const-int-float-conversion]
[Details] /tao_builds/jenkins/workspace/doc_ace6tao2_wiro_linux_clang_d1o0/ACE/ace/Basic_Types.h:684:24: note: expanded from macro 'ACE_UINT64_MAX'
[Details] /tao_builds/jenkins/workspace/doc_ace6tao2_wiro_linux_clang_d1o0/ACE/ace/Basic_Types.h:444:34: note: expanded from macro 'ACE_UINT64_LITERAL'
[Details] <scratch space>:69:1: note: expanded from here
[Details] /tao_builds/jenkins/workspace/doc_ace6tao2_wiro_linux_clang_d1o0/TAO/orbsvcs/orbsvcs/Trader/Constraint_Nodes.cpp:474:29: warning: implicit conversion from 'long long' to 'double' changes value from 9223372036854775807 to 9223372036854775808 [-Wimplicit-const-int-float-conversion]
[Details] /tao_builds/jenkins/workspace/doc_ace6tao2_wiro_linux_clang_d1o0/ACE/ace/Basic_Types.h:682:23: note: expanded from macro 'ACE_INT64_MAX'
[Details] /tao_builds/jenkins/workspace/doc_ace6tao2_wiro_linux_clang_d1o0/ACE/ace/Basic_Types.h:445:33: note: expanded from macro 'ACE_INT64_LITERAL'
[Details] <scratch space>:73:1: note: expanded from here
[Details] 2 warnings generated.

/tao_builds/jenkins/workspace/doc_ace6tao2_wiro_linux_clang_d1o0/ACE/tests/GNUmakefile.Compiler_Features_31_Test

[Details] /tao_builds/jenkins/workspace/doc_ace6tao2_wiro_linux_clang_d1o0/ACE/tests/Compiler_Features_31_Test.cpp:36:36: warning: dependent nested name specifier 'C::abstractbase_traits<T>::' for friend class declaration is not supported; turning off access control for 'AbstractBase' [-Wunsupported-friend]
[Details] /tao_builds/jenkins/workspace/doc_ace6tao2_wiro_linux_clang_d1o0/ACE/tests/Compiler_Features_31_Test.cpp:40:36: warning: dependent nested name specifier 'C::abstractbase_traits<T>::' for friend class declaration is not supported; turning off access control for 'AbstractBase' [-Wunsupported-friend]
[Details] 2 warnings generated.

/tao_builds/jenkins/workspace/doc_ace6tao2_wiro_linux_clang_d1o0/ACE/tests/GNUmakefile.Network_Adapters_Test

[Details] /tao_builds/jenkins/workspace/doc_ace6tao2_wiro_linux_clang_d1o0/ACE/tests/randomize.h:58:53: warning: implicit conversion from 'int' to 'float' changes value from 2147483647 to 2147483648 [-Wimplicit-const-int-float-conversion]
[Details] /usr/include/stdlib.h:87:18: note: expanded from macro 'RAND_MAX'
[Details] /tao_builds/jenkins/workspace/doc_ace6tao2_wiro_linux_clang_d1o0/ACE/tests/randomize.h:121:20: note: in instantiation of member function '(anonymous namespace)::randomize_element<int>::randomize_element' requested here
[Details] /tao_builds/jenkins/workspace/doc_ace6tao2_wiro_linux_clang_d1o0/ACE/tests/Naming_Test.cpp:61:3: note: in instantiation of function template specialization '(anonymous namespace)::randomize<int>' requested here
[Details] 1 warning generated.

/tao_builds/jenkins/workspace/doc_ace6tao2_wiro_linux_clang_d1o0/ACE/tests/GNUmakefile.Token_Strategy_Test

[Details] /tao_builds/jenkins/workspace/doc_ace6tao2_wiro_linux_clang_d1o0/ACE/tests/randomize.h:58:53: warning: implicit conversion from 'int' to 'float' changes value from 2147483647 to 2147483648 [-Wimplicit-const-int-float-conversion]
[Details] /usr/include/stdlib.h:87:18: note: expanded from macro 'RAND_MAX'
[Details] /tao_builds/jenkins/workspace/doc_ace6tao2_wiro_linux_clang_d1o0/ACE/tests/randomize.h:121:20: note: in instantiation of member function '(anonymous namespace)::randomize_element<ACE_Time_Value>::randomize_element' requested here
[Details] /tao_builds/jenkins/workspace/doc_ace6tao2_wiro_linux_clang_d1o0/ACE/tests/Timer_Queue_Test.cpp:419:3: note: in instantiation of function template specialization '(anonymous namespace)::randomize<ACE_Time_Value>' requested here
[Details] 1 warning generated.

/tao_builds/jenkins/workspace/doc_ace6tao2_wiro_linux_clang_d1o0/ACE/examples/APG/Timers/GNUmakefile.Upcall

[Details] /tao_builds/jenkins/workspace/doc_ace6tao2_wiro_linux_clang_d1o0/ACE/examples/APG/Timers/Timers.cpp:18:2: warning: invalid preprocessing directive, did you mean '#elif'? [-Wunknown-directives]
[Details] /tao_builds/jenkins/workspace/doc_ace6tao2_wiro_linux_clang_d1o0/ACE/examples/APG/Timers/Timers.cpp:21:2: warning: invalid preprocessing directive, did you mean '#elif'? [-Wunknown-directives]
[Details] 2 warnings generated.

/tao_builds/jenkins/workspace/doc_ace6tao2_wiro_linux_clang_d1o0/TAO/orbsvcs/tests/Concurrency/GNUmakefile.CC_client

[Details] /tao_builds/jenkins/workspace/doc_ace6tao2_wiro_linux_clang_d1o0/TAO/orbsvcs/tests/Concurrency/CC_command.cpp:112:47: warning: format string is not a string literal (potentially insecure) [-Wformat-security]
[Details] /tao_builds/jenkins/workspace/doc_ace6tao2_wiro_linux_clang_d1o0/ACE/ace/ace_wchar.h:108:41: note: expanded from macro 'ACE_TEXT_CHAR_TO_TCHAR'
[Details] /tao_builds/jenkins/workspace/doc_ace6tao2_wiro_linux_clang_d1o0/TAO/orbsvcs/tests/Concurrency/CC_command.cpp:112:47: note: treat the string as an argument to avoid this
[Details] /tao_builds/jenkins/workspace/doc_ace6tao2_wiro_linux_clang_d1o0/ACE/ace/ace_wchar.h:108:41: note: expanded from macro 'ACE_TEXT_CHAR_TO_TCHAR'
[Details] 1 warning generated.

Test


tests/Auto_Event_Test

[Details] Error: Auto_Event_Test FAILED with exit status 1 after Time:25s
[Details] Error: (log/Auto_Event_Test.log): Timed wait fails length test
[Details] Error: (log/Auto_Event_Test.log): Expected 4000 ms, actual 10753 ms; 1100 allowed
[Details] 2022-11-19 22:43:39.963@LM_ERROR@Timed wait fails length test
[Details] 2022-11-19 22:43:39.963@LM_ERROR@Expected 4000 ms, actual 10753 ms; 1100 allowed

tests/Bug_2610_Regression_Test (Bug currently UNFIXED, This test may fail)

[Details] Error: Bug_2610_Regression_Test FAILED with exit status 1 after Time:0s
[Details] Error: (log/Bug_2610_Regression_Test.log): Svc_Handler leakage detected, 3 objects remain
[Details] Error (log/Bug_2610_Regression_Test.log): no line with 'Ending'
[Details] 2022-11-19 22:44:09.734@LM_ERROR@Svc_Handler leakage detected, 3 objects remain

tests/Bug_2740_Regression_Test

[Details] ERROR: Bug_2740_Regression_Test timedout
======= Begin stuck stacks =======
[New LWP 477831]
[New LWP 477832]
[New LWP 477833]
[New LWP 477834]
[Thread debugging using libthread_db enabled]
Using host libthread_db library "/lib/x86_64-linux-gnu/libthread_db.so.1".
__futex_abstimed_wait_common64 (private=0, cancel=true, abstime=0x0, op=393, expected=0, futex_word=0x564e277b54e8) at ./nptl/futex-internal.c:57
57 ./nptl/futex-internal.c: No such file or directory.

Thread 5 (Thread 0x7f4284ae2640 (LWP 477834) "Bug_2740_Regres"):
#0 0x00007f4287c116db in __libc_connect (fd=16, addr=..., len=16) at ../sysdeps/unix/sysv/linux/connect.c:26
#1 0x00007f4288241741 in ACE_OS::connect (handle=16, addr=0x564e277c8e28, addrlen=16) at /tao_builds/jenkins/workspace/doc_ace6tao2_wiro_linux_clang_d1o0/ACE/ace/OS_NS_sys_socket.inl:157
#2 0x00007f428827294d in ACE_SOCK_Connector::connect (this=0x7f4284ae1538, new_stream=..., remote_sap=..., timeout=0x0, local_sap=..., reuse_addr=0, protocol=0) at /tao_builds/jenkins/workspace/doc_ace6tao2_wiro_linux_clang_d1o0/ACE/ace/SOCK_Connector.cpp:212
#3 0x0000564e274d2404 in ACE_Connector<ClientSvcHandler, ACE_SOCK_Connector>::connect_svc_handler (this=0x7f4284ae14f8, svc_handler=@0x7f4284ae1568: 0x564e277c8d50, remote_addr=..., timeout=0x0, local_addr=..., reuse_addr=0, flags=2, perms=0) at /tao_builds/jenkins/workspace/doc_ace6tao2_wiro_linux_clang_d1o0/ACE/ace/Connector.cpp:299
#4 0x0000564e274d2663 in ACE_Connector<ClientSvcHandler, ACE_SOCK_Connector>::connect_i (this=0x7f4284ae14f8, sh=@0x7f4284ae1568: 0x564e277c8d50, sh_copy=0x0, remote_addr=..., synch_options=..., local_addr=..., reuse_addr=0, flags=2, perms=0) at /tao_builds/jenkins/workspace/doc_ace6tao2_wiro_linux_clang_d1o0/ACE/ace/Connector.cpp:419
#5 0x0000564e274ce13e in ACE_Connector<ClientSvcHandler, ACE_SOCK_Connector>::connect (this=0x7f4284ae14f8, sh=@0x7f4284ae1568: 0x564e277c8d50, remote_addr=..., synch_options=..., local_addr=..., reuse_addr=0, flags=2, perms=0) at /tao_builds/jenkins/workspace/doc_ace6tao2_wiro_linux_clang_d1o0/ACE/ace/Connector.cpp:358
#6 0x0000564e274cca94 in ClientSvcHandler::handle_close (this=0x564e277c8d50, handle=-1, mask=511) at /tao_builds/jenkins/workspace/doc_ace6tao2_wiro_linux_clang_d1o0/ACE/tests/Bug_2740_Regression_Test.cpp:212
#7 0x0000564e274ce5c4 in ACE_Svc_Handler<ACE_SOCK_Stream, ACE_NULL_SYNCH>::close (this=0x564e277c8d50) at /tao_builds/jenkins/workspace/doc_ace6tao2_wiro_linux_clang_d1o0/ACE/ace/Svc_Handler.cpp:320
#8 0x0000564e274d277c in ACE_Connector<ClientSvcHandler, ACE_SOCK_Connector>::connect_i (this=0x7f4284ae1708, sh=@0x7f4284ae1778: 0x564e277c8d50, sh_copy=0x0, remote_addr=..., synch_options=..., local_addr=..., reuse_addr=0, flags=2, perms=0) at /tao_builds/jenkins/workspace/doc_ace6tao2_wiro_linux_clang_d1o0/ACE/ace/Connector.cpp:469
#9 0x0000564e274ce13e in ACE_Connector<ClientSvcHandler, ACE_SOCK_Connector>::connect (this=0x7f4284ae1708, sh=@0x7f4284ae1778: 0x564e277c8d50, remote_addr=..., synch_options=..., local_addr=..., reuse_addr=0, flags=2, perms=0) at /tao_builds/jenkins/workspace/doc_ace6tao2_wiro_linux_clang_d1o0/ACE/ace/Connector.cpp:358
#10 0x0000564e274cca94 in ClientSvcHandler::handle_close (this=0x564e277c8d50, handle=-1, mask=511) at /tao_builds/jenkins/workspace/doc_ace6tao2_wiro_linux_clang_d1o0/ACE/tests/Bug_2740_Regression_Test.cpp:212
#11 0x0000564e274ce5c4 in ACE_Svc_Handler<ACE_SOCK_Stream, ACE_NULL_SYNCH>::close (this=0x564e277c8d50) at /tao_builds/jenkins/workspace/doc_ace6tao2_wiro_linux_clang_d1o0/ACE/ace/Svc_Handler.cpp:320
#12 0x0000564e274d277c in ACE_Connector<ClientSvcHandler, ACE_SOCK_Connector>::connect_i (this=0x7f4284ae1918, sh=@0x7f4284ae1988: 0x564e277c8d50, sh_copy=0x0, remote_addr=..., synch_options=..., local_addr=..., reuse_addr=0, flags=2, perms=0) at /tao_builds/jenkins/workspace/doc_ace6tao2_wiro_linux_clang_d1o0/ACE/ace/Connector.cpp:469
#13 0x0000564e274ce13e in ACE_Connector<ClientSvcHandler, ACE_SOCK_Connector>::connect (this=0x7f4284ae1918, sh=@0x7f4284ae1988: 0x564e277c8d50, remote_addr=..., synch_options=..., local_addr=..., reuse_addr=0, flags=2, perms=0) at /tao_builds/jenkins/workspace/doc_ace6tao2_wiro_linux_clang_d1o0/ACE/ace/Connector.cpp:358
#14 0x0000564e274cca94 in ClientSvcHandler::handle_close (this=0x564e277c8d50, handle=16, mask=1) at /tao_builds/jenkins/workspace/doc_ace6tao2_wiro_linux_clang_d1o0/ACE/tests/Bug_2740_Regression_Test.cpp:212
#15 0x00007f42881f86f6 in ACE_Dev_Poll_Reactor::remove_handler_i (this=0x7ffc05f48130, handle=16, mask=1, repo_guard=..., eh=0x564e277c8d50) at /tao_builds/jenkins/workspace/doc_ace6tao2_wiro_linux_clang_d1o0/ACE/ace/Dev_Poll_Reactor.cpp:1637
#16 0x00007f42881f8511 in ACE_Dev_Poll_Reactor::dispatch_io_event (this=0x7ffc05f48130, guard=...) at /tao_builds/jenkins/workspace/doc_ace6tao2_wiro_linux_clang_d1o0/ACE/ace/Dev_Poll_Reactor.cpp:1334
#17 0x00007f42881f7cfc in ACE_Dev_Poll_Reactor::dispatch (this=0x7ffc05f48130, guard=...) at /tao_builds/jenkins/workspace/doc_ace6tao2_wiro_linux_clang_d1o0/ACE/ace/Dev_Poll_Reactor.cpp:1076
#18 0x00007f42881f7c9d in ACE_Dev_Poll_Reactor::handle_events_i (this=0x7ffc05f48130, max_wait_time=0x0, guard=...) at /tao_builds/jenkins/workspace/doc_ace6tao2_wiro_linux_clang_d1o0/ACE/ace/Dev_Poll_Reactor.cpp:1053
#19 0x00007f42881f7a94 in ACE_Dev_Poll_Reactor::handle_events (this=0x7ffc05f48130, max_wait_time=0x0) at /tao_builds/jenkins/workspace/doc_ace6tao2_wiro_linux_clang_d1o0/ACE/ace/Dev_Poll_Reactor.cpp:1009
#20 0x00007f428826d6f9 in ACE_Reactor::run_reactor_event_loop (this=0x7ffc05f48108, eh=0x0) at /tao_builds/jenkins/workspace/doc_ace6tao2_wiro_linux_clang_d1o0/ACE/ace/Reactor.cpp:218
#21 0x0000564e274ccfa0 in event_loop (arg=0x7ffc05f48108) at /tao_builds/jenkins/workspace/doc_ace6tao2_wiro_linux_clang_d1o0/ACE/tests/Bug_2740_Regression_Test.cpp:320
#22 0x00007f428829969e in ACE_Thread_Adapter::invoke_i (this=0x564e277b3c70) at /tao_builds/jenkins/workspace/doc_ace6tao2_wiro_linux_clang_d1o0/ACE/ace/Thread_Adapter.cpp:161
#23 0x00007f4288299574 in ACE_Thread_Adapter::invoke (this=0x564e277b3c70) at /tao_builds/jenkins/workspace/doc_ace6tao2_wiro_linux_clang_d1o0/ACE/ace/Thread_Adapter.cpp:96
#24 0x00007f42881cebde in ace_thread_adapter (args=0x564e277b3c70) at /tao_builds/jenkins/workspace/doc_ace6tao2_wiro_linux_clang_d1o0/ACE/ace/Base_Thread_Adapter.cpp:124
#25 0x00007f4287b7eb43 in start_thread (arg=<optimized out>) at ./nptl/pthread_create.c:442
#26 0x00007f4287c10a00 in clone3 () at ../sysdeps/unix/sysv/linux/x86_64/clone3.S:81

Thread 4 (Thread 0x7f42852e3640 (LWP 477833) "Bug_2740_Regres"):
#0 0x00007f4287c116db in __libc_connect (fd=19, addr=..., len=16) at ../sysdeps/unix/sysv/linux/connect.c:26
#1 0x00007f4288241741 in ACE_OS::connect (handle=19, addr=0x564e277c9038, addrlen=16) at /tao_builds/jenkins/workspace/doc_ace6tao2_wiro_linux_clang_d1o0/ACE/ace/OS_NS_sys_socket.inl:157
#2 0x00007f428827294d in ACE_SOCK_Connector::connect (this=0x7f42852e2538, new_stream=..., remote_sap=..., timeout=0x0, local_sap=..., reuse_addr=0, protocol=0) at /tao_builds/jenkins/workspace/doc_ace6tao2_wiro_linux_clang_d1o0/ACE/ace/SOCK_Connector.cpp:212
#3 0x0000564e274d2404 in ACE_Connector<ClientSvcHandler, ACE_SOCK_Connector>::connect_svc_handler (this=0x7f42852e24f8, svc_handler=@0x7f42852e2568: 0x564e277c8f60, remote_addr=..., timeout=0x0, local_addr=..., reuse_addr=0, flags=2, perms=0) at /tao_builds/jenkins/workspace/doc_ace6tao2_wiro_linux_clang_d1o0/ACE/ace/Connector.cpp:299
#4 0x0000564e274d2663 in ACE_Connector<ClientSvcHandler, ACE_SOCK_Connector>::connect_i (this=0x7f42852e24f8, sh=@0x7f42852e2568: 0x564e277c8f60, sh_copy=0x0, remote_addr=..., synch_options=..., local_addr=..., reuse_addr=0, flags=2, perms=0) at /tao_builds/jenkins/workspace/doc_ace6tao2_wiro_linux_clang_d1o0/ACE/ace/Connector.cpp:419
#5 0x0000564e274ce13e in ACE_Connector<ClientSvcHandler, ACE_SOCK_Connector>::connect (this=0x7f42852e24f8, sh=@0x7f42852e2568: 0x564e277c8f60, remote_addr=..., synch_options=..., local_addr=..., reuse_addr=0, flags=2, perms=0) at /tao_builds/jenkins/workspace/doc_ace6tao2_wiro_linux_clang_d1o0/ACE/ace/Connector.cpp:358
#6 0x0000564e274cca94 in ClientSvcHandler::handle_close (this=0x564e277c8f60, handle=-1, mask=511) at /tao_builds/jenkins/workspace/doc_ace6tao2_wiro_linux_clang_d1o0/ACE/tests/Bug_2740_Regression_Test.cpp:212
#7 0x0000564e274ce5c4 in ACE_Svc_Handler<ACE_SOCK_Stream, ACE_NULL_SYNCH>::close (this=0x564e277c8f60) at /tao_builds/jenkins/workspace/doc_ace6tao2_wiro_linux_clang_d1o0/ACE/ace/Svc_Handler.cpp:320
#8 0x0000564e274d277c in ACE_Connector<ClientSvcHandler, ACE_SOCK_Connector>::connect_i (this=0x7f42852e2708, sh=@0x7f42852e2778: 0x564e277c8f60, sh_copy=0x0, remote_addr=..., synch_options=..., local_addr=..., reuse_addr=0, flags=2, perms=0) at /tao_builds/jenkins/workspace/doc_ace6tao2_wiro_linux_clang_d1o0/ACE/ace/Connector.cpp:469
#9 0x0000564e274ce13e in ACE_Connector<ClientSvcHandler, ACE_SOCK_Connector>::connect (this=0x7f42852e2708, sh=@0x7f42852e2778: 0x564e277c8f60, remote_addr=..., synch_options=..., local_addr=..., reuse_addr=0, flags=2, perms=0) at /tao_builds/jenkins/workspace/doc_ace6tao2_wiro_linux_clang_d1o0/ACE/ace/Connector.cpp:358
#10 0x0000564e274cca94 in ClientSvcHandler::handle_close (this=0x564e277c8f60, handle=-1, mask=511) at /tao_builds/jenkins/workspace/doc_ace6tao2_wiro_linux_clang_d1o0/ACE/tests/Bug_2740_Regression_Test.cpp:212
#11 0x0000564e274ce5c4 in ACE_Svc_Handler<ACE_SOCK_Stream, ACE_NULL_SYNCH>::close (this=0x564e277c8f60) at /tao_builds/jenkins/workspace/doc_ace6tao2_wiro_linux_clang_d1o0/ACE/ace/Svc_Handler.cpp:320
#12 0x0000564e274d277c in ACE_Connector<ClientSvcHandler, ACE_SOCK_Connector>::connect_i (this=0x7f42852e2918, sh=@0x7f42852e2988: 0x564e277c8f60, sh_copy=0x0, remote_addr=..., synch_options=..., local_addr=..., reuse_addr=0, flags=2, perms=0) at /tao_builds/jenkins/workspace/doc_ace6tao2_wiro_linux_clang_d1o0/ACE/ace/Connector.cpp:469
#13 0x0000564e274ce13e in ACE_Connector<ClientSvcHandler, ACE_SOCK_Connector>::connect (this=0x7f42852e2918, sh=@0x7f42852e2988: 0x564e277c8f60, remote_addr=..., synch_options=..., local_addr=..., reuse_addr=0, flags=2, perms=0) at /tao_builds/jenkins/workspace/doc_ace6tao2_wiro_linux_clang_d1o0/ACE/ace/Connector.cpp:358
#14 0x0000564e274cca94 in ClientSvcHandler::handle_close (this=0x564e277c8f60, handle=13, mask=1) at /tao_builds/jenkins/workspace/doc_ace6tao2_wiro_linux_clang_d1o0/ACE/tests/Bug_2740_Regression_Test.cpp:212
#15 0x00007f42881f86f6 in ACE_Dev_Poll_Reactor::remove_handler_i (this=0x7ffc05f48130, handle=13, mask=1, repo_guard=..., eh=0x564e277c8f60) at /tao_builds/jenkins/workspace/doc_ace6tao2_wiro_linux_clang_d1o0/ACE/ace/Dev_Poll_Reactor.cpp:1637
#16 0x00007f42881f8511 in ACE_Dev_Poll_Reactor::dispatch_io_event (this=0x7ffc05f48130, guard=...) at /tao_builds/jenkins/workspace/doc_ace6tao2_wiro_linux_clang_d1o0/ACE/ace/Dev_Poll_Reactor.cpp:1334
#17 0x00007f42881f7cfc in ACE_Dev_Poll_Reactor::dispatch (this=0x7ffc05f48130, guard=...) at /tao_builds/jenkins/workspace/doc_ace6tao2_wiro_linux_clang_d1o0/ACE/ace/Dev_Poll_Reactor.cpp:1076
#18 0x00007f42881f7c9d in ACE_Dev_Poll_Reactor::handle_events_i (this=0x7ffc05f48130, max_wait_time=0x0, guard=...) at /tao_builds/jenkins/workspace/doc_ace6tao2_wiro_linux_clang_d1o0/ACE/ace/Dev_Poll_Reactor.cpp:1053
#19 0x00007f42881f7a94 in ACE_Dev_Poll_Reactor::handle_events (this=0x7ffc05f48130, max_wait_time=0x0) at /tao_builds/jenkins/workspace/doc_ace6tao2_wiro_linux_clang_d1o0/ACE/ace/Dev_Poll_Reactor.cpp:1009
#20 0x00007f428826d6f9 in ACE_Reactor::run_reactor_event_loop (this=0x7ffc05f48108, eh=0x0) at /tao_builds/jenkins/workspace/doc_ace6tao2_wiro_linux_clang_d1o0/ACE/ace/Reactor.cpp:218
#21 0x0000564e274ccfa0 in event_loop (arg=0x7ffc05f48108) at /tao_builds/jenkins/workspace/doc_ace6tao2_wiro_linux_clang_d1o0/ACE/tests/Bug_2740_Regression_Test.cpp:320
#22 0x00007f428829969e in ACE_Thread_Adapter::invoke_i (this=0x564e277b5be0) at /tao_builds/jenkins/workspace/doc_ace6tao2_wiro_linux_clang_d1o0/ACE/ace/Thread_Adapter.cpp:161
#23 0x00007f4288299574 in ACE_Thread_Adapter::invoke (this=0x564e277b5be0) at /tao_builds/jenkins/workspace/doc_ace6tao2_wiro_linux_clang_d1o0/ACE/ace/Thread_Adapter.cpp:96
#24 0x00007f42881cebde in ace_thread_adapter (args=0x564e277b5be0) at /tao_builds/jenkins/workspace/doc_ace6tao2_wiro_linux_clang_d1o0/ACE/ace/Base_Thread_Adapter.cpp:124
#25 0x00007f4287b7eb43 in start_thread (arg=<optimized out>) at ./nptl/pthread_create.c:442
#26 0x00007f4287c10a00 in clone3 () at ../sysdeps/unix/sysv/linux/x86_64/clone3.S:81

Thread 3 (Thread 0x7f4285ae4640 (LWP 477832) "Bug_2740_Regres"):
#0 0x00007f4287c116db in __libc_connect (fd=17, addr=..., len=16) at ../sysdeps/unix/sysv/linux/connect.c:26
#1 0x00007f4288241741 in ACE_OS::connect (handle=17, addr=0x564e277c9458, addrlen=16) at /tao_builds/jenkins/workspace/doc_ace6tao2_wiro_linux_clang_d1o0/ACE/ace/OS_NS_sys_socket.inl:157
#2 0x00007f428827294d in ACE_SOCK_Connector::connect (this=0x7f4285ae3538, new_stream=..., remote_sap=..., timeout=0x0, local_sap=..., reuse_addr=0, protocol=0) at /tao_builds/jenkins/workspace/doc_ace6tao2_wiro_linux_clang_d1o0/ACE/ace/SOCK_Connector.cpp:212
#3 0x0000564e274d2404 in ACE_Connector<ClientSvcHandler, ACE_SOCK_Connector>::connect_svc_handler (this=0x7f4285ae34f8, svc_handler=@0x7f4285ae3568: 0x564e277c9380, remote_addr=..., timeout=0x0, local_addr=..., reuse_addr=0, flags=2, perms=0) at /tao_builds/jenkins/workspace/doc_ace6tao2_wiro_linux_clang_d1o0/ACE/ace/Connector.cpp:299
#4 0x0000564e274d2663 in ACE_Connector<ClientSvcHandler, ACE_SOCK_Connector>::connect_i (this=0x7f4285ae34f8, sh=@0x7f4285ae3568: 0x564e277c9380, sh_copy=0x0, remote_addr=..., synch_options=..., local_addr=..., reuse_addr=0, flags=2, perms=0) at /tao_builds/jenkins/workspace/doc_ace6tao2_wiro_linux_clang_d1o0/ACE/ace/Connector.cpp:419
#5 0x0000564e274ce13e in ACE_Connector<ClientSvcHandler, ACE_SOCK_Connector>::connect (this=0x7f4285ae34f8, sh=@0x7f4285ae3568: 0x564e277c9380, remote_addr=..., synch_options=..., local_addr=..., reuse_addr=0, flags=2, perms=0) at /tao_builds/jenkins/workspace/doc_ace6tao2_wiro_linux_clang_d1o0/ACE/ace/Connector.cpp:358
#6 0x0000564e274cca94 in ClientSvcHandler::handle_close (this=0x564e277c9380, handle=-1, mask=511) at /tao_builds/jenkins/workspace/doc_ace6tao2_wiro_linux_clang_d1o0/ACE/tests/Bug_2740_Regression_Test.cpp:212
#7 0x0000564e274ce5c4 in ACE_Svc_Handler<ACE_SOCK_Stream, ACE_NULL_SYNCH>::close (this=0x564e277c9380) at /tao_builds/jenkins/workspace/doc_ace6tao2_wiro_linux_clang_d1o0/ACE/ace/Svc_Handler.cpp:320
#8 0x0000564e274d277c in ACE_Connector<ClientSvcHandler, ACE_SOCK_Connector>::connect_i (this=0x7f4285ae3708, sh=@0x7f4285ae3778: 0x564e277c9380, sh_copy=0x0, remote_addr=..., synch_options=..., local_addr=..., reuse_addr=0, flags=2, perms=0) at /tao_builds/jenkins/workspace/doc_ace6tao2_wiro_linux_clang_d1o0/ACE/ace/Connector.cpp:469
#9 0x0000564e274ce13e in ACE_Connector<ClientSvcHandler, ACE_SOCK_Connector>::connect (this=0x7f4285ae3708, sh=@0x7f4285ae3778: 0x564e277c9380, remote_addr=..., synch_options=..., local_addr=..., reuse_addr=0, flags=2, perms=0) at /tao_builds/jenkins/workspace/doc_ace6tao2_wiro_linux_clang_d1o0/ACE/ace/Connector.cpp:358
#10 0x0000564e274cca94 in ClientSvcHandler::handle_close (this=0x564e277c9380, handle=-1, mask=511) at /tao_builds/jenkins/workspace/doc_ace6tao2_wiro_linux_clang_d1o0/ACE/tests/Bug_2740_Regression_Test.cpp:212
#11 0x0000564e274ce5c4 in ACE_Svc_Handler<ACE_SOCK_Stream, ACE_NULL_SYNCH>::close (this=0x564e277c9380) at /tao_builds/jenkins/workspace/doc_ace6tao2_wiro_linux_clang_d1o0/ACE/ace/Svc_Handler.cpp:320
#12 0x0000564e274d277c in ACE_Connector<ClientSvcHandler, ACE_SOCK_Connector>::connect_i (this=0x7f4285ae3918, sh=@0x7f4285ae3988: 0x564e277c9380, sh_copy=0x0, remote_addr=..., synch_options=..., local_addr=..., reuse_addr=0, flags=2, perms=0) at /tao_builds/jenkins/workspace/doc_ace6tao2_wiro_linux_clang_d1o0/ACE/ace/Connector.cpp:469
#13 0x0000564e274ce13e in ACE_Connector<ClientSvcHandler, ACE_SOCK_Connector>::connect (this=0x7f4285ae3918, sh=@0x7f4285ae3988: 0x564e277c9380, remote_addr=..., synch_options=..., local_addr=..., reuse_addr=0, flags=2, perms=0) at /tao_builds/jenkins/workspace/doc_ace6tao2_wiro_linux_clang_d1o0/ACE/ace/Connector.cpp:358
#14 0x0000564e274cca94 in ClientSvcHandler::handle_close (this=0x564e277c9380, handle=21, mask=1) at /tao_builds/jenkins/workspace/doc_ace6tao2_wiro_linux_clang_d1o0/ACE/tests/Bug_2740_Regression_Test.cpp:212
#15 0x00007f42881f86f6 in ACE_Dev_Poll_Reactor::remove_handler_i (this=0x7ffc05f48130, handle=21, mask=1, repo_guard=..., eh=0x564e277c9380) at /tao_builds/jenkins/workspace/doc_ace6tao2_wiro_linux_clang_d1o0/ACE/ace/Dev_Poll_Reactor.cpp:1637
#16 0x00007f42881f8511 in ACE_Dev_Poll_Reactor::dispatch_io_event (this=0x7ffc05f48130, guard=...) at /tao_builds/jenkins/workspace/doc_ace6tao2_wiro_linux_clang_d1o0/ACE/ace/Dev_Poll_Reactor.cpp:1334
#17 0x00007f42881f7cfc in ACE_Dev_Poll_Reactor::dispatch (this=0x7ffc05f48130, guard=...) at /tao_builds/jenkins/workspace/doc_ace6tao2_wiro_linux_clang_d1o0/ACE/ace/Dev_Poll_Reactor.cpp:1076
#18 0x00007f42881f7c9d in ACE_Dev_Poll_Reactor::handle_events_i (this=0x7ffc05f48130, max_wait_time=0x0, guard=...) at /tao_builds/jenkins/workspace/doc_ace6tao2_wiro_linux_clang_d1o0/ACE/ace/Dev_Poll_Reactor.cpp:1053
#19 0x00007f42881f7a94 in ACE_Dev_Poll_Reactor::handle_events (this=0x7ffc05f48130, max_wait_time=0x0) at /tao_builds/jenkins/workspace/doc_ace6tao2_wiro_linux_clang_d1o0/ACE/ace/Dev_Poll_Reactor.cpp:1009
#20 0x00007f428826d6f9 in ACE_Reactor::run_reactor_event_loop (this=0x7ffc05f48108, eh=0x0) at /tao_builds/jenkins/workspace/doc_ace6tao2_wiro_linux_clang_d1o0/ACE/ace/Reactor.cpp:218
#21 0x0000564e274ccfa0 in event_loop (arg=0x7ffc05f48108) at /tao_builds/jenkins/workspace/doc_ace6tao2_wiro_linux_clang_d1o0/ACE/tests/Bug_2740_Regression_Test.cpp:320
#22 0x00007f428829969e in ACE_Thread_Adapter::invoke_i (this=0x564e277b5990) at /tao_builds/jenkins/workspace/doc_ace6tao2_wiro_linux_clang_d1o0/ACE/ace/Thread_Adapter.cpp:161
#23 0x00007f4288299574 in ACE_Thread_Adapter::invoke (this=0x564e277b5990) at /tao_builds/jenkins/workspace/doc_ace6tao2_wiro_linux_clang_d1o0/ACE/ace/Thread_Adapter.cpp:96
#24 0x00007f42881cebde in ace_thread_adapter (args=0x564e277b5990) at /tao_builds/jenkins/workspace/doc_ace6tao2_wiro_linux_clang_d1o0/ACE/ace/Base_Thread_Adapter.cpp:124
#25 0x00007f4287b7eb43 in start_thread (arg=<optimized out>) at ./nptl/pthread_create.c:442
#26 0x00007f4287c10a00 in clone3 () at ../sysdeps/unix/sysv/linux/x86_64/clone3.S:81

Thread 2 (Thread 0x7f42862e5640 (LWP 477831) "Bug_2740_Regres"):
#0 0x00007f4287c116db in __libc_connect (fd=18, addr=..., len=16) at ../sysdeps/unix/sysv/linux/connect.c:26
#1 0x00007f4288241741 in ACE_OS::connect (handle=18, addr=0x564e277c9248, addrlen=16) at /tao_builds/jenkins/workspace/doc_ace6tao2_wiro_linux_clang_d1o0/ACE/ace/OS_NS_sys_socket.inl:157
#2 0x00007f428827294d in ACE_SOCK_Connector::connect (this=0x7f42862e4538, new_stream=..., remote_sap=..., timeout=0x0, local_sap=..., reuse_addr=0, protocol=0) at /tao_builds/jenkins/workspace/doc_ace6tao2_wiro_linux_clang_d1o0/ACE/ace/SOCK_Connector.cpp:212
#3 0x0000564e274d2404 in ACE_Connector<ClientSvcHandler, ACE_SOCK_Connector>::connect_svc_handler (this=0x7f42862e44f8, svc_handler=@0x7f42862e4568: 0x564e277c9170, remote_addr=..., timeout=0x0, local_addr=..., reuse_addr=0, flags=2, perms=0) at /tao_builds/jenkins/workspace/doc_ace6tao2_wiro_linux_clang_d1o0/ACE/ace/Connector.cpp:299
#4 0x0000564e274d2663 in ACE_Connector<ClientSvcHandler, ACE_SOCK_Connector>::connect_i (this=0x7f42862e44f8, sh=@0x7f42862e4568: 0x564e277c9170, sh_copy=0x0, remote_addr=..., synch_options=..., local_addr=..., reuse_addr=0, flags=2, perms=0) at /tao_builds/jenkins/workspace/doc_ace6tao2_wiro_linux_clang_d1o0/ACE/ace/Connector.cpp:419
#5 0x0000564e274ce13e in ACE_Connector<ClientSvcHandler, ACE_SOCK_Connector>::connect (this=0x7f42862e44f8, sh=@0x7f42862e4568: 0x564e277c9170, remote_addr=..., synch_options=..., local_addr=..., reuse_addr=0, flags=2, perms=0) at /tao_builds/jenkins/workspace/doc_ace6tao2_wiro_linux_clang_d1o0/ACE/ace/Connector.cpp:358
#6 0x0000564e274cca94 in ClientSvcHandler::handle_close (this=0x564e277c9170, handle=-1, mask=511) at /tao_builds/jenkins/workspace/doc_ace6tao2_wiro_linux_clang_d1o0/ACE/tests/Bug_2740_Regression_Test.cpp:212
#7 0x0000564e274ce5c4 in ACE_Svc_Handler<ACE_SOCK_Stream, ACE_NULL_SYNCH>::close (this=0x564e277c9170) at /tao_builds/jenkins/workspace/doc_ace6tao2_wiro_linux_clang_d1o0/ACE/ace/Svc_Handler.cpp:320
#8 0x0000564e274d277c in ACE_Connector<ClientSvcHandler, ACE_SOCK_Connector>::connect_i (this=0x7f42862e4708, sh=@0x7f42862e4778: 0x564e277c9170, sh_copy=0x0, remote_addr=..., synch_options=..., local_addr=..., reuse_addr=0, flags=2, perms=0) at /tao_builds/jenkins/workspace/doc_ace6tao2_wiro_linux_clang_d1o0/ACE/ace/Connector.cpp:469
#9 0x0000564e274ce13e in ACE_Connector<ClientSvcHandler, ACE_SOCK_Connector>::connect (this=0x7f42862e4708, sh=@0x7f42862e4778: 0x564e277c9170, remote_addr=..., synch_options=..., local_addr=..., reuse_addr=0, flags=2, perms=0) at /tao_builds/jenkins/workspace/doc_ace6tao2_wiro_linux_clang_d1o0/ACE/ace/Connector.cpp:358
#10 0x0000564e274cca94 in ClientSvcHandler::handle_close (this=0x564e277c9170, handle=-1, mask=511) at /tao_builds/jenkins/workspace/doc_ace6tao2_wiro_linux_clang_d1o0/ACE/tests/Bug_2740_Regression_Test.cpp:212
#11 0x0000564e274ce5c4 in ACE_Svc_Handler<ACE_SOCK_Stream, ACE_NULL_SYNCH>::close (this=0x564e277c9170) at /tao_builds/jenkins/workspace/doc_ace6tao2_wiro_linux_clang_d1o0/ACE/ace/Svc_Handler.cpp:320
#12 0x0000564e274d277c in ACE_Connector<ClientSvcHandler, ACE_SOCK_Connector>::connect_i (this=0x7f42862e4918, sh=@0x7f42862e4988: 0x564e277c9170, sh_copy=0x0, remote_addr=..., synch_options=..., local_addr=..., reuse_addr=0, flags=2, perms=0) at /tao_builds/jenkins/workspace/doc_ace6tao2_wiro_linux_clang_d1o0/ACE/ace/Connector.cpp:469
#13 0x0000564e274ce13e in ACE_Connector<ClientSvcHandler, ACE_SOCK_Connector>::connect (this=0x7f42862e4918, sh=@0x7f42862e4988: 0x564e277c9170, remote_addr=..., synch_options=..., local_addr=..., reuse_addr=0, flags=2, perms=0) at /tao_builds/jenkins/workspace/doc_ace6tao2_wiro_linux_clang_d1o0/ACE/ace/Connector.cpp:358
#14 0x0000564e274cca94 in ClientSvcHandler::handle_close (this=0x564e277c9170, handle=18, mask=1) at /tao_builds/jenkins/workspace/doc_ace6tao2_wiro_linux_clang_d1o0/ACE/tests/Bug_2740_Regression_Test.cpp:212
#15 0x00007f42881f86f6 in ACE_Dev_Poll_Reactor::remove_handler_i (this=0x7ffc05f48130, handle=18, mask=1, repo_guard=..., eh=0x564e277c9170) at /tao_builds/jenkins/workspace/doc_ace6tao2_wiro_linux_clang_d1o0/ACE/ace/Dev_Poll_Reactor.cpp:1637
#16 0x00007f42881f8511 in ACE_Dev_Poll_Reactor::dispatch_io_event (this=0x7ffc05f48130, guard=...) at /tao_builds/jenkins/workspace/doc_ace6tao2_wiro_linux_clang_d1o0/ACE/ace/Dev_Poll_Reactor.cpp:1334
#17 0x00007f42881f7cfc in ACE_Dev_Poll_Reactor::dispatch (this=0x7ffc05f48130, guard=...) at /tao_builds/jenkins/workspace/doc_ace6tao2_wiro_linux_clang_d1o0/ACE/ace/Dev_Poll_Reactor.cpp:1076
#18 0x00007f42881f7c9d in ACE_Dev_Poll_Reactor::handle_events_i (this=0x7ffc05f48130, max_wait_time=0x0, guard=...) at /tao_builds/jenkins/workspace/doc_ace6tao2_wiro_linux_clang_d1o0/ACE/ace/Dev_Poll_Reactor.cpp:1053
#19 0x00007f42881f7a94 in ACE_Dev_Poll_Reactor::handle_events (this=0x7ffc05f48130, max_wait_time=0x0) at /tao_builds/jenkins/workspace/doc_ace6tao2_wiro_linux_clang_d1o0/ACE/ace/Dev_Poll_Reactor.cpp:1009
#20 0x00007f428826d6f9 in ACE_Reactor::run_reactor_event_loop (this=0x7ffc05f48108, eh=0x0) at /tao_builds/jenkins/workspace/doc_ace6tao2_wiro_linux_clang_d1o0/ACE/ace/Reactor.cpp:218
#21 0x0000564e274ccfa0 in event_loop (arg=0x7ffc05f48108) at /tao_builds/jenkins/workspace/doc_ace6tao2_wiro_linux_clang_d1o0/ACE/tests/Bug_2740_Regression_Test.cpp:320
#22 0x00007f428829969e in ACE_Thread_Adapter::invoke_i (this=0x564e277b5740) at /tao_builds/jenkins/workspace/doc_ace6tao2_wiro_linux_clang_d1o0/ACE/ace/Thread_Adapter.cpp:161
#23 0x00007f4288299574 in ACE_Thread_Adapter::invoke (this=0x564e277b5740) at /tao_builds/jenkins/workspace/doc_ace6tao2_wiro_linux_clang_d1o0/ACE/ace/Thread_Adapter.cpp:96
#24 0x00007f42881cebde in ace_thread_adapter (args=0x564e277b5740) at /tao_builds/jenkins/workspace/doc_ace6tao2_wiro_linux_clang_d1o0/ACE/ace/Base_Thread_Adapter.cpp:124
#25 0x00007f4287b7eb43 in start_thread (arg=<optimized out>) at ./nptl/pthread_create.c:442
#26 0x00007f4287c10a00 in clone3 () at ../sysdeps/unix/sysv/linux/x86_64/clone3.S:81

Thread 1 (Thread 0x7f4287ae7740 (LWP 477830) "Bug_2740_Regres"):
#0 __futex_abstimed_wait_common64 (private=0, cancel=true, abstime=0x0, op=393, expected=0, futex_word=0x564e277b54e8) at ./nptl/futex-internal.c:57
#1 __futex_abstimed_wait_common (cancel=true, private=0, abstime=0x0, clockid=0, expected=0, futex_word=0x564e277b54e8) at ./nptl/futex-internal.c:87
#2 __GI___futex_abstimed_wait_cancelable64 (futex_word=futex_word@entry=0x564e277b54e8, expected=expected@entry=0, clockid=clockid@entry=0, abstime=abstime@entry=0x0, private=private@entry=0) at ./nptl/futex-internal.c:139
#3 0x00007f4287b7dac1 in __pthread_cond_wait_common (abstime=0x0, clockid=0, mutex=0x564e277b5490, cond=0x564e277b54c0) at ./nptl/pthread_cond_wait.c:503
#4 ___pthread_cond_wait (cond=0x564e277b54c0, mutex=0x564e277b5490) at ./nptl/pthread_cond_wait.c:627
#5 0x00007f42881e0b04 in ACE_OS::cond_timedwait (cv=0x564e277b54c0, external_mutex=0x564e277b5490, timeout=0x0) at /tao_builds/jenkins/workspace/doc_ace6tao2_wiro_linux_clang_d1o0/ACE/ace/OS_NS_Thread.inl:418
#6 0x00007f42881e0f45 in ACE_Condition<ACE_Thread_Mutex>::wait (this=0x564e277b54c0, mutex=..., abstime=0x0) at /tao_builds/jenkins/workspace/doc_ace6tao2_wiro_linux_clang_d1o0/ACE/ace/Condition_Thread_Mutex.cpp:94
#7 0x00007f42881e0f71 in ACE_Condition<ACE_Thread_Mutex>::wait (this=0x564e277b54c0, abstime=0x0) at /tao_builds/jenkins/workspace/doc_ace6tao2_wiro_linux_clang_d1o0/ACE/ace/Condition_Thread_Mutex.cpp:103
#8 0x00007f428829bb56 in ACE_Thread_Manager::wait (this=0x564e277b5440, timeout=0x0, abandon_detached_threads=false, use_absolute_time=true) at /tao_builds/jenkins/workspace/doc_ace6tao2_wiro_linux_clang_d1o0/ACE/ace/Thread_Manager.cpp:1782
#9 0x0000564e274cd808 in run_main () at /tao_builds/jenkins/workspace/doc_ace6tao2_wiro_linux_clang_d1o0/ACE/tests/Bug_2740_Regression_Test.cpp:370
#10 0x0000564e274d50a2 in main (argc=1, argv=0x7ffc05f483e8) at /tao_builds/jenkins/workspace/doc_ace6tao2_wiro_linux_clang_d1o0/ACE/tests/Main.cpp:23
[Inferior 1 (process 477830) detached]
======= End stuck stacks =======
[Details] Error: Bug_2740_Regression_Test FAILED (time out after Time:319s)
[Details] Error (log/Bug_2740_Regression_Test.log): no line with 'Ending'

tests/Bug_2772_Regression_Test (Bug currently UNFIXED, This test may fail)

[Details] ERROR: Bug_2772_Regression_Test timedout
======= Begin stuck stacks =======
[New LWP 477913]
[Thread debugging using libthread_db enabled]
Using host libthread_db library "/lib/x86_64-linux-gnu/libthread_db.so.1".
futex_wait (private=0, expected=2, futex_word=0x7ffc75843c88) at ../sysdeps/nptl/futex-internal.h:146
146 ../sysdeps/nptl/futex-internal.h: No such file or directory.

Thread 2 (Thread 0x7f2ec61bb640 (LWP 477913) "Bug_2772_Regres"):
#0 __futex_abstimed_wait_common64 (private=0, cancel=true, abstime=0x0, op=393, expected=0, futex_word=0x7ffc75843d1c) at ./nptl/futex-internal.c:57
#1 __futex_abstimed_wait_common (cancel=true, private=0, abstime=0x0, clockid=0, expected=0, futex_word=0x7ffc75843d1c) at ./nptl/futex-internal.c:87
#2 __GI___futex_abstimed_wait_cancelable64 (futex_word=futex_word@entry=0x7ffc75843d1c, expected=expected@entry=0, clockid=clockid@entry=0, abstime=abstime@entry=0x0, private=private@entry=0) at ./nptl/futex-internal.c:139
#3 0x00007f2ec6252ac1 in __pthread_cond_wait_common (abstime=0x0, clockid=0, mutex=0x7ffc75843c88, cond=0x7ffc75843cf0) at ./nptl/pthread_cond_wait.c:503
#4 ___pthread_cond_wait (cond=0x7ffc75843cf0, mutex=0x7ffc75843c88) at ./nptl/pthread_cond_wait.c:627
#5 0x00007f2ec68b5a4d in ACE_OS::cond_wait (cv=0x7ffc75843cf0, external_mutex=0x7ffc75843c88) at /tao_builds/jenkins/workspace/doc_ace6tao2_wiro_linux_clang_d1o0/ACE/ace/OS_NS_Thread.inl:385
#6 0x00007f2ec68b581b in ACE_Condition<ACE_Recursive_Thread_Mutex>::wait (this=0x7ffc75843cf0, mutex=..., abstime=0x0) at /tao_builds/jenkins/workspace/doc_ace6tao2_wiro_linux_clang_d1o0/ACE/ace/Condition_Recursive_Thread_Mutex.cpp:90
#7 0x00007f2ec68b57a1 in ACE_Condition<ACE_Recursive_Thread_Mutex>::wait (this=0x7ffc75843cf0, abstime=0x0) at /tao_builds/jenkins/workspace/doc_ace6tao2_wiro_linux_clang_d1o0/ACE/ace/Condition_Recursive_Thread_Mutex.cpp:66
#8 0x000055ed98599ebb in ThreadTest::workerThread (this=0x7ffc75843c88) at /tao_builds/jenkins/workspace/doc_ace6tao2_wiro_linux_clang_d1o0/ACE/tests/Bug_2772_Regression_Test.cpp:124
#9 0x000055ed98599d7d in ThreadTest::workerThreadWrapper (data=0x7ffc75843c88) at /tao_builds/jenkins/workspace/doc_ace6tao2_wiro_linux_clang_d1o0/ACE/tests/Bug_2772_Regression_Test.cpp:100
#10 0x00007f2ec6918457 in ACE_OS_Thread_Adapter::invoke (this=0x55ed98f31f40) at /tao_builds/jenkins/workspace/doc_ace6tao2_wiro_linux_clang_d1o0/ACE/ace/OS_Thread_Adapter.cpp:107
#11 0x00007f2ec68a3bde in ace_thread_adapter (args=0x55ed98f31f40) at /tao_builds/jenkins/workspace/doc_ace6tao2_wiro_linux_clang_d1o0/ACE/ace/Base_Thread_Adapter.cpp:124
#12 0x00007f2ec6253b43 in start_thread (arg=<optimized out>) at ./nptl/pthread_create.c:442
#13 0x00007f2ec62e5a00 in clone3 () at ../sysdeps/unix/sysv/linux/x86_64/clone3.S:81

Thread 1 (Thread 0x7f2ec61bc740 (LWP 477911) "Bug_2772_Regres"):
#0 futex_wait (private=0, expected=2, futex_word=0x7ffc75843c88) at ../sysdeps/nptl/futex-internal.h:146
#1 __GI___lll_lock_wait (futex=futex@entry=0x7ffc75843c88, private=0) at ./nptl/lowlevellock.c:49
#2 0x00007f2ec625639c in __pthread_mutex_cond_lock (mutex=mutex@entry=0x7ffc75843c88) at ../nptl/pthread_mutex_lock.c:128
#3 0x00007f2ec62529b4 in __pthread_cond_wait_common (abstime=0x0, clockid=0, mutex=0x7ffc75843c88, cond=0x7ffc75843cb8) at ./nptl/pthread_cond_wait.c:616
#4 ___pthread_cond_wait (cond=0x7ffc75843cb8, mutex=0x7ffc75843c88) at ./nptl/pthread_cond_wait.c:627
#5 0x00007f2ec68b5a4d in ACE_OS::cond_wait (cv=0x7ffc75843cb8, external_mutex=0x7ffc75843c88) at /tao_builds/jenkins/workspace/doc_ace6tao2_wiro_linux_clang_d1o0/ACE/ace/OS_NS_Thread.inl:385
#6 0x00007f2ec68b581b in ACE_Condition<ACE_Recursive_Thread_Mutex>::wait (this=0x7ffc75843cb8, mutex=..., abstime=0x0) at /tao_builds/jenkins/workspace/doc_ace6tao2_wiro_linux_clang_d1o0/ACE/ace/Condition_Recursive_Thread_Mutex.cpp:90
#7 0x00007f2ec68b57a1 in ACE_Condition<ACE_Recursive_Thread_Mutex>::wait (this=0x7ffc75843cb8, abstime=0x0) at /tao_builds/jenkins/workspace/doc_ace6tao2_wiro_linux_clang_d1o0/ACE/ace/Condition_Recursive_Thread_Mutex.cpp:66
#8 0x000055ed98599bf9 in ThreadTest::run (this=0x7ffc75843c88, doubleLock=true) at /tao_builds/jenkins/workspace/doc_ace6tao2_wiro_linux_clang_d1o0/ACE/tests/Bug_2772_Regression_Test.cpp:74
#9 0x000055ed9859a39f in run_main () at /tao_builds/jenkins/workspace/doc_ace6tao2_wiro_linux_clang_d1o0/ACE/tests/Bug_2772_Regression_Test.cpp:158
#10 0x000055ed9859a6b2 in main (argc=1, argv=0x7ffc75843eb8) at /tao_builds/jenkins/workspace/doc_ace6tao2_wiro_linux_clang_d1o0/ACE/tests/Main.cpp:23
[Inferior 1 (process 477911) detached]
======= End stuck stacks =======
[Details] Error: Bug_2772_Regression_Test FAILED (time out after Time:317s)
[Details] Error (log/Bug_2772_Regression_Test.log): no line with 'Ending'

tests/Bug_3911_Regression_Test (Bug currently UNFIXED, This test may fail)

[Details] ERROR: <Bug_3911_Regression_Test> exited with coredump from signal 11 : SEGV
[Details] Error: Bug_3911_Regression_Test FAILED with exit status 255 after Time:0s
[Details] Error (log/Bug_3911_Regression_Test.log): no line with 'Ending'

tests/Reactor_Fairness_Test (Bug currently UNFIXED, This test may fail)

[Details] Error: Reactor_Fairness_Test FAILED with exit status 1 after Time:92s
[Details] Error: (log/Reactor_Fairness_Test.log): Too much unfairness (max 128886, min 0)
[Details] 2022-11-19 23:04:56.790@LM_ERROR@Too much unfairness (max 128886, min 0)

tests/Semaphore_Test

[Details] Error: Semaphore_Test FAILED with exit status 1 after Time:26s
[Details] Error: (log/Semaphore_Test.log): Timed wait fails length test
[Details] Error: (log/Semaphore_Test.log): Expected 3000 ms, actual 9959 ms; 1100 allowed
[Details] 2022-11-19 23:08:39.965@LM_ERROR@Timed wait fails length test
[Details] 2022-11-19 23:08:39.965@LM_ERROR@Expected 3000 ms, actual 9959 ms; 1100 allowed

tests/Service_Config_Stream_Test (Bug currently UNFIXED, This test may fail)

[Details] ERROR: <Service_Config_Stream_Test> exited with coredump from signal 11 : SEGV
[Details] Error: Service_Config_Stream_Test FAILED with exit status 255 after Time:0s

tests/TSS_Leak_Test (Bug currently UNFIXED, This test may fail)

[Details] Error: TSS_Leak_Test FAILED with exit status 1 after Time:0s
[Details] Error: (log/TSS_Leak_Test.log): ERROR: 1 X objects (should be 0)
[Details] 2022-11-19 23:09:23.848@LM_ERROR@ERROR: 1 X objects (should be 0)

tests/non_mpc_makefile/Bug_3708_Regression.pl

[Details] make: clang++: No such file or directory
[Details] make: clang++: No such file or directory

TAO/tests/Bug_1551_Regression/run_test.pl

[Details] ERROR - Timeout waiting for client threads
[Details] ERROR - Timeout waiting for client threads
[Details] ERROR - Timeout waiting for client threads
[Details] ERROR: client returned 1
[Details] Error: TAO/tests/Bug_1551_Regression/run_test.pl returned with status 1

TAO/tests/Bug_2085_Regression/run_test.pl (Bug currently UNFIXED, This test may fail)

[Details] (586059) ERROR, test_string_to_object for <> didn't result in minor code 7
[Details] (586059) ERROR, test_string_to_object for <> didn't result in minor code 8
[Details] (586059) ERROR, test_string_to_object for <> didn't result in minor code 9
[Details] (586059) ERROR, test_string_to_object for <> didn't result in minor code 10
[Details] ERROR: test returned 4
[Details] Error: TAO/tests/Bug_2085_Regression/run_test.pl returned with status 1

TAO/tests/Bug_2319_Regression/run_test.pl (Bug currently UNFIXED, This test may fail)

[Details] ERROR: <server> exited with coredump from signal 11 : SEGV
[Details] ERROR: test returned 255
[Details] Error: TAO/tests/Bug_2319_Regression/run_test.pl returned with status 1

TAO/tests/Bug_2543_Regression/run_test.pl (Bug currently UNFIXED, This test may fail)

[Details] Error: extract out of any failed
[Details] ERROR: test returned 1
[Details] Error: TAO/tests/Bug_2543_Regression/run_test.pl returned with status 1

TAO/tests/Bug_3566_Regression/run_test.pl (Bug currently UNFIXED, This test may fail)

[Details] (588495|588495) EXCEPTION, Exception caught:

TAO/tests/Bug_3647_Regression/run_test.pl

[Details] client(588534|588534) - running pings............client(588534|588534) EXCEPTION, Exception caught:
[Details] ERROR: client returned 1
[Details] ERROR: middle_server timedout
======= Begin stuck stacks =======
[Thread debugging using libthread_db enabled]
Using host libthread_db library "/lib/x86_64-linux-gnu/libthread_db.so.1".
0x00007f883d03d74d in __GI___select (nfds=6, readfds=0x55b5407763a8, writefds=0x0, exceptfds=0x0, timeout=0x0) at ../sysdeps/unix/sysv/linux/select.c:69
69 ../sysdeps/unix/sysv/linux/select.c: No such file or directory.

Thread 1 (Thread 0x7f883cf1d740 (LWP 588533) "middle_server"):
#0 0x00007f883d03d74d in __GI___select (nfds=6, readfds=0x55b5407763a8, writefds=0x0, exceptfds=0x0, timeout=0x0) at ../sysdeps/unix/sysv/linux/select.c:69
#1 0x00007f883e004bc1 in ACE_OS::select (width=6, rfds=0x55b5407763a8, wfds=0x0, efds=0x0, timeout=0x0) at /tao_builds/jenkins/workspace/doc_ace6tao2_wiro_linux_clang_d1o0/ACE/ace/OS_NS_sys_select.inl:42
#2 0x00007f883e009607 in ACE_Select_Reactor_T<ACE_Reactor_Token_T<ACE_Noop_Token> >::wait_for_multiple_events (this=0x55b540776360, dispatch_set=..., max_wait_time=0x0) at /tao_builds/jenkins/workspace/doc_ace6tao2_wiro_linux_clang_d1o0/ACE/ace/Select_Reactor_T.cpp:1109
#3 0x00007f883e00a498 in ACE_Select_Reactor_T<ACE_Reactor_Token_T<ACE_Noop_Token> >::handle_events_i (this=0x55b540776360, max_wait_time=0x0) at /tao_builds/jenkins/workspace/doc_ace6tao2_wiro_linux_clang_d1o0/ACE/ace/Select_Reactor_T.cpp:1459
#4 0x00007f883e0067d7 in ACE_Select_Reactor_T<ACE_Reactor_Token_T<ACE_Noop_Token> >::handle_events (this=0x55b540776360, max_wait_time=0x0) at /tao_builds/jenkins/workspace/doc_ace6tao2_wiro_linux_clang_d1o0/ACE/ace/Select_Reactor_T.cpp:1439
#5 0x00007f883d8e2716 in ACE_Reactor::handle_events (this=0x55b540775f50, max_wait_time=0x0) at /tao_builds/jenkins/workspace/doc_ace6tao2_wiro_linux_clang_d1o0/ACE/ace/Reactor.inl:185
#6 0x00007f883d900b81 in TAO_ORB_Core::run (this=0x55b54076f3e0, tv=0x0, perform_work=0) at /tao_builds/jenkins/workspace/doc_ace6tao2_wiro_linux_clang_d1o0/TAO/tao/ORB_Core.cpp:2320
#7 0x00007f883d8f1a24 in CORBA::ORB::run (this=0x55b540776bf0, tv=0x0) at /tao_builds/jenkins/workspace/doc_ace6tao2_wiro_linux_clang_d1o0/TAO/tao/ORB.cpp:186
#8 0x00007f883d8f19e9 in CORBA::ORB::run (this=0x55b540776bf0) at /tao_builds/jenkins/workspace/doc_ace6tao2_wiro_linux_clang_d1o0/TAO/tao/ORB.cpp:172
#9 0x000055b53f2bcfd5 in main (argc=9, argv=0x7ffda6e50778) at /tao_builds/jenkins/workspace/doc_ace6tao2_wiro_linux_clang_d1o0/TAO/tests/Bug_3647_Regression/middle_server.cpp:197
[Inferior 1 (process 588533) detached]
======= End stuck stacks =======
[Details] ERROR: middle returned -1
[Details] Error: TAO/tests/Bug_3647_Regression/run_test.pl returned with status 1

TAO/tests/OBV/Collocated/Forward/run_test.pl (Bug currently UNFIXED, This test may fail)

[Details] ERROR: tc == tc_result

TAO/tests/HandleExhaustion/run_test.pl

[Details] ERROR: client timedout
======= Begin stuck stacks =======
[Thread debugging using libthread_db enabled]
Using host libthread_db library "/lib/x86_64-linux-gnu/libthread_db.so.1".
0x00007fbe1f99f74d in __GI___select (nfds=6, readfds=0x5574f0617098, writefds=0x0, exceptfds=0x0, timeout=0x0) at ../sysdeps/unix/sysv/linux/select.c:69
69 ../sysdeps/unix/sysv/linux/select.c: No such file or directory.

Thread 1 (Thread 0x7fbe1f881740 (LWP 588884) "client"):
#0 0x00007fbe1f99f74d in __GI___select (nfds=6, readfds=0x5574f0617098, writefds=0x0, exceptfds=0x0, timeout=0x0) at ../sysdeps/unix/sysv/linux/select.c:69
#1 0x00007fbe1ff51c51 in ACE_OS::select (width=6, rfds=0x5574f0617098, wfds=0x0, efds=0x0, timeout=0x0) at /tao_builds/jenkins/workspace/doc_ace6tao2_wiro_linux_clang_d1o0/ACE/ace/OS_NS_sys_select.inl:42
#2 0x00007fbe1ff5ee87 in ACE_Select_Reactor_T<ACE_Reactor_Token_T<ACE_Token> >::wait_for_multiple_events (this=0x5574f0616b40, dispatch_set=..., max_wait_time=0x0) at /tao_builds/jenkins/workspace/doc_ace6tao2_wiro_linux_clang_d1o0/ACE/ace/Select_Reactor_T.cpp:1109
#3 0x00007fbe20030c50 in ACE_TP_Reactor::get_event_for_dispatching (this=0x5574f0616b40, max_wait_time=0x0) at /tao_builds/jenkins/workspace/doc_ace6tao2_wiro_linux_clang_d1o0/ACE/ace/TP_Reactor.cpp:444
#4 0x00007fbe20030a65 in ACE_TP_Reactor::dispatch_i (this=0x5574f0616b40, max_wait_time=0x0, guard=...) at /tao_builds/jenkins/workspace/doc_ace6tao2_wiro_linux_clang_d1o0/ACE/ace/TP_Reactor.cpp:178
#5 0x00007fbe200309e7 in ACE_TP_Reactor::handle_events (this=0x5574f0616b40, max_wait_time=0x0) at /tao_builds/jenkins/workspace/doc_ace6tao2_wiro_linux_clang_d1o0/ACE/ace/TP_Reactor.cpp:171
#6 0x00007fbe20244716 in ACE_Reactor::handle_events (this=0x5574f0616730, max_wait_time=0x0) at /tao_builds/jenkins/workspace/doc_ace6tao2_wiro_linux_clang_d1o0/ACE/ace/Reactor.inl:185
#7 0x00007fbe202438dc in TAO_Leader_Follower::wait_for_event (this=0x5574f06163d0, event=0x5574f06338a0, transport=0x5574f061af70, max_wait_time=0x0) at /tao_builds/jenkins/workspace/doc_ace6tao2_wiro_linux_clang_d1o0/TAO/tao/Leader_Follower.cpp:505
#8 0x00007fbe202c4ba6 in TAO_Wait_On_Leader_Follower::wait (this=0x5574f0633290, max_wait_time=0x0, rd=...) at /tao_builds/jenkins/workspace/doc_ace6tao2_wiro_linux_clang_d1o0/TAO/tao/Wait_On_Leader_Follower.cpp:66
#9 0x00007fbe20290ea3 in TAO::Synch_Twoway_Invocation::wait_for_reply (this=0x7fffa9fec0e0, max_wait_time=0x0, rd=..., bd=...) at /tao_builds/jenkins/workspace/doc_ace6tao2_wiro_linux_clang_d1o0/TAO/tao/Synch_Invocation.cpp:319
#10 0x00007fbe20290a0d in TAO::Synch_Twoway_Invocation::remote_twoway (this=0x7fffa9fec0e0, max_wait_time=0x0) at /tao_builds/jenkins/workspace/doc_ace6tao2_wiro_linux_clang_d1o0/TAO/tao/Synch_Invocation.cpp:230
#11 0x00007fbe2023a856 in TAO::Invocation_Adapter::invoke_twoway (this=0x7fffa9fec578, details=..., effective_target=..., r=..., max_wait_time=@0x7fffa9fec3c8: 0x0, retry_state=0x7fffa9fec340) at /tao_builds/jenkins/workspace/doc_ace6tao2_wiro_linux_clang_d1o0/TAO/tao/Invocation_Adapter.cpp:312
#12 0x00007fbe2023a6c4 in TAO::Invocation_Adapter::invoke_remote_i (this=0x7fffa9fec578, stub=0x5574f061a9b0, details=..., effective_target=..., max_wait_time=@0x7fffa9fec3c8: 0x0, retry_state=0x7fffa9fec340) at /tao_builds/jenkins/workspace/doc_ace6tao2_wiro_linux_clang_d1o0/TAO/tao/Invocation_Adapter.cpp:275
#13 0x00007fbe20239947 in TAO::Invocation_Adapter::invoke_i (this=0x7fffa9fec578, stub=0x5574f061a9b0, details=...) at /tao_builds/jenkins/workspace/doc_ace6tao2_wiro_linux_clang_d1o0/TAO/tao/Invocation_Adapter.cpp:98
#14 0x00007fbe202394fa in TAO::Invocation_Adapter::invoke (this=0x7fffa9fec578, ex_data=0x0, ex_count=0) at /tao_builds/jenkins/workspace/doc_ace6tao2_wiro_linux_clang_d1o0/TAO/tao/Invocation_Adapter.cpp:47
#15 0x00005574f03e46d0 in Test::simple (this=0x5574f061aaf0) at /tao_builds/jenkins/workspace/doc_ace6tao2_wiro_linux_clang_d1o0/TAO/tests/HandleExhaustion/TestC.cpp:110
#16 0x00005574f03e5fb7 in main (argc=3, argv=0x7fffa9fec7f8) at /tao_builds/jenkins/workspace/doc_ace6tao2_wiro_linux_clang_d1o0/TAO/tests/HandleExhaustion/client.cpp:74
[Inferior 1 (process 588884) detached]
======= End stuck stacks =======
[Details] ERROR: client returned -1
[Details] ERROR: server timedout
======= Begin stuck stacks =======
[Thread debugging using libthread_db enabled]
Using host libthread_db library "/lib/x86_64-linux-gnu/libthread_db.so.1".
__GI___pthread_sigmask (how=0, newmask=<optimized out>, oldmask=0x7fffdc7f1160) at ./nptl/pthread_sigmask.c:43
43 ./nptl/pthread_sigmask.c: No such file or directory.

Thread 1 (Thread 0x7f0d835e33c0 (LWP 588883) "server"):
#0 __GI___pthread_sigmask (how=0, newmask=<optimized out>, oldmask=0x7fffdc7f1160) at ./nptl/pthread_sigmask.c:43
#1 0x00007f0d83cc6043 in ACE_OS::thr_sigsetmask (how=0, nsm=0x56283dc36260, osm=0x7fffdc7f1160) at /tao_builds/jenkins/workspace/doc_ace6tao2_wiro_linux_clang_d1o0/ACE/ace/OS_NS_Thread.inl:3465
#2 0x00007f0d83cc5f62 in ACE_Sig_Guard::ACE_Sig_Guard (this=0x7fffdc7f1160, mask=0x0, condition=true) at /tao_builds/jenkins/workspace/doc_ace6tao2_wiro_linux_clang_d1o0/ACE/ace/Signal.inl:218
#3 0x00007f0d83cbe870 in ACE_Select_Reactor_T<ACE_Reactor_Token_T<ACE_Token> >::any_ready (this=0x56283dc52070, wait_set=...) at /tao_builds/jenkins/workspace/doc_ace6tao2_wiro_linux_clang_d1o0/ACE/ace/Select_Reactor_T.cpp:47
#4 0x00007f0d83cbed3b in ACE_Select_Reactor_T<ACE_Reactor_Token_T<ACE_Token> >::wait_for_multiple_events (this=0x56283dc52070, dispatch_set=..., max_wait_time=0x0) at /tao_builds/jenkins/workspace/doc_ace6tao2_wiro_linux_clang_d1o0/ACE/ace/Select_Reactor_T.cpp:1083
#5 0x00007f0d83d90c50 in ACE_TP_Reactor::get_event_for_dispatching (this=0x56283dc52070, max_wait_time=0x0) at /tao_builds/jenkins/workspace/doc_ace6tao2_wiro_linux_clang_d1o0/ACE/ace/TP_Reactor.cpp:444
#6 0x00007f0d83d90a65 in ACE_TP_Reactor::dispatch_i (this=0x56283dc52070, max_wait_time=0x0, guard=...) at /tao_builds/jenkins/workspace/doc_ace6tao2_wiro_linux_clang_d1o0/ACE/ace/TP_Reactor.cpp:178
#7 0x00007f0d83d909e7 in ACE_TP_Reactor::handle_events (this=0x56283dc52070, max_wait_time=0x0) at /tao_builds/jenkins/workspace/doc_ace6tao2_wiro_linux_clang_d1o0/ACE/ace/TP_Reactor.cpp:171
#8 0x00007f0d83fa4716 in ACE_Reactor::handle_events (this=0x56283dc51c60, max_wait_time=0x0) at /tao_builds/jenkins/workspace/doc_ace6tao2_wiro_linux_clang_d1o0/ACE/ace/Reactor.inl:185
#9 0x00007f0d83fc2b81 in TAO_ORB_Core::run (this=0x56283dc43fd0, tv=0x0, perform_work=0) at /tao_builds/jenkins/workspace/doc_ace6tao2_wiro_linux_clang_d1o0/TAO/tao/ORB_Core.cpp:2320
#10 0x00007f0d83fb3a24 in CORBA::ORB::run (this=0x56283dc44f20, tv=0x0) at /tao_builds/jenkins/workspace/doc_ace6tao2_wiro_linux_clang_d1o0/TAO/tao/ORB.cpp:186
#11 0x00007f0d83fb39e9 in CORBA::ORB::run (this=0x56283dc44f20) at /tao_builds/jenkins/workspace/doc_ace6tao2_wiro_linux_clang_d1o0/TAO/tao/ORB.cpp:172
#12 0x000056283d753fb5 in main (argc=3, argv=0x7fffdc8319e8) at /tao_builds/jenkins/workspace/doc_ace6tao2_wiro_linux_clang_d1o0/TAO/tests/HandleExhaustion/server.cpp:227
[Inferior 1 (process 588883) detached]
======= End stuck stacks =======
[Details] ERROR: server returned -1
[Details] ERROR: The error situation was not achieved
[Details] ERROR: The acceptor was not reregistered
[Details] Error: TAO/tests/HandleExhaustion/run_test.pl returned with status 3

TAO/tests/Muxed_GIOP_Versions/run_test.pl

[Details] (589084|589087) EXCEPTION, MT_Client: exception raised
[Details] (589084|589086) EXCEPTION, MT_Client: exception raised
[Details] (589084|589088) EXCEPTION, MT_Client: exception raised
[Details] (589084|589085) EXCEPTION, MT_Client: exception raised
[Details] (589084|589089) EXCEPTION, MT_Client: exception raised
[Details] (589084|589084) EXCEPTION, Caught exception:
[Details] ERROR: client returned 1
[Details] Error: TAO/tests/Muxed_GIOP_Versions/run_test.pl returned with status 1

TAO/tests/POA/Bug_1592_Regression/run_test.pl (Bug currently UNFIXED, This test may fail)

[Details] ERROR: PortableInterceptor::ServerRequestInterceptor
[Details] ERROR: ending interception point incorrectly called prior to
[Details] ERROR: PortableServer::ServantLocator::postinvoke().
[Details] ERROR: server returned 1
[Details] Error: TAO/tests/POA/Bug_1592_Regression/run_test.pl returned with status 1

TAO/tests/MT_Timeout/run_test.pl

[Details] (591996|592001) EXCEPTION, Exception caught:
[Details] (591996|591996) EXCEPTION, Exception caught:
[Details] ERROR: client returned 1
[Details] Error: TAO/tests/MT_Timeout/run_test.pl returned with status 1

TAO/DevGuideExamples/RTCORBA/run_test.pl

[Details] ERROR: cannot find file </tao_builds/jenkins/workspace/doc_ace6tao2_wiro_linux_clang_d1o0/TAO/DevGuideExamples/RTCORBA/Messenger.ior>
[Details] Error: TAO/DevGuideExamples/RTCORBA/run_test.pl returned with status 1

TAO/orbsvcs/tests/Bug_2112_Regression/run_test.pl

[Details] Error, caught transient exception
[Details] ERROR: test returned 1
[Details] Error: TAO/orbsvcs/tests/Bug_2112_Regression/run_test.pl returned with status 1

TAO/orbsvcs/tests/InterfaceRepo/Persistence_Test/run_test.pl (Bug currently UNFIXED, This test may fail)

[Details] (596278|596278) EXCEPTION, Ptest::run
[Details] ERROR: client returned 1
[Details] ERROR: </tao_builds/jenkins/workspace/doc_ace6tao2_wiro_linux_clang_d1o0/TAO/orbsvcs/IFR_Service/tao_ifr_service> exited with coredump from signal 11 : SEGV
[Details] ERROR: server returned 255
[Details] Error: TAO/orbsvcs/tests/InterfaceRepo/Persistence_Test/run_test.pl returned with status 1

TAO/orbsvcs/tests/ImplRepo/run_test.pl persistent_ir

[Details] TAO_ImR_Client (596382|596382) - ERROR: could not ImRify object with all profiles. Defaulting to ImR-ifying profile_in_use

TAO/orbsvcs/tests/ImplRepo/run_test.pl persistent_ir_hash

[Details] TAO_ImR_Client (596411|596411) - ERROR: could not ImRify object with all profiles. Defaulting to ImR-ifying profile_in_use

TAO/orbsvcs/tests/ImplRepo/run_test.pl persistent_ir_shared

[Details] TAO_ImR_Client (596425|596425) - ERROR: could not ImRify object with all profiles. Defaulting to ImR-ifying profile_in_use

TAO/orbsvcs/tests/ImplRepo/run_test.pl failover -replica

[Details] (596463|596463) EXCEPTION, get_planes
[Details] (596462|596462) EXCEPTION, get_planes
[Details] (596463|596463) EXCEPTION, get_planes
[Details] (596462|596462) EXCEPTION, get_planes
[Details] (596463|596463) EXCEPTION, get_planes
[Details] (596463|596463) EXCEPTION, get_planes
[Details] (596463|596463) EXCEPTION, get_planes
[Details] (596463|596463) EXCEPTION, get_planes
[Details] (596463|596463) EXCEPTION, get_planes
[Details] (596463|596463) EXCEPTION, get_planes
[Details] (596463|596463) EXCEPTION, get_planes
[Details] (596463|596463) EXCEPTION, get_planes
[Details] (596462|596462) EXCEPTION, get_planes
[Details] (596462|596462) EXCEPTION, get_planes
[Details] (596462|596462) EXCEPTION, get_planes
[Details] (596462|596462) EXCEPTION, get_planes
[Details] (596462|596462) EXCEPTION, get_planes
[Details] (596462|596462) EXCEPTION, get_planes
[Details] (596462|596462) EXCEPTION, get_planes
[Details] (596462|596462) EXCEPTION, get_planes
[Details] ERROR: Airplane Client 0 returned 1
[Details] ERROR: <airplane_client> still running upon object destruction
[Details] ERROR: </tao_builds/jenkins/workspace/doc_ace6tao2_wiro_linux_clang_d1o0/TAO/orbsvcs/ImplRepo_Service/tao_imr_activator> still running upon object destruction
[Details] ERROR: </tao_builds/jenkins/workspace/doc_ace6tao2_wiro_linux_clang_d1o0/TAO/orbsvcs/ImplRepo_Service/tao_imr_locator> still running upon object destruction
[Details] Error: TAO/orbsvcs/tests/ImplRepo/run_test.pl failover -replica returned with status 9

TAO/orbsvcs/tests/ImplRepo/run_test.pl backup_restart -replica

[Details] (596491|596491) EXCEPTION, get_planes
[Details] (596491|596491) EXCEPTION, get_planes
[Details] (596491|596491) EXCEPTION, get_planes
[Details] (596491|596491) EXCEPTION, get_planes
[Details] (596491|596491) EXCEPTION, get_planes
[Details] (596491|596491) EXCEPTION, get_planes
[Details] (596491|596491) EXCEPTION, get_planes
[Details] (596491|596491) EXCEPTION, get_planes
[Details] (596491|596491) EXCEPTION, get_planes
[Details] (596491|596491) EXCEPTION, get_planes
[Details] (596492|596492) EXCEPTION, get_planes
[Details] (596492|596492) EXCEPTION, get_planes
[Details] (596492|596492) EXCEPTION, get_planes
[Details] (596492|596492) EXCEPTION, get_planes
[Details] (596492|596492) EXCEPTION, get_planes
[Details] (596492|596492) EXCEPTION, get_planes
[Details] (596492|596492) EXCEPTION, get_planes
[Details] (596492|596492) EXCEPTION, get_planes
[Details] (596492|596492) EXCEPTION, get_planes
[Details] (596492|596492) EXCEPTION, get_planes
[Details] ERROR: Airplane Client 0 returned 1
[Details] ERROR: <airplane_client> still running upon object destruction
[Details] ERROR: </tao_builds/jenkins/workspace/doc_ace6tao2_wiro_linux_clang_d1o0/TAO/orbsvcs/ImplRepo_Service/tao_imr_activator> still running upon object destruction
[Details] ERROR: </tao_builds/jenkins/workspace/doc_ace6tao2_wiro_linux_clang_d1o0/TAO/orbsvcs/ImplRepo_Service/tao_imr_locator> still running upon object destruction
[Details] Error: TAO/orbsvcs/tests/ImplRepo/run_test.pl backup_restart -replica returned with status 9

TAO/orbsvcs/tests/ImplRepo/run_test.pl persistent_ft -replica

[Details] ERROR: cannot find file </tao_builds/jenkins/workspace/doc_ace6tao2_wiro_linux_clang_d1o0/TAO/orbsvcs/tests/ImplRepo/airplane0.ior>
[Details] ERROR: </tao_builds/jenkins/workspace/doc_ace6tao2_wiro_linux_clang_d1o0/TAO/orbsvcs/ImplRepo_Service/tao_imr_locator> still running upon object destruction
[Details] Error: TAO/orbsvcs/tests/ImplRepo/run_test.pl persistent_ft -replica returned with status 9

TAO/orbsvcs/tests/ImplRepo/run_test.pl persistent_listingcorrupt -replica

[Details] ERROR: cannot find file </tao_builds/jenkins/workspace/doc_ace6tao2_wiro_linux_clang_d1o0/TAO/orbsvcs/tests/ImplRepo/airplane0.ior>
[Details] ERROR: </tao_builds/jenkins/workspace/doc_ace6tao2_wiro_linux_clang_d1o0/TAO/orbsvcs/ImplRepo_Service/tao_imr_locator> still running upon object destruction
[Details] Error: TAO/orbsvcs/tests/ImplRepo/run_test.pl persistent_listingcorrupt -replica returned with status 9

TAO/orbsvcs/tests/ImplRepo/double_start/run_test.pl -kill (Bug currently UNFIXED, This test may fail)

[Details] (596704|596704) EXCEPTION, client:
[Details] ERROR: <client> failed: No child processes

TAO/orbsvcs/tests/Notify/Blocking/run_test.pl

[Details] ----------ERROR: Structured_Consumer timedout
======= Begin stuck stacks =======
[Thread debugging using libthread_db enabled]
Using host libthread_db library "/lib/x86_64-linux-gnu/libthread_db.so.1".
0x00007f34655ac74d in __GI___select (nfds=10, readfds=0x563bee2b3e58, writefds=0x0, exceptfds=0x0, timeout=0x7fff47cda6e8) at ../sysdeps/unix/sysv/linux/select.c:69
69 ../sysdeps/unix/sysv/linux/select.c: No such file or directory.

Thread 1 (Thread 0x7f346548c740 (LWP 597859) "Structured_Cons"):
#0 0x00007f34655ac74d in __GI___select (nfds=10, readfds=0x563bee2b3e58, writefds=0x0, exceptfds=0x0, timeout=0x7fff47cda6e8) at ../sysdeps/unix/sysv/linux/select.c:69
#1 0x00007f3465b5ec51 in ACE_OS::select (width=10, rfds=0x563bee2b3e58, wfds=0x0, efds=0x0, timeout=0x7fff47cda7a8) at /tao_builds/jenkins/workspace/doc_ace6tao2_wiro_linux_clang_d1o0/ACE/ace/OS_NS_sys_select.inl:42
#2 0x00007f3465b6be87 in ACE_Select_Reactor_T<ACE_Reactor_Token_T<ACE_Token> >::wait_for_multiple_events (this=0x563bee2b3900, dispatch_set=..., max_wait_time=0x7fff47cdab80) at /tao_builds/jenkins/workspace/doc_ace6tao2_wiro_linux_clang_d1o0/ACE/ace/Select_Reactor_T.cpp:1109
#3 0x00007f3465c3dc50 in ACE_TP_Reactor::get_event_for_dispatching (this=0x563bee2b3900, max_wait_time=0x7fff47cdab80) at /tao_builds/jenkins/workspace/doc_ace6tao2_wiro_linux_clang_d1o0/ACE/ace/TP_Reactor.cpp:444
#4 0x00007f3465c3da65 in ACE_TP_Reactor::dispatch_i (this=0x563bee2b3900, max_wait_time=0x7fff47cdab80, guard=...) at /tao_builds/jenkins/workspace/doc_ace6tao2_wiro_linux_clang_d1o0/ACE/ace/TP_Reactor.cpp:178
#5 0x00007f3465c3d9e7 in ACE_TP_Reactor::handle_events (this=0x563bee2b3900, max_wait_time=0x7fff47cdab80) at /tao_builds/jenkins/workspace/doc_ace6tao2_wiro_linux_clang_d1o0/ACE/ace/TP_Reactor.cpp:171
#6 0x00007f3465e51716 in ACE_Reactor::handle_events (this=0x563bee2b34f0, max_wait_time=0x7fff47cdab80) at /tao_builds/jenkins/workspace/doc_ace6tao2_wiro_linux_clang_d1o0/ACE/ace/Reactor.inl:185
#7 0x00007f3465e6fb81 in TAO_ORB_Core::run (this=0x563bee29cf50, tv=0x7fff47cdab80, perform_work=0) at /tao_builds/jenkins/workspace/doc_ace6tao2_wiro_linux_clang_d1o0/TAO/tao/ORB_Core.cpp:2320
#8 0x00007f3465e60a24 in CORBA::ORB::run (this=0x563bee2b2ef0, tv=0x7fff47cdab80) at /tao_builds/jenkins/workspace/doc_ace6tao2_wiro_linux_clang_d1o0/TAO/tao/ORB.cpp:186
#9 0x00007f3465e60a4d in CORBA::ORB::run (this=0x563bee2b2ef0, tv=...) at /tao_builds/jenkins/workspace/doc_ace6tao2_wiro_linux_clang_d1o0/TAO/tao/ORB.cpp:178
#10 0x00007f34673ec611 in Notify_Test_Client::ORB_run (this=0x7fff47cdacf0) at /tao_builds/jenkins/workspace/doc_ace6tao2_wiro_linux_clang_d1o0/TAO/orbsvcs/tests/Notify/lib/Notify_Test_Client.cpp:113
#11 0x0000563bec85e086 in main (argc=7, argv=0x7fff47cdae98) at /tao_builds/jenkins/workspace/doc_ace6tao2_wiro_linux_clang_d1o0/TAO/orbsvcs/tests/Notify/Blocking/Structured_Consumer.cpp:140
[Inferior 1 (process 597859) detached]
======= End stuck stacks =======
[Details] ERROR: Consumer returned -1
[Details] Error: TAO/orbsvcs/tests/Notify/Blocking/run_test.pl returned with status 1

TAO/orbsvcs/tests/LoadBalancing/LoadMonitor/CPU/run_test.pl

[Details] ERROR: Unable to retrieve loads from LoadManager.
[Details] ERROR: client returned 1
[Details] Error: TAO/orbsvcs/tests/LoadBalancing/LoadMonitor/CPU/run_test.pl returned with status 1

TAO/orbsvcs/tests/LoadBalancing/GenericFactory/DeadMemberDetection_Inf_Ctrl/run_test.pl

[Details] ERROR: client timedout
======= Begin stuck stacks =======
[Thread debugging using libthread_db enabled]
Using host libthread_db library "/lib/x86_64-linux-gnu/libthread_db.so.1".
0x00007fae90d4a74d in __GI___select (nfds=6, readfds=0x55673457d948, writefds=0x0, exceptfds=0x0, timeout=0x0) at ../sysdeps/unix/sysv/linux/select.c:69
69 ../sysdeps/unix/sysv/linux/select.c: No such file or directory.

Thread 1 (Thread 0x7fae90c2c000 (LWP 598689) "client"):
#0 0x00007fae90d4a74d in __GI___select (nfds=6, readfds=0x55673457d948, writefds=0x0, exceptfds=0x0, timeout=0x0) at ../sysdeps/unix/sysv/linux/select.c:69
#1 0x00007fae912fac51 in ACE_OS::select (width=6, rfds=0x55673457d948, wfds=0x0, efds=0x0, timeout=0x0) at /tao_builds/jenkins/workspace/doc_ace6tao2_wiro_linux_clang_d1o0/ACE/ace/OS_NS_sys_select.inl:42
#2 0x00007fae91307e87 in ACE_Select_Reactor_T<ACE_Reactor_Token_T<ACE_Token> >::wait_for_multiple_events (this=0x55673457d3f0, dispatch_set=..., max_wait_time=0x0) at /tao_builds/jenkins/workspace/doc_ace6tao2_wiro_linux_clang_d1o0/ACE/ace/Select_Reactor_T.cpp:1109
#3 0x00007fae913d9c50 in ACE_TP_Reactor::get_event_for_dispatching (this=0x55673457d3f0, max_wait_time=0x0) at /tao_builds/jenkins/workspace/doc_ace6tao2_wiro_linux_clang_d1o0/ACE/ace/TP_Reactor.cpp:444
#4 0x00007fae913d9a65 in ACE_TP_Reactor::dispatch_i (this=0x55673457d3f0, max_wait_time=0x0, guard=...) at /tao_builds/jenkins/workspace/doc_ace6tao2_wiro_linux_clang_d1o0/ACE/ace/TP_Reactor.cpp:178
#5 0x00007fae913d99e7 in ACE_TP_Reactor::handle_events (this=0x55673457d3f0, max_wait_time=0x0) at /tao_builds/jenkins/workspace/doc_ace6tao2_wiro_linux_clang_d1o0/ACE/ace/TP_Reactor.cpp:171
#6 0x00007fae915ef716 in ACE_Reactor::handle_events (this=0x55673457cfe0, max_wait_time=0x0) at /tao_builds/jenkins/workspace/doc_ace6tao2_wiro_linux_clang_d1o0/ACE/ace/Reactor.inl:185
#7 0x00007fae915ee8dc in TAO_Leader_Follower::wait_for_event (this=0x55673457cc70, event=0x55673459cb10, transport=0x5567345902a0, max_wait_time=0x0) at /tao_builds/jenkins/workspace/doc_ace6tao2_wiro_linux_clang_d1o0/TAO/tao/Leader_Follower.cpp:505
#8 0x00007fae9166fba6 in TAO_Wait_On_Leader_Follower::wait (this=0x556734590800, max_wait_time=0x0, rd=...) at /tao_builds/jenkins/workspace/doc_ace6tao2_wiro_linux_clang_d1o0/TAO/tao/Wait_On_Leader_Follower.cpp:66
#9 0x00007fae9163bea3 in TAO::Synch_Twoway_Invocation::wait_for_reply (this=0x7ffdf99d18d0, max_wait_time=0x0, rd=..., bd=...) at /tao_builds/jenkins/workspace/doc_ace6tao2_wiro_linux_clang_d1o0/TAO/tao/Synch_Invocation.cpp:319
#10 0x00007fae9163ba0d in TAO::Synch_Twoway_Invocation::remote_twoway (this=0x7ffdf99d18d0, max_wait_time=0x0) at /tao_builds/jenkins/workspace/doc_ace6tao2_wiro_linux_clang_d1o0/TAO/tao/Synch_Invocation.cpp:230
#11 0x00007fae915e5856 in TAO::Invocation_Adapter::invoke_twoway (this=0x7ffdf99d1d70, details=..., effective_target=..., r=..., max_wait_time=@0x7ffdf99d1bb8: 0x0, retry_state=0x7ffdf99d1b30) at /tao_builds/jenkins/workspace/doc_ace6tao2_wiro_linux_clang_d1o0/TAO/tao/Invocation_Adapter.cpp:312
#12 0x00007fae915e56c4 in TAO::Invocation_Adapter::invoke_remote_i (this=0x7ffdf99d1d70, stub=0x556734591920, details=..., effective_target=..., max_wait_time=@0x7ffdf99d1bb8: 0x0, retry_state=0x7ffdf99d1b30) at /tao_builds/jenkins/workspace/doc_ace6tao2_wiro_linux_clang_d1o0/TAO/tao/Invocation_Adapter.cpp:275
#13 0x00007fae915e4947 in TAO::Invocation_Adapter::invoke_i (this=0x7ffdf99d1d70, stub=0x556734591920, details=...) at /tao_builds/jenkins/workspace/doc_ace6tao2_wiro_linux_clang_d1o0/TAO/tao/Invocation_Adapter.cpp:98
#14 0x00007fae915e44fa in TAO::Invocation_Adapter::invoke (this=0x7ffdf99d1d70, ex_data=0x0, ex_count=0) at /tao_builds/jenkins/workspace/doc_ace6tao2_wiro_linux_clang_d1o0/TAO/tao/Invocation_Adapter.cpp:47
#15 0x000055673434dd30 in Test::Simple::get_string (this=0x5567345910a0) at /tao_builds/jenkins/workspace/doc_ace6tao2_wiro_linux_clang_d1o0/TAO/orbsvcs/tests/LoadBalancing/GenericFactory/DeadMemberDetection_Inf_Ctrl/TestC.cpp:110
#16 0x00005567343502ab in hang_member_rr_test (orb=0x5567345774e0, group_ior=0x7ffdf99d33b9 "file://group.ior") at /tao_builds/jenkins/workspace/doc_ace6tao2_wiro_linux_clang_d1o0/TAO/orbsvcs/tests/LoadBalancing/GenericFactory/DeadMemberDetection_Inf_Ctrl/client.cpp:147
#17 0x0000556734351c4f in main (argc=8, argv=0x7ffdf99d2218) at /tao_builds/jenkins/workspace/doc_ace6tao2_wiro_linux_clang_d1o0/TAO/orbsvcs/tests/LoadBalancing/GenericFactory/DeadMemberDetection_Inf_Ctrl/client.cpp:414
[Inferior 1 (process 598689) detached]
======= End stuck stacks =======
[Details] ERROR: client returned -1
[Details] ERROR: factory_server timedout
======= Begin stuck stacks =======
[Thread debugging using libthread_db enabled]
Using host libthread_db library "/lib/x86_64-linux-gnu/libthread_db.so.1".
0x00007fc10cd6374d in __GI___select (nfds=7, readfds=0x55dbc548dd88, writefds=0x0, exceptfds=0x0, timeout=0x0) at ../sysdeps/unix/sysv/linux/select.c:69
69 ../sysdeps/unix/sysv/linux/select.c: No such file or directory.

Thread 1 (Thread 0x7fc10cc45000 (LWP 598687) "factory_server"):
#0 0x00007fc10cd6374d in __GI___select (nfds=7, readfds=0x55dbc548dd88, writefds=0x0, exceptfds=0x0, timeout=0x0) at ../sysdeps/unix/sysv/linux/select.c:69
#1 0x00007fc10d313c51 in ACE_OS::select (width=7, rfds=0x55dbc548dd88, wfds=0x0, efds=0x0, timeout=0x0) at /tao_builds/jenkins/workspace/doc_ace6tao2_wiro_linux_clang_d1o0/ACE/ace/OS_NS_sys_select.inl:42
#2 0x00007fc10d320e87 in ACE_Select_Reactor_T<ACE_Reactor_Token_T<ACE_Token> >::wait_for_multiple_events (this=0x55dbc548d830, dispatch_set=..., max_wait_time=0x0) at /tao_builds/jenkins/workspace/doc_ace6tao2_wiro_linux_clang_d1o0/ACE/ace/Select_Reactor_T.cpp:1109
#3 0x00007fc10d3f2c50 in ACE_TP_Reactor::get_event_for_dispatching (this=0x55dbc548d830, max_wait_time=0x0) at /tao_builds/jenkins/workspace/doc_ace6tao2_wiro_linux_clang_d1o0/ACE/ace/TP_Reactor.cpp:444
#4 0x00007fc10d3f2a65 in ACE_TP_Reactor::dispatch_i (this=0x55dbc548d830, max_wait_time=0x0, guard=...) at /tao_builds/jenkins/workspace/doc_ace6tao2_wiro_linux_clang_d1o0/ACE/ace/TP_Reactor.cpp:178
#5 0x00007fc10d3f29e7 in ACE_TP_Reactor::handle_events (this=0x55dbc548d830, max_wait_time=0x0) at /tao_builds/jenkins/workspace/doc_ace6tao2_wiro_linux_clang_d1o0/ACE/ace/TP_Reactor.cpp:171
#6 0x00007fc10d608716 in ACE_Reactor::handle_events (this=0x55dbc548d420, max_wait_time=0x0) at /tao_builds/jenkins/workspace/doc_ace6tao2_wiro_linux_clang_d1o0/ACE/ace/Reactor.inl:185
#7 0x00007fc10d626b81 in TAO_ORB_Core::run (this=0x55dbc5486cd0, tv=0x0, perform_work=0) at /tao_builds/jenkins/workspace/doc_ace6tao2_wiro_linux_clang_d1o0/TAO/tao/ORB_Core.cpp:2320
#8 0x00007fc10d617a24 in CORBA::ORB::run (this=0x55dbc5487940, tv=0x0) at /tao_builds/jenkins/workspace/doc_ace6tao2_wiro_linux_clang_d1o0/TAO/tao/ORB.cpp:186
#9 0x00007fc10d6179e9 in CORBA::ORB::run (this=0x55dbc5487940) at /tao_builds/jenkins/workspace/doc_ace6tao2_wiro_linux_clang_d1o0/TAO/tao/ORB.cpp:172
#10 0x000055dbc3b6a2bb in LB_Factory_Server::run (this=0x7fff648fd5c0) at /tao_builds/jenkins/workspace/doc_ace6tao2_wiro_linux_clang_d1o0/TAO/orbsvcs/tests/LoadBalancing/GenericFactory/DeadMemberDetection_Inf_Ctrl/LB_Factory_Server.cpp:34
#11 0x000055dbc3b6e92c in main (argc=7, argv=0x7fff648fd748) at /tao_builds/jenkins/workspace/doc_ace6tao2_wiro_linux_clang_d1o0/TAO/orbsvcs/tests/LoadBalancing/GenericFactory/DeadMemberDetection_Inf_Ctrl/factory_server.cpp:13
[Inferior 1 (process 598687) detached]
======= End stuck stacks =======
[Details] ERROR: server 3 returned -1