Daily Build Log (Brief)


Compile


/tao_builds/jenkins/workspace/doc_ace6tao2_tick_linux_gcc_d0o1/ATCD/ACE/ace/TkReactor/GNUmakefile.ACE_TkReactor

[Details] <command-line>:0:0: warning: "PACKAGE_NAME" redefined
[Details] <command-line>:0:0: note: this is the location of the previous definition
[Details] <command-line>:0:0: warning: "PACKAGE_TARNAME" redefined
[Details] <command-line>:0:0: note: this is the location of the previous definition
[Details] <command-line>:0:0: warning: "PACKAGE_STRING" redefined
[Details] <command-line>:0:0: note: this is the location of the previous definition

/tao_builds/jenkins/workspace/doc_ace6tao2_tick_linux_gcc_d0o1/ATCD/TAO/tao/TkResource/GNUmakefile.TAO_TkResource

[Details] <command-line>:0:0: warning: "PACKAGE_NAME" redefined
[Details] <command-line>:0:0: note: this is the location of the previous definition
[Details] <command-line>:0:0: warning: "PACKAGE_TARNAME" redefined
[Details] <command-line>:0:0: note: this is the location of the previous definition
[Details] <command-line>:0:0: warning: "PACKAGE_STRING" redefined
[Details] <command-line>:0:0: note: this is the location of the previous definition
[Details] <command-line>:0:0: warning: "PACKAGE_NAME" redefined
[Details] <command-line>:0:0: note: this is the location of the previous definition
[Details] <command-line>:0:0: warning: "PACKAGE_TARNAME" redefined
[Details] <command-line>:0:0: note: this is the location of the previous definition
[Details] <command-line>:0:0: warning: "PACKAGE_STRING" redefined
[Details] <command-line>:0:0: note: this is the location of the previous definition

/tao_builds/jenkins/workspace/doc_ace6tao2_tick_linux_gcc_d0o1/ATCD/TAO/orbsvcs/orbsvcs/GNUmakefile.CosLoadBalancing

[Details] /tao_builds/jenkins/workspace/doc_ace6tao2_tick_linux_gcc_d0o1/ATCD/TAO/orbsvcs/orbsvcs/Event/EC_Conjunction_Filter.cpp: In member function 'virtual void TAO_EC_Conjunction_Filter::clear()':
[Details] /tao_builds/jenkins/workspace/doc_ace6tao2_tick_linux_gcc_d0o1/ATCD/TAO/orbsvcs/orbsvcs/Event/EC_Conjunction_Filter.cpp:155:21: warning: left shift of negative value [-Wshift-negative-value]

/tao_builds/jenkins/workspace/doc_ace6tao2_tick_linux_gcc_d0o1/ATCD/ACE/tests/GNUmakefile.TkReactor_Test

[Details] <command-line>:0:0: warning: "PACKAGE_NAME" redefined
[Details] <command-line>:0:0: note: this is the location of the previous definition
[Details] <command-line>:0:0: warning: "PACKAGE_TARNAME" redefined
[Details] <command-line>:0:0: note: this is the location of the previous definition
[Details] <command-line>:0:0: warning: "PACKAGE_STRING" redefined
[Details] <command-line>:0:0: note: this is the location of the previous definition

Test


tests/Bug_3943_Regression_Test

[Details] ERROR: <Bug_3943_Regression_Test> exited with coredump from signal 11 : SEGV
[Details] Error: Bug_3943_Regression_Test FAILED with exit status 255 after Time:92s
[Details] Error: (log/Bug_3943_Regression_Test.log): (18679|18681) ACE_OS::sendv: Bad address, 2 iovecs each are too large send returned errno=14
[Details] Error: (log/Bug_3943_Regression_Test.log): (18679|18681) 2 iovecs each are too large: expected > 0, got -1
[Details] Error (log/Bug_3943_Regression_Test.log): no line with 'Ending'
[Details] 2022-11-19 12:51:34.383@LM_ERROR@(18679|18681) ACE_OS::sendv: Bad address, 2 iovecs each are too large send returned errno=14
[Details] 2022-11-19 12:51:34.390@LM_ERROR@(18679|18681) 2 iovecs each are too large: expected > 0, got -1

tests/MT_SOCK_Test

[Details] ERROR: MT_SOCK_Test timedout
======= Begin stuck stacks =======
[Thread debugging using libthread_db enabled]
Using host libthread_db library "/lib64/libthread_db.so.1".
0xf76f0c99 in __kernel_vsyscall ()
warning: File "/usr/share/gdb/auto-load/usr/lib/libstdc++.so.6.0.22-gdb.py" auto-loading has been declined by your `auto-load safe-path' set to "/usr/local/lib/gcc/".
To enable execution of this file add
add-auto-load-safe-path /usr/share/gdb/auto-load/usr/lib/libstdc++.so.6.0.22-gdb.py
line to your configuration file "/home/jenkins/.gdbinit".
To completely disable this security protection add
set auto-load safe-path /
line to your configuration file "/home/jenkins/.gdbinit".
For more information about this security protection see the
"Auto-loading safe path" section in the GDB manual. E.g., run from the shell:
info "(gdb)Auto-loading safe path"

Thread 1 (Thread 0xf7143700 (LWP 19095)):
#0 0xf76f0c99 in __kernel_vsyscall ()
#1 0xf7323ac3 in __waitpid_nocancel () from /lib/libpthread.so.0
#2 0x0804a401 in spawn(int) ()
#3 0x0804a4f9 in run_main(int, char**) ()
#4 0x0804938b in main ()
======= End stuck stacks =======
[Details] Error: MT_SOCK_Test FAILED (time out after Time:317s)
[Details] Error: (log/MT_SOCK_Test.log): (19095|19095) server: Incorrect # client connections. Expected:5-10 Actual:21
[Details] Error: (log/MT_SOCK_Test.log): (19105|19105) client: recv_n: Connection reset by peer
[Details] Error: (log/MT_SOCK_Test.log): (19102|19102) client: recv_n: Connection reset by peer
[Details] Error: (log/MT_SOCK_Test.log): (19108|19108) client: recv_n: Connection reset by peer
[Details] Error (log/MT_SOCK_Test.log): no line with 'Ending'
[Details] 2022-11-19 12:56:03.257@LM_ERROR@(19095|19095) server: Incorrect # client connections. Expected:5-10 Actual:21
[Details] 2022-11-19 12:57:37.500@LM_ERROR@(19105|19105) client: recv_n: Connection reset by peer
[Details] 2022-11-19 12:57:37.500@LM_ERROR@(19102|19102) client: recv_n: Connection reset by peer
[Details] 2022-11-19 12:57:37.501@LM_ERROR@(19108|19108) client: recv_n: Connection reset by peer

tests/Multicast_Test

[Details] Error: Multicast_Test FAILED with exit status 1 after Time:0s
[Details] Error: (log/Multicast_Test.log): Send to 239.255.0.9, send_dgram - error calling send on ACE_SOCK_Dgram.: Operation not permitted
[Details] Error: (log/Multicast_Test.log): Calling send_dgram.
[Details] Error: (log/Multicast_Test.log): Calling advance_addr.
[Details] Error: (log/Multicast_Test.log): Send to 239.255.0.10, send_dgram - error calling send on ACE_SOCK_Dgram.: Operation not permitted
[Details] 2022-11-19 13:01:47.702@LM_ERROR@Send to 239.255.0.9, send_dgram - error calling send on ACE_SOCK_Dgram.: Operation not permitted
[Details] 2022-11-19 13:01:47.702@LM_ERROR@Calling send_dgram.
[Details] 2022-11-19 13:01:47.703@LM_ERROR@Calling advance_addr.
[Details] 2022-11-19 13:01:47.703@LM_ERROR@Send to 239.255.0.10, send_dgram - error calling send on ACE_SOCK_Dgram.: Operation not permitted