Daily Build Log (Brief)


Compile


/tao_builds/jenkins/workspace/doc_ace6tao2_mosquito_linux_gcc_d0o1i0c1/ATCD/ACE/ace/GNUmakefile.ACE

[Details] /tao_builds/jenkins/workspace/doc_ace6tao2_mosquito_linux_gcc_d0o1i0c1/ATCD/ACE/ace/OS_NS_dirent.inl: In function ‘int ACE_OS::readdir_r(ACE_DIR*, dirent*, dirent**)’:
[Details] /tao_builds/jenkins/workspace/doc_ace6tao2_mosquito_linux_gcc_d0o1i0c1/ATCD/ACE/ace/OS_NS_dirent.inl:83:17: warning: ‘int readdir_r(DIR*, dirent*, dirent**)’ is deprecated [-Wdeprecated-declarations]
[Details] /usr/include/dirent.h:189:12: note: declared here
[Details] /tao_builds/jenkins/workspace/doc_ace6tao2_mosquito_linux_gcc_d0o1i0c1/ATCD/ACE/ace/OS_NS_dirent.inl:83:47: warning: ‘int readdir_r(DIR*, dirent*, dirent**)’ is deprecated [-Wdeprecated-declarations]
[Details] /usr/include/dirent.h:189:12: note: declared here

Test


tests/Bug_2610_Regression_Test (Bug currently UNFIXED, This test may fail)

[Details] Error: Bug_2610_Regression_Test FAILED with exit status 1 after Time:0s
[Details] Error: (log/Bug_2610_Regression_Test.log): Svc_Handler leakage detected, 3 objects remain
[Details] Error (log/Bug_2610_Regression_Test.log): no line with 'Ending'
[Details] 2022-11-19 03:18:16.814@LM_ERROR@Svc_Handler leakage detected, 3 objects remain

tests/Bug_2772_Regression_Test (Bug currently UNFIXED, This test may fail)

[Details] ERROR: Bug_2772_Regression_Test timedout
======= Begin stuck stacks =======
[New LWP 2125]
[Thread debugging using libthread_db enabled]
Using host libthread_db library "/lib/i386-linux-gnu/libthread_db.so.1".
0xb7746cf9 in __kernel_vsyscall ()
warning: File "/usr/share/gdb/auto-load/usr/lib/i386-linux-gnu/libstdc++.so.6.0.22-gdb.py" auto-loading has been declined by your `auto-load safe-path' set to "/usr/local/lib/gcc/".
To enable execution of this file add
add-auto-load-safe-path /usr/share/gdb/auto-load/usr/lib/i386-linux-gnu/libstdc++.so.6.0.22-gdb.py
line to your configuration file "/home/jenkins/.gdbinit".
To completely disable this security protection add
set auto-load safe-path /
line to your configuration file "/home/jenkins/.gdbinit".
For more information about this security protection see the
"Auto-loading safe path" section in the GDB manual. E.g., run from the shell:
info "(gdb)Auto-loading safe path"

Thread 2 (Thread 0xb718fb40 (LWP 2125)):
#0 0xb7746cf9 in __kernel_vsyscall ()
#1 0xb7357beb in pthread_cond_wait@@GLIBC_2.3.2 () at ../sysdeps/unix/sysv/linux/i386/pthread_cond_wait.S:187
#2 0xb765880d in ACE_OS::cond_wait(pthread_cond_t*, pthread_mutex_t*) () from /tao_builds/jenkins/workspace/doc_ace6tao2_mosquito_linux_gcc_d0o1i0c1/ATCD/ACE/lib/libACE.so.6.5.18
#3 0xb7621c06 in ACE_Condition<ACE_Recursive_Thread_Mutex>::wait(ACE_Recursive_Thread_Mutex&, ACE_Time_Value const*) () from /tao_builds/jenkins/workspace/doc_ace6tao2_mosquito_linux_gcc_d0o1i0c1/ATCD/ACE/lib/libACE.so.6.5.18
#4 0xb7621c50 in ACE_Condition<ACE_Recursive_Thread_Mutex>::wait(ACE_Time_Value const*) () from /tao_builds/jenkins/workspace/doc_ace6tao2_mosquito_linux_gcc_d0o1i0c1/ATCD/ACE/lib/libACE.so.6.5.18
#5 0x00408174 in ThreadTest::workerThread() ()
#6 0x004082dc in ThreadTest::workerThreadWrapper(void*) ()
#7 0xb766390a in ACE_OS_Thread_Adapter::invoke() () from /tao_builds/jenkins/workspace/doc_ace6tao2_mosquito_linux_gcc_d0o1i0c1/ATCD/ACE/lib/libACE.so.6.5.18
#8 0xb735227a in start_thread (arg=0xb718fb40) at pthread_create.c:456
#9 0xb727c366 in clone () at ../sysdeps/unix/sysv/linux/i386/clone.S:110

Thread 1 (Thread 0xb7193900 (LWP 2123)):
#0 0xb7746cf9 in __kernel_vsyscall ()
#1 0xb735ade2 in __lll_lock_wait () at ../sysdeps/unix/sysv/linux/i386/lowlevellock.S:144
#2 0xb73564dd in __pthread_mutex_cond_lock (mutex=0xbf81bb08) at ../nptl/pthread_mutex_lock.c:115
#3 0xb7357c94 in pthread_cond_wait@@GLIBC_2.3.2 () at ../sysdeps/unix/sysv/linux/i386/pthread_cond_wait.S:273
#4 0xb765880d in ACE_OS::cond_wait(pthread_cond_t*, pthread_mutex_t*) () from /tao_builds/jenkins/workspace/doc_ace6tao2_mosquito_linux_gcc_d0o1i0c1/ATCD/ACE/lib/libACE.so.6.5.18
#5 0xb7621c06 in ACE_Condition<ACE_Recursive_Thread_Mutex>::wait(ACE_Recursive_Thread_Mutex&, ACE_Time_Value const*) () from /tao_builds/jenkins/workspace/doc_ace6tao2_mosquito_linux_gcc_d0o1i0c1/ATCD/ACE/lib/libACE.so.6.5.18
#6 0xb7621c50 in ACE_Condition<ACE_Recursive_Thread_Mutex>::wait(ACE_Time_Value const*) () from /tao_builds/jenkins/workspace/doc_ace6tao2_mosquito_linux_gcc_d0o1i0c1/ATCD/ACE/lib/libACE.so.6.5.18
#7 0x0040809a in ThreadTest::run(bool) ()
#8 0x00408523 in run_main(int, char**) ()
#9 0x00407c97 in main ()
======= End stuck stacks =======
[Details] Error: Bug_2772_Regression_Test FAILED (time out after Time:316s)
[Details] Error (log/Bug_2772_Regression_Test.log): no line with 'Ending'

tests/Bug_3911_Regression_Test (Bug currently UNFIXED, This test may fail)

[Details] /tao_builds/jenkins/workspace/doc_ace6tao2_mosquito_linux_gcc_d0o1i0c1/ATCD/ACE/tests/Bug_3911_Regression_Test: symbol lookup error: /tao_builds/jenkins/workspace/doc_ace6tao2_mosquito_linux_gcc_d0o1i0c1/ATCD/ACE/tests/Bug_3911_Regression_Test: undefined symbol: _ZNK20ACE_MMAP_Memory_Pool9base_addrEv
[Details] Error: Bug_3911_Regression_Test FAILED with exit status 127 after Time:0s
[Details] Error (log/Bug_3911_Regression_Test.log): no line with 'Ending'

tests/MT_Reference_Counted_Event_Handler_Test

[Details] Unexpected error 11 on netlink descriptor 7 (address family 16)ERROR: <MT_Reference_Counted_Event_Handler_Test> exited with coredump from signal 6 : ABRT
======= Begin stack trace of ././/MT_Reference_Counted_Event_Handler_Test from core file ./core =======
GNU gdb (Debian 7.12-6) 7.12.0.20161007-git
Copyright (C) 2016 Free Software Foundation, Inc.
License GPLv3+: GNU GPL version 3 or later <http://gnu.org/licenses/gpl.html>
This is free software: you are free to change and redistribute it.
There is NO WARRANTY, to the extent permitted by law. Type "show copying"
and "show warranty" for details.
This GDB was configured as "i686-linux-gnu".
Type "show configuration" for configuration details.
For bug reporting instructions, please see:
<http://www.gnu.org/software/gdb/bugs/>.
Find the GDB manual and other documentation resources online at:
<http://www.gnu.org/software/gdb/documentation/>.
For help, type "help".
Type "apropos word" to search for commands related to "word"...
Reading symbols from ././/MT_Reference_Counted_Event_Handler_Test...(no debugging symbols found)...done.
[New LWP 2482]
[New LWP 2487]
[New LWP 2367]
[New LWP 2485]
[New LWP 2483]
[New LWP 2484]
[New LWP 2488]
[Thread debugging using libthread_db enabled]
Using host libthread_db library "/lib/i386-linux-gnu/libthread_db.so.1".
Core was generated by `/tao_builds/jenkins/workspace/doc_ace6tao2_mosquito_linux_gcc_d0o1i0c1/ATCD/ACE'.
Program terminated with signal SIGABRT, Aborted.
#0 0xb772acf9 in __kernel_vsyscall ()
[Current thread is 1 (Thread 0xb6171b40 (LWP 2482))]
To enable execution of this file add
add-auto-load-safe-path /usr/share/gdb/auto-load/usr/lib/i386-linux-gnu/libstdc++.so.6.0.22-gdb.py
line to your configuration file "/home/jenkins/.gdbinit".
To completely disable this security protection add
set auto-load safe-path /
line to your configuration file "/home/jenkins/.gdbinit".
For more information about this security protection see the
"Auto-loading safe path" section in the GDB manual. E.g., run from the shell:
info "(gdb)Auto-loading safe path"
#0 0xb772acf9 in __kernel_vsyscall ()
#1 0xb71a3dd0 in __libc_signal_restore_set (set=0xb616f540)
at ../sysdeps/unix/sysv/linux/nptl-signals.h:79
#2 __GI_raise (sig=6) at ../sysdeps/unix/sysv/linux/raise.c:48
#3 0xb71a5297 in __GI_abort () at abort.c:89
#4 0xb71df38f in __libc_message (do_abort=<optimized out>,
fmt=<optimized out>) at ../sysdeps/posix/libc_fatal.c:175
#5 0xb71df3cc in __GI___libc_fatal (
message=0xb616f868 "Unexpected error 11 on netlink descriptor 7 (address family 16)") at ../sysdeps/posix/libc_fatal.c:185
#6 0xb727c590 in __GI___netlink_assert_response (fd=fd@entry=7,
result=result@entry=-1)
at ../sysdeps/unix/sysv/linux/netlink_assert_response.c:103
#7 0xb727bc08 in make_request (pid=2367, fd=7)
at ../sysdeps/unix/sysv/linux/check_pf.c:171
#8 __check_pf (seen_ipv4=0xb6170af6, seen_ipv6=0xb6170af7, in6ai=0xb6170afc,
in6ailen=0xb6170b00) at ../sysdeps/unix/sysv/linux/check_pf.c:329
#9 0xb72487b1 in __GI_getaddrinfo (name=<optimized out>,
service=<optimized out>, hints=<optimized out>, pai=0xb6170fac)
at ../sysdeps/posix/getaddrinfo.c:2445
#10 0xb76403e4 in ACE_OS::getaddrinfo(char const*, char const*, addrinfo const*, addrinfo**) ()
from /tao_builds/jenkins/workspace/doc_ace6tao2_mosquito_linux_gcc_d0o1i0c1/ATCD/ACE/lib/libACE.so.6.5.18
#11 0xb7623f9a in ACE_INET_Addr::set(unsigned short, char const*, int, int) ()
from /tao_builds/jenkins/workspace/doc_ace6tao2_mosquito_linux_gcc_d0o1i0c1/ATCD/ACE/lib/libACE.so.6.5.18
#12 0xb7624a7c in ACE_INET_Addr::ACE_INET_Addr(unsigned short, char const*, int) ()
from /tao_builds/jenkins/workspace/doc_ace6tao2_mosquito_linux_gcc_d0o1i0c1/ATCD/ACE/lib/libACE.so.6.5.18
#13 0x004adac6 in Pipe::open() ()
#14 0x004add00 in Connector::connect(int&, int&, int) ()
#15 0x004adf99 in Invocation_Thread::create_connection() ()
#16 0x004ae5ed in Invocation_Thread::svc() ()
#17 0xb768de26 in ACE_Task_Base::svc_run(void*) ()
from /tao_builds/jenkins/workspace/doc_ace6tao2_mosquito_linux_gcc_d0o1i0c1/ATCD/ACE/lib/libACE.so.6.5.18
#18 0xb768f072 in ACE_Thread_Adapter::invoke_i() ()
from /tao_builds/jenkins/workspace/doc_ace6tao2_mosquito_linux_gcc_d0o1i0c1/ATCD/ACE/lib/libACE.so.6.5.18
#19 0xb768f161 in ACE_Thread_Adapter::invoke() ()
from /tao_builds/jenkins/workspace/doc_ace6tao2_mosquito_linux_gcc_d0o1i0c1/ATCD/ACE/lib/libACE.so.6.5.18
#20 0xb733627a in start_thread (arg=0xb6171b40) at pthread_create.c:456
#21 0xb7260366 in clone () at ../sysdeps/unix/sysv/linux/i386/clone.S:110
======= End stack trace =======
[Details] Error: MT_Reference_Counted_Event_Handler_Test FAILED with exit status 255 after Time:37s
[Details] Error: MT_Reference_Counted_Event_Handler_Test dumped core
[Details] Error (log/MT_Reference_Counted_Event_Handler_Test.log): no line with 'Ending'

tests/MT_SOCK_Test

[Details] ERROR: MT_SOCK_Test timedout
======= Begin stuck stacks =======
[Thread debugging using libthread_db enabled]
Using host libthread_db library "/lib/i386-linux-gnu/libthread_db.so.1".
0xb7752cf9 in __kernel_vsyscall ()
warning: File "/usr/share/gdb/auto-load/usr/lib/i386-linux-gnu/libstdc++.so.6.0.22-gdb.py" auto-loading has been declined by your `auto-load safe-path' set to "/usr/local/lib/gcc/".
To enable execution of this file add
add-auto-load-safe-path /usr/share/gdb/auto-load/usr/lib/i386-linux-gnu/libstdc++.so.6.0.22-gdb.py
line to your configuration file "/home/jenkins/.gdbinit".
To completely disable this security protection add
set auto-load safe-path /
line to your configuration file "/home/jenkins/.gdbinit".
For more information about this security protection see the
"Auto-loading safe path" section in the GDB manual. E.g., run from the shell:
info "(gdb)Auto-loading safe path"

Thread 1 (Thread 0xb719f900 (LWP 2504)):
#0 0xb7752cf9 in __kernel_vsyscall ()
#1 0xb7367e33 in __waitpid_nocancel () at ../sysdeps/unix/syscall-template.S:84
#2 0xb766d130 in ACE_OS::waitpid(int, int*, int, int) () from /tao_builds/jenkins/workspace/doc_ace6tao2_mosquito_linux_gcc_d0o1i0c1/ATCD/ACE/lib/libACE.so.6.5.18
#3 0x004038ea in spawn(int) ()
#4 0x00403a1c in run_main(int, char**) ()
#5 0x004023d7 in main ()
======= End stuck stacks =======
[Details] Error: MT_SOCK_Test FAILED (time out after Time:317s)
[Details] Error: (log/MT_SOCK_Test.log): (2504|2504) server: Incorrect # client connections. Expected:5-10 Actual:25
[Details] Error (log/MT_SOCK_Test.log): no line with 'Ending'
[Details] 2022-11-19 03:27:53.278@LM_ERROR@(2504|2504) server: Incorrect # client connections. Expected:5-10 Actual:25

tests/Reactor_Fairness_Test (Bug currently UNFIXED, This test may fail)

[Details] Error: Reactor_Fairness_Test FAILED with exit status 1 after Time:91s
[Details] Error: (log/Reactor_Fairness_Test.log): Too much unfairness (max 203464, min 0)
[Details] 2022-11-19 03:36:22.945@LM_ERROR@Too much unfairness (max 203464, min 0)

tests/Service_Config_Stream_Test (Bug currently UNFIXED, This test may fail)

[Details] ERROR: <Service_Config_Stream_Test> exited with coredump from signal 11 : SEGV
======= Begin stack trace of ././/Service_Config_Stream_Test from core file ./core =======
GNU gdb (Debian 7.12-6) 7.12.0.20161007-git
Copyright (C) 2016 Free Software Foundation, Inc.
License GPLv3+: GNU GPL version 3 or later <http://gnu.org/licenses/gpl.html>
This is free software: you are free to change and redistribute it.
There is NO WARRANTY, to the extent permitted by law. Type "show copying"
and "show warranty" for details.
This GDB was configured as "i686-linux-gnu".
Type "show configuration" for configuration details.
For bug reporting instructions, please see:
<http://www.gnu.org/software/gdb/bugs/>.
Find the GDB manual and other documentation resources online at:
<http://www.gnu.org/software/gdb/documentation/>.
For help, type "help".
Type "apropos word" to search for commands related to "word"...
Reading symbols from ././/Service_Config_Stream_Test...(no debugging symbols found)...done.
[New LWP 4167]
[Thread debugging using libthread_db enabled]
Using host libthread_db library "/lib/i386-linux-gnu/libthread_db.so.1".
Core was generated by `/tao_builds/jenkins/workspace/doc_ace6tao2_mosquito_linux_gcc_d0o1i0c1/ATCD/ACE'.
Program terminated with signal SIGSEGV, Segmentation fault.
#0 0xb764f681 in ACE_Module_Type::fini() const ()
from /tao_builds/jenkins/workspace/doc_ace6tao2_mosquito_linux_gcc_d0o1i0c1/ATCD/ACE/lib/libACE.so.6.5.18
To enable execution of this file add
add-auto-load-safe-path /usr/share/gdb/auto-load/usr/lib/i386-linux-gnu/libstdc++.so.6.0.22-gdb.py
line to your configuration file "/home/jenkins/.gdbinit".
To completely disable this security protection add
set auto-load safe-path /
line to your configuration file "/home/jenkins/.gdbinit".
For more information about this security protection see the
"Auto-loading safe path" section in the GDB manual. E.g., run from the shell:
info "(gdb)Auto-loading safe path"
#0 0xb764f681 in ACE_Module_Type::fini() const ()
from /tao_builds/jenkins/workspace/doc_ace6tao2_mosquito_linux_gcc_d0o1i0c1/ATCD/ACE/lib/libACE.so.6.5.18
#1 0xb764c663 in ACE_Service_Type::fini() ()
from /tao_builds/jenkins/workspace/doc_ace6tao2_mosquito_linux_gcc_d0o1i0c1/ATCD/ACE/lib/libACE.so.6.5.18
#2 0xb764e343 in ACE_Service_Repository::fini() ()
from /tao_builds/jenkins/workspace/doc_ace6tao2_mosquito_linux_gcc_d0o1i0c1/ATCD/ACE/lib/libACE.so.6.5.18
#3 0xb7647c74 in ACE_Service_Config::fini_svcs() ()
from /tao_builds/jenkins/workspace/doc_ace6tao2_mosquito_linux_gcc_d0o1i0c1/ATCD/ACE/lib/libACE.so.6.5.18
#4 0xb7616f31 in ACE_Object_Manager::fini() ()
from /tao_builds/jenkins/workspace/doc_ace6tao2_mosquito_linux_gcc_d0o1i0c1/ATCD/ACE/lib/libACE.so.6.5.18
#5 0xb76179b6 in ACE_OS_Object_Manager::fini() [clone .localalias.4] ()
from /tao_builds/jenkins/workspace/doc_ace6tao2_mosquito_linux_gcc_d0o1i0c1/ATCD/ACE/lib/libACE.so.6.5.18
#6 0xb7617ad9 in ACE_OS_Object_Manager::~ACE_OS_Object_Manager() ()
from /tao_builds/jenkins/workspace/doc_ace6tao2_mosquito_linux_gcc_d0o1i0c1/ATCD/ACE/lib/libACE.so.6.5.18
#7 0xb7617b7e in ACE_OS_Object_Manager_Manager::~ACE_OS_Object_Manager_Manager() ()
from /tao_builds/jenkins/workspace/doc_ace6tao2_mosquito_linux_gcc_d0o1i0c1/ATCD/ACE/lib/libACE.so.6.5.18
#8 0xb7174b2a in __cxa_finalize (d=0xb76ecde0) at cxa_finalize.c:56
#9 0xb75abc53 in __do_global_dtors_aux ()
from /tao_builds/jenkins/workspace/doc_ace6tao2_mosquito_linux_gcc_d0o1i0c1/ATCD/ACE/lib/libACE.so.6.5.18
#10 0xb770a142 in _dl_fini () at dl-fini.c:235
#11 0xb71747ab in __run_exit_handlers (status=0,
listp=0xb72fa3dc <__exit_funcs>, run_list_atexit=true, run_dtors=true)
at exit.c:83
#12 0xb7174811 in __GI_exit (status=0) at exit.c:105
#13 0xb715e292 in __libc_start_main (main=0x4ca570 <main>, argc=1,
argv=0xbfcdd654, init=0x4ce960 <__libc_csu_init>,
fini=0x4ce9c0 <__libc_csu_fini>, rtld_fini=0xb7709f50 <_dl_fini>,
stack_end=0xbfcdd64c) at ../csu/libc-start.c:325
#14 0x004ca601 in _start ()
======= End stack trace =======
[Details] Error: Service_Config_Stream_Test FAILED with exit status 255 after Time:1s
[Details] Error: Service_Config_Stream_Test dumped core

tests/TSS_Leak_Test (Bug currently UNFIXED, This test may fail)

[Details] Error: TSS_Leak_Test FAILED with exit status 1 after Time:0s
[Details] Error: (log/TSS_Leak_Test.log): ERROR: 1 X objects (should be 0)
[Details] 2022-11-19 03:40:22.588@LM_ERROR@ERROR: 1 X objects (should be 0)

TAO/tests/ORB_Local_Config/Two_DLL_ORB/run_test.pl

[Details] ERROR: Test timedout
======= Begin stuck stacks =======
[New LWP 7525]
[New LWP 7526]
[Thread debugging using libthread_db enabled]
Using host libthread_db library "/lib/i386-linux-gnu/libthread_db.so.1".
0xb7736cf9 in __kernel_vsyscall ()
warning: File "/usr/share/gdb/auto-load/usr/lib/i386-linux-gnu/libstdc++.so.6.0.22-gdb.py" auto-loading has been declined by your `auto-load safe-path' set to "/usr/local/lib/gcc/".
To enable execution of this file add
add-auto-load-safe-path /usr/share/gdb/auto-load/usr/lib/i386-linux-gnu/libstdc++.so.6.0.22-gdb.py
line to your configuration file "/home/jenkins/.gdbinit".
To completely disable this security protection add
set auto-load safe-path /
line to your configuration file "/home/jenkins/.gdbinit".
For more information about this security protection see the
"Auto-loading safe path" section in the GDB manual. E.g., run from the shell:
info "(gdb)Auto-loading safe path"

Thread 3 (Thread 0xb64ffb40 (LWP 7526)):
#0 0xb7736cf9 in __kernel_vsyscall ()
#1 0xb7091de2 in __lll_lock_wait () at ../sysdeps/unix/sysv/linux/i386/lowlevellock.S:144
#2 0xb708b92e in __GI___pthread_mutex_lock (mutex=0xb6508224) at ../nptl/pthread_mutex_lock.c:80
#3 0xb7392d29 in ACE_OS::mutex_lock(pthread_mutex_t*) () from /tao_builds/jenkins/workspace/doc_ace6tao2_mosquito_linux_gcc_d0o1i0c1/ATCD/ACE/lib/libACE.so.6.5.18
#4 0xb7392d68 in ACE_OS::thread_mutex_lock(pthread_mutex_t*) () from /tao_builds/jenkins/workspace/doc_ace6tao2_mosquito_linux_gcc_d0o1i0c1/ATCD/ACE/lib/libACE.so.6.5.18
#5 0xb73eae18 in ACE_Thread_Mutex::acquire() () from /tao_builds/jenkins/workspace/doc_ace6tao2_mosquito_linux_gcc_d0o1i0c1/ATCD/ACE/lib/libACE.so.6.5.18
#6 0xb73691b5 in ACE_DLL_Handle::open(char const*, int, void*, ACE_Fixed_Stack<ACE_String_Base<char>, 10u>*) () from /tao_builds/jenkins/workspace/doc_ace6tao2_mosquito_linux_gcc_d0o1i0c1/ATCD/ACE/lib/libACE.so.6.5.18
#7 0xb7369607 in ACE_DLL_Manager::open_dll(char const*, int, void*, ACE_Fixed_Stack<ACE_String_Base<char>, 10u>*) () from /tao_builds/jenkins/workspace/doc_ace6tao2_mosquito_linux_gcc_d0o1i0c1/ATCD/ACE/lib/libACE.so.6.5.18
#8 0xb7366d9e in ACE_DLL::open_i(char const*, int, bool, void*) () from /tao_builds/jenkins/workspace/doc_ace6tao2_mosquito_linux_gcc_d0o1i0c1/ATCD/ACE/lib/libACE.so.6.5.18
#9 0xb7367438 in ACE_DLL::open(char const*, int, bool) () from /tao_builds/jenkins/workspace/doc_ace6tao2_mosquito_linux_gcc_d0o1i0c1/ATCD/ACE/lib/libACE.so.6.5.18
#10 0xb73ad152 in ACE_Function_Node::symbol(ACE_Service_Gestalt*, int&, void (**)(void*)) () from /tao_builds/jenkins/workspace/doc_ace6tao2_mosquito_linux_gcc_d0o1i0c1/ATCD/ACE/lib/libACE.so.6.5.18
#11 0xb73adf1c in ACE_Service_Type_Factory::make_service_type(ACE_Service_Gestalt*) const () from /tao_builds/jenkins/workspace/doc_ace6tao2_mosquito_linux_gcc_d0o1i0c1/ATCD/ACE/lib/libACE.so.6.5.18
#12 0xb73d0c9d in ACE_Service_Gestalt::initialize(ACE_Service_Type_Factory const*, char const*) () from /tao_builds/jenkins/workspace/doc_ace6tao2_mosquito_linux_gcc_d0o1i0c1/ATCD/ACE/lib/libACE.so.6.5.18
#13 0xb73ac6a5 in ACE_Dynamic_Node::apply(ACE_Service_Gestalt*, int&) () from /tao_builds/jenkins/workspace/doc_ace6tao2_mosquito_linux_gcc_d0o1i0c1/ATCD/ACE/lib/libACE.so.6.5.18
#14 0xb73ddf2c in ace_yyparse(void*) () from /tao_builds/jenkins/workspace/doc_ace6tao2_mosquito_linux_gcc_d0o1i0c1/ATCD/ACE/lib/libACE.so.6.5.18
#15 0xb73cfb2e in ACE_Service_Gestalt::process_directives_i(ACE_Svc_Conf_Param*) () from /tao_builds/jenkins/workspace/doc_ace6tao2_mosquito_linux_gcc_d0o1i0c1/ATCD/ACE/lib/libACE.so.6.5.18
#16 0xb73cfedb in ACE_Service_Gestalt::process_directive(char const*) () from /tao_builds/jenkins/workspace/doc_ace6tao2_mosquito_linux_gcc_d0o1i0c1/ATCD/ACE/lib/libACE.so.6.5.18
#17 0xb73ce231 in ACE_Service_Config::process_directive(char const*) () from /tao_builds/jenkins/workspace/doc_ace6tao2_mosquito_linux_gcc_d0o1i0c1/ATCD/ACE/lib/libACE.so.6.5.18
#18 0xb752ca11 in PortableInterceptor::register_orb_initializer(PortableInterceptor::ORBInitializer*) () from /tao_builds/jenkins/workspace/doc_ace6tao2_mosquito_linux_gcc_d0o1i0c1/ATCD/ACE/lib/libTAO.so.2.5.18
#19 0xb665c6c9 in TAO_CSD_ThreadPool::init() () from /tao_builds/jenkins/workspace/doc_ace6tao2_mosquito_linux_gcc_d0o1i0c1/ATCD/ACE/lib/libTAO_CSD_ThreadPool.so
#20 0xb6657429 in _GLOBAL__sub_I_CSD_TP_Strategy_Factory.cpp () from /tao_builds/jenkins/workspace/doc_ace6tao2_mosquito_linux_gcc_d0o1i0c1/ATCD/ACE/lib/libTAO_CSD_ThreadPool.so
#21 0xb7747b35 in call_init (l=<optimized out>, argc=argc@entry=1, argv=argv@entry=0xbf90d2f4, env=0xbf90d2fc) at dl-init.c:72
#22 0xb7747c5e in call_init (env=0xbf90d2fc, argv=0xbf90d2f4, argc=1, l=<optimized out>) at dl-init.c:30
#23 _dl_init (main_map=main_map@entry=0xb5b0ce40, argc=1, argv=0xbf90d2f4, env=0xbf90d2fc) at dl-init.c:120
#24 0xb774be37 in dl_open_worker (a=<optimized out>) at dl-open.c:575
#25 0xb77479e1 in _dl_catch_error (objname=objname@entry=0xb64fe324, errstring=errstring@entry=0xb64fe328, mallocedp=mallocedp@entry=0xb64fe323, operate=0xb774ba70 <dl_open_worker>, args=0xb64fe32c) at dl-error.c:187
#26 0xb774b629 in _dl_open (file=0xb5b0cd10 "libTAO_CSD_ThreadPool.so", mode=-2147483391, caller_dlopen=0xb7394e6c <ACE_OS::dlopen(char const*, int)+28>, nsid=<optimized out>, argc=1, argv=0xbf90d2f4, env=0xbf90d2fc) at dl-open.c:660
#27 0xb7298bf5 in dlopen_doit (a=0xb64fe4e0) at dlopen.c:66
#28 0xb77479e1 in _dl_catch_error (objname=0xb5b0ccbc, errstring=0xb5b0ccc0, mallocedp=0xb5b0ccb8, operate=0xb7298b80 <dlopen_doit>, args=0xb64fe4e0) at dl-error.c:187
#29 0xb72992ed in _dlerror_run (operate=operate@entry=0xb7298b80 <dlopen_doit>, args=args@entry=0xb64fe4e0) at dlerror.c:163
#30 0xb7298c9e in __dlopen (file=0xb5b0cd10 "libTAO_CSD_ThreadPool.so", mode=257) at dlopen.c:87
#31 0xb7394e6c in ACE_OS::dlopen(char const*, int) () from /tao_builds/jenkins/workspace/doc_ace6tao2_mosquito_linux_gcc_d0o1i0c1/ATCD/ACE/lib/libACE.so.6.5.18
#32 0xb7368774 in ACE_DLL_Handle::open_i(char const*, int, ACE_Fixed_Stack<ACE_String_Base<char>, 10u>*) () from /tao_builds/jenkins/workspace/doc_ace6tao2_mosquito_linux_gcc_d0o1i0c1/ATCD/ACE/lib/libACE.so.6.5.18
#33 0xb73693ea in ACE_DLL_Handle::open(char const*, int, void*, ACE_Fixed_Stack<ACE_String_Base<char>, 10u>*) () from /tao_builds/jenkins/workspace/doc_ace6tao2_mosquito_linux_gcc_d0o1i0c1/ATCD/ACE/lib/libACE.so.6.5.18
#34 0xb73696d6 in ACE_DLL_Manager::open_dll(char const*, int, void*, ACE_Fixed_Stack<ACE_String_Base<char>, 10u>*) () from /tao_builds/jenkins/workspace/doc_ace6tao2_mosquito_linux_gcc_d0o1i0c1/ATCD/ACE/lib/libACE.so.6.5.18
#35 0xb7366d9e in ACE_DLL::open_i(char const*, int, bool, void*) () from /tao_builds/jenkins/workspace/doc_ace6tao2_mosquito_linux_gcc_d0o1i0c1/ATCD/ACE/lib/libACE.so.6.5.18
#36 0xb7367438 in ACE_DLL::open(char const*, int, bool) () from /tao_builds/jenkins/workspace/doc_ace6tao2_mosquito_linux_gcc_d0o1i0c1/ATCD/ACE/lib/libACE.so.6.5.18
#37 0xb73ad152 in ACE_Function_Node::symbol(ACE_Service_Gestalt*, int&, void (**)(void*)) () from /tao_builds/jenkins/workspace/doc_ace6tao2_mosquito_linux_gcc_d0o1i0c1/ATCD/ACE/lib/libACE.so.6.5.18
#38 0xb73adf1c in ACE_Service_Type_Factory::make_service_type(ACE_Service_Gestalt*) const () from /tao_builds/jenkins/workspace/doc_ace6tao2_mosquito_linux_gcc_d0o1i0c1/ATCD/ACE/lib/libACE.so.6.5.18
#39 0xb73d0c9d in ACE_Service_Gestalt::initialize(ACE_Service_Type_Factory const*, char const*) () from /tao_builds/jenkins/workspace/doc_ace6tao2_mosquito_linux_gcc_d0o1i0c1/ATCD/ACE/lib/libACE.so.6.5.18
#40 0xb73ac6a5 in ACE_Dynamic_Node::apply(ACE_Service_Gestalt*, int&) () from /tao_builds/jenkins/workspace/doc_ace6tao2_mosquito_linux_gcc_d0o1i0c1/ATCD/ACE/lib/libACE.so.6.5.18
#41 0xb73ddf2c in ace_yyparse(void*) () from /tao_builds/jenkins/workspace/doc_ace6tao2_mosquito_linux_gcc_d0o1i0c1/ATCD/ACE/lib/libACE.so.6.5.18
#42 0xb73cfb2e in ACE_Service_Gestalt::process_directives_i(ACE_Svc_Conf_Param*) () from /tao_builds/jenkins/workspace/doc_ace6tao2_mosquito_linux_gcc_d0o1i0c1/ATCD/ACE/lib/libACE.so.6.5.18
#43 0xb73cfd3e in ACE_Service_Gestalt::process_file(char const*) () from /tao_builds/jenkins/workspace/doc_ace6tao2_mosquito_linux_gcc_d0o1i0c1/ATCD/ACE/lib/libACE.so.6.5.18
#44 0xb73d031f in ACE_Service_Gestalt::process_directives(bool) () from /tao_builds/jenkins/workspace/doc_ace6tao2_mosquito_linux_gcc_d0o1i0c1/ATCD/ACE/lib/libACE.so.6.5.18
#45 0xb73d14da in ACE_Service_Gestalt::open_i(char const*, char const*, bool, bool, bool) () from /tao_builds/jenkins/workspace/doc_ace6tao2_mosquito_linux_gcc_d0o1i0c1/ATCD/ACE/lib/libACE.so.6.5.18
#46 0xb73d20eb in ACE_Service_Gestalt::open(int, char**, char const*, bool, bool, bool) () from /tao_builds/jenkins/workspace/doc_ace6tao2_mosquito_linux_gcc_d0o1i0c1/ATCD/ACE/lib/libACE.so.6.5.18
#47 0xb756b3a0 in TAO::ORB::open_services(ACE_Intrusive_Auto_Ptr<ACE_Service_Gestalt>, int&, char**) () from /tao_builds/jenkins/workspace/doc_ace6tao2_mosquito_linux_gcc_d0o1i0c1/ATCD/ACE/lib/libTAO.so.2.5.18
#48 0xb752b576 in CORBA::ORB_init(int&, char**, char const*) () from /tao_builds/jenkins/workspace/doc_ace6tao2_mosquito_linux_gcc_d0o1i0c1/ATCD/ACE/lib/libTAO.so.2.5.18
#49 0xb6ec2a98 in Client_Worker::test_main(int, char**) () from libORB_DLL_Server.so
#50 0xb6ec076d in Service_Config_ORB_DLL::svc() () from libORB_DLL_Server.so
#51 0xb73e2e26 in ACE_Task_Base::svc_run(void*) () from /tao_builds/jenkins/workspace/doc_ace6tao2_mosquito_linux_gcc_d0o1i0c1/ATCD/ACE/lib/libACE.so.6.5.18
#52 0xb73e4072 in ACE_Thread_Adapter::invoke_i() () from /tao_builds/jenkins/workspace/doc_ace6tao2_mosquito_linux_gcc_d0o1i0c1/ATCD/ACE/lib/libACE.so.6.5.18
#53 0xb73e4161 in ACE_Thread_Adapter::invoke() () from /tao_builds/jenkins/workspace/doc_ace6tao2_mosquito_linux_gcc_d0o1i0c1/ATCD/ACE/lib/libACE.so.6.5.18
#54 0xb708927a in start_thread (arg=0xb64ffb40) at pthread_create.c:456
#55 0xb6fb3366 in clone () at ../sysdeps/unix/sysv/linux/i386/clone.S:110

Thread 2 (Thread 0xb6ebab40 (LWP 7525)):
#0 0xb7736cf9 in __kernel_vsyscall ()
#1 0xb7091de2 in __lll_lock_wait () at ../sysdeps/unix/sysv/linux/i386/lowlevellock.S:144
#2 0xb708b999 in __GI___pthread_mutex_lock (mutex=0xb775c4e4 <_rtld_global+1220>) at ../nptl/pthread_mutex_lock.c:115
#3 0xb7298dba in __dlsym (handle=0xb650d4a0, name=0xb650e100 "_get_dll_unload_policy") at dlsym.c:68
#4 0xb7394e9c in ACE_OS::dlsym(void*, char const*) () from /tao_builds/jenkins/workspace/doc_ace6tao2_mosquito_linux_gcc_d0o1i0c1/ATCD/ACE/lib/libACE.so.6.5.18
#5 0xb7367e01 in ACE_DLL_Handle::symbol(char const*, bool, ACE_String_Base<char>&) () from /tao_builds/jenkins/workspace/doc_ace6tao2_mosquito_linux_gcc_d0o1i0c1/ATCD/ACE/lib/libACE.so.6.5.18
#6 0xb7367f64 in ACE_DLL_Handle::symbol(char const*, bool) () from /tao_builds/jenkins/workspace/doc_ace6tao2_mosquito_linux_gcc_d0o1i0c1/ATCD/ACE/lib/libACE.so.6.5.18
#7 0xb7368472 in ACE_DLL_Manager::unload_dll(ACE_DLL_Handle*, int) () from /tao_builds/jenkins/workspace/doc_ace6tao2_mosquito_linux_gcc_d0o1i0c1/ATCD/ACE/lib/libACE.so.6.5.18
#8 0xb736854b in ACE_DLL_Manager::close_dll(char const*) () from /tao_builds/jenkins/workspace/doc_ace6tao2_mosquito_linux_gcc_d0o1i0c1/ATCD/ACE/lib/libACE.so.6.5.18
#9 0xb7366b3d in ACE_DLL::close() () from /tao_builds/jenkins/workspace/doc_ace6tao2_mosquito_linux_gcc_d0o1i0c1/ATCD/ACE/lib/libACE.so.6.5.18
#10 0xb7366b8a in ACE_DLL::~ACE_DLL() () from /tao_builds/jenkins/workspace/doc_ace6tao2_mosquito_linux_gcc_d0o1i0c1/ATCD/ACE/lib/libACE.so.6.5.18
#11 0xb73ac846 in ACE_Function_Node::~ACE_Function_Node() () from /tao_builds/jenkins/workspace/doc_ace6tao2_mosquito_linux_gcc_d0o1i0c1/ATCD/ACE/lib/libACE.so.6.5.18
#12 0xb73acd91 in ACE_Dynamic_Node::~ACE_Dynamic_Node() () from /tao_builds/jenkins/workspace/doc_ace6tao2_mosquito_linux_gcc_d0o1i0c1/ATCD/ACE/lib/libACE.so.6.5.18
#13 0xb73ddf34 in ace_yyparse(void*) () from /tao_builds/jenkins/workspace/doc_ace6tao2_mosquito_linux_gcc_d0o1i0c1/ATCD/ACE/lib/libACE.so.6.5.18
#14 0xb73cfb2e in ACE_Service_Gestalt::process_directives_i(ACE_Svc_Conf_Param*) () from /tao_builds/jenkins/workspace/doc_ace6tao2_mosquito_linux_gcc_d0o1i0c1/ATCD/ACE/lib/libACE.so.6.5.18
#15 0xb73cfedb in ACE_Service_Gestalt::process_directive(char const*) () from /tao_builds/jenkins/workspace/doc_ace6tao2_mosquito_linux_gcc_d0o1i0c1/ATCD/ACE/lib/libACE.so.6.5.18
#16 0xb752d8b8 in TAO_ORB_Core::orbinitializer_registry_i() () from /tao_builds/jenkins/workspace/doc_ace6tao2_mosquito_linux_gcc_d0o1i0c1/ATCD/ACE/lib/libTAO.so.2.5.18
#17 0xb752d961 in TAO_ORB_Core::orbinitializer_registry() () from /tao_builds/jenkins/workspace/doc_ace6tao2_mosquito_linux_gcc_d0o1i0c1/ATCD/ACE/lib/libTAO.so.2.5.18
#18 0xb752b675 in CORBA::ORB_init(int&, char**, char const*) () from /tao_builds/jenkins/workspace/doc_ace6tao2_mosquito_linux_gcc_d0o1i0c1/ATCD/ACE/lib/libTAO.so.2.5.18
#19 0xb6ec3336 in Server_Worker::test_main(int, char**) () from libORB_DLL_Server.so
#20 0xb6ec076d in Service_Config_ORB_DLL::svc() () from libORB_DLL_Server.so
#21 0xb73e2e26 in ACE_Task_Base::svc_run(void*) () from /tao_builds/jenkins/workspace/doc_ace6tao2_mosquito_linux_gcc_d0o1i0c1/ATCD/ACE/lib/libACE.so.6.5.18
#22 0xb73e4072 in ACE_Thread_Adapter::invoke_i() () from /tao_builds/jenkins/workspace/doc_ace6tao2_mosquito_linux_gcc_d0o1i0c1/ATCD/ACE/lib/libACE.so.6.5.18
#23 0xb73e4161 in ACE_Thread_Adapter::invoke() () from /tao_builds/jenkins/workspace/doc_ace6tao2_mosquito_linux_gcc_d0o1i0c1/ATCD/ACE/lib/libACE.so.6.5.18
#24 0xb708927a in start_thread (arg=0xb6ebab40) at pthread_create.c:456
#25 0xb6fb3366 in clone () at ../sysdeps/unix/sysv/linux/i386/clone.S:110

Thread 1 (Thread 0xb6ec9700 (LWP 7524)):
#0 0xb7736cf9 in __kernel_vsyscall ()
#1 0xb708ebeb in pthread_cond_wait@@GLIBC_2.3.2 () at ../sysdeps/unix/sysv/linux/i386/pthread_cond_wait.S:187
#2 0xb73918ad in ACE_OS::cond_timedwait(pthread_cond_t*, pthread_mutex_t*, ACE_Time_Value*) () from /tao_builds/jenkins/workspace/doc_ace6tao2_mosquito_linux_gcc_d0o1i0c1/ATCD/ACE/lib/libACE.so.6.5.18
#3 0xb735aef9 in ACE_Condition<ACE_Thread_Mutex>::wait(ACE_Thread_Mutex&, ACE_Time_Value const*) () from /tao_builds/jenkins/workspace/doc_ace6tao2_mosquito_linux_gcc_d0o1i0c1/ATCD/ACE/lib/libACE.so.6.5.18
#4 0xb735af20 in ACE_Condition<ACE_Thread_Mutex>::wait(ACE_Time_Value const*) () from /tao_builds/jenkins/workspace/doc_ace6tao2_mosquito_linux_gcc_d0o1i0c1/ATCD/ACE/lib/libACE.so.6.5.18
#5 0xb73e9f4f in ACE_Thread_Manager::wait(ACE_Time_Value const*, bool, bool) () from /tao_builds/jenkins/workspace/doc_ace6tao2_mosquito_linux_gcc_d0o1i0c1/ATCD/ACE/lib/libACE.so.6.5.18
#6 0x00491111 in testLoadingTwoOrbs(int, char**) ()
#7 0x00490d3b in main ()
======= End stuck stacks =======
[Details] ERROR: test returned -1
[Details] Error: TAO/tests/ORB_Local_Config/Two_DLL_ORB/run_test.pl returned with status 1

TAO/tests/Bug_2085_Regression/run_test.pl (Bug currently UNFIXED, This test may fail)

[Details] (7841) ERROR, test_string_to_object for <> didn't result in minor code 7
[Details] (7841) ERROR, test_string_to_object for <> didn't result in minor code 8
[Details] (7841) ERROR, test_string_to_object for <> didn't result in minor code 9
[Details] (7841) ERROR, test_string_to_object for <> didn't result in minor code 10
[Details] ERROR: test returned 4
[Details] Error: TAO/tests/Bug_2085_Regression/run_test.pl returned with status 1

TAO/tests/Bug_2543_Regression/run_test.pl (Bug currently UNFIXED, This test may fail)

[Details] Error: extract out of any failed
[Details] ERROR: test returned 1
[Details] Error: TAO/tests/Bug_2543_Regression/run_test.pl returned with status 1

TAO/tests/Bug_3566_Regression/run_test.pl (Bug currently UNFIXED, This test may fail)

[Details] (8076|8076) EXCEPTION, Exception caught:

TAO/tests/OBV/Collocated/Forward/run_test.pl (Bug currently UNFIXED, This test may fail)

[Details] ERROR: tc == tc_result

TAO/tests/HandleExhaustion/run_test.pl

[Details] ERROR: client timedout
======= Begin stuck stacks =======
[Thread debugging using libthread_db enabled]
Using host libthread_db library "/lib/i386-linux-gnu/libthread_db.so.1".
0xb76ffcf9 in __kernel_vsyscall ()
warning: File "/usr/share/gdb/auto-load/usr/lib/i386-linux-gnu/libstdc++.so.6.0.22-gdb.py" auto-loading has been declined by your `auto-load safe-path' set to "/usr/local/lib/gcc/".
To enable execution of this file add
add-auto-load-safe-path /usr/share/gdb/auto-load/usr/lib/i386-linux-gnu/libstdc++.so.6.0.22-gdb.py
line to your configuration file "/home/jenkins/.gdbinit".
To completely disable this security protection add
set auto-load safe-path /
line to your configuration file "/home/jenkins/.gdbinit".
For more information about this security protection see the
"Auto-loading safe path" section in the GDB manual. E.g., run from the shell:
info "(gdb)Auto-loading safe path"

Thread 1 (Thread 0xb6fd38c0 (LWP 8210)):
#0 0xb76ffcf9 in __kernel_vsyscall ()
#1 0xb70b4dfd in ___newselect_nocancel () at ../sysdeps/unix/syscall-template.S:84
#2 0xb74a03e7 in ACE_OS::select(int, fd_set*, fd_set*, fd_set*, ACE_Time_Value const*) () from /tao_builds/jenkins/workspace/doc_ace6tao2_mosquito_linux_gcc_d0o1i0c1/ATCD/ACE/lib/libACE.so.6.5.18
#3 0xb7448899 in ACE_Select_Reactor_T<ACE_Reactor_Token_T<ACE_Token> >::wait_for_multiple_events(ACE_Select_Reactor_Handle_Set&, ACE_Time_Value*) () from /tao_builds/jenkins/workspace/doc_ace6tao2_mosquito_linux_gcc_d0o1i0c1/ATCD/ACE/lib/libACE.so.6.5.18
#4 0xb74e7179 in ACE_TP_Reactor::get_event_for_dispatching(ACE_Time_Value*) () from /tao_builds/jenkins/workspace/doc_ace6tao2_mosquito_linux_gcc_d0o1i0c1/ATCD/ACE/lib/libACE.so.6.5.18
#5 0xb74e7cb0 in ACE_TP_Reactor::dispatch_i(ACE_Time_Value*, ACE_TP_Token_Guard&) () from /tao_builds/jenkins/workspace/doc_ace6tao2_mosquito_linux_gcc_d0o1i0c1/ATCD/ACE/lib/libACE.so.6.5.18
#6 0xb74e7ebe in ACE_TP_Reactor::handle_events(ACE_Time_Value*) () from /tao_builds/jenkins/workspace/doc_ace6tao2_mosquito_linux_gcc_d0o1i0c1/ATCD/ACE/lib/libACE.so.6.5.18
#7 0xb762733c in TAO_Leader_Follower::wait_for_event(TAO_LF_Event*, TAO_Transport*, ACE_Time_Value*) () from /tao_builds/jenkins/workspace/doc_ace6tao2_mosquito_linux_gcc_d0o1i0c1/ATCD/ACE/lib/libTAO.so.2.5.18
#8 0xb768a46c in TAO_Wait_On_Leader_Follower::wait(ACE_Time_Value*, TAO_Synch_Reply_Dispatcher&) () from /tao_builds/jenkins/workspace/doc_ace6tao2_mosquito_linux_gcc_d0o1i0c1/ATCD/ACE/lib/libTAO.so.2.5.18
#9 0xb7660e46 in TAO::Synch_Twoway_Invocation::wait_for_reply(ACE_Time_Value*, TAO_Synch_Reply_Dispatcher&, TAO_Bind_Dispatcher_Guard&) () from /tao_builds/jenkins/workspace/doc_ace6tao2_mosquito_linux_gcc_d0o1i0c1/ATCD/ACE/lib/libTAO.so.2.5.18
#10 0xb76622d0 in TAO::Synch_Twoway_Invocation::remote_twoway(ACE_Time_Value*) () from /tao_builds/jenkins/workspace/doc_ace6tao2_mosquito_linux_gcc_d0o1i0c1/ATCD/ACE/lib/libTAO.so.2.5.18
#11 0xb762240c in TAO::Invocation_Adapter::invoke_twoway(TAO_Operation_Details&, TAO_Pseudo_Var_T<CORBA::Object>&, TAO::Profile_Transport_Resolver&, ACE_Time_Value*&, TAO::Invocation_Retry_State*) () from /tao_builds/jenkins/workspace/doc_ace6tao2_mosquito_linux_gcc_d0o1i0c1/ATCD/ACE/lib/libTAO.so.2.5.18
#12 0xb762207d in TAO::Invocation_Adapter::invoke_remote_i(TAO_Stub*, TAO_Operation_Details&, TAO_Pseudo_Var_T<CORBA::Object>&, ACE_Time_Value*&, TAO::Invocation_Retry_State*) () from /tao_builds/jenkins/workspace/doc_ace6tao2_mosquito_linux_gcc_d0o1i0c1/ATCD/ACE/lib/libTAO.so.2.5.18
#13 0xb7622b15 in TAO::Invocation_Adapter::invoke_i(TAO_Stub*, TAO_Operation_Details&) () from /tao_builds/jenkins/workspace/doc_ace6tao2_mosquito_linux_gcc_d0o1i0c1/ATCD/ACE/lib/libTAO.so.2.5.18
#14 0xb7622d0b in TAO::Invocation_Adapter::invoke(TAO::Exception_Data const*, unsigned long) () from /tao_builds/jenkins/workspace/doc_ace6tao2_mosquito_linux_gcc_d0o1i0c1/ATCD/ACE/lib/libTAO.so.2.5.18
#15 0x0046da2a in Test::simple() ()
#16 0x0046cc7c in main ()
======= End stuck stacks =======
[Details] ERROR: client returned -1
[Details] ERROR: server timedout
======= Begin stuck stacks =======
[Thread debugging using libthread_db enabled]
Using host libthread_db library "/lib/i386-linux-gnu/libthread_db.so.1".
0xb77dacf9 in __kernel_vsyscall ()
warning: File "/usr/share/gdb/auto-load/usr/lib/i386-linux-gnu/libstdc++.so.6.0.22-gdb.py" auto-loading has been declined by your `auto-load safe-path' set to "/usr/local/lib/gcc/".
To enable execution of this file add
add-auto-load-safe-path /usr/share/gdb/auto-load/usr/lib/i386-linux-gnu/libstdc++.so.6.0.22-gdb.py
line to your configuration file "/home/jenkins/.gdbinit".
To completely disable this security protection add
set auto-load safe-path /
line to your configuration file "/home/jenkins/.gdbinit".
For more information about this security protection see the
"Auto-loading safe path" section in the GDB manual. E.g., run from the shell:
info "(gdb)Auto-loading safe path"

Thread 1 (Thread 0xb6f6d700 (LWP 8209)):
#0 0xb77dacf9 in __kernel_vsyscall ()
#1 0xb704fdfd in ___newselect_nocancel () at ../sysdeps/unix/syscall-template.S:84
#2 0xb743d3e7 in ACE_OS::select(int, fd_set*, fd_set*, fd_set*, ACE_Time_Value const*) () from /tao_builds/jenkins/workspace/doc_ace6tao2_mosquito_linux_gcc_d0o1i0c1/ATCD/ACE/lib/libACE.so.6.5.18
#3 0xb73e5899 in ACE_Select_Reactor_T<ACE_Reactor_Token_T<ACE_Token> >::wait_for_multiple_events(ACE_Select_Reactor_Handle_Set&, ACE_Time_Value*) () from /tao_builds/jenkins/workspace/doc_ace6tao2_mosquito_linux_gcc_d0o1i0c1/ATCD/ACE/lib/libACE.so.6.5.18
#4 0xb7484179 in ACE_TP_Reactor::get_event_for_dispatching(ACE_Time_Value*) () from /tao_builds/jenkins/workspace/doc_ace6tao2_mosquito_linux_gcc_d0o1i0c1/ATCD/ACE/lib/libACE.so.6.5.18
#5 0xb7484cb0 in ACE_TP_Reactor::dispatch_i(ACE_Time_Value*, ACE_TP_Token_Guard&) () from /tao_builds/jenkins/workspace/doc_ace6tao2_mosquito_linux_gcc_d0o1i0c1/ATCD/ACE/lib/libACE.so.6.5.18
#6 0xb7484ebe in ACE_TP_Reactor::handle_events(ACE_Time_Value*) () from /tao_builds/jenkins/workspace/doc_ace6tao2_mosquito_linux_gcc_d0o1i0c1/ATCD/ACE/lib/libACE.so.6.5.18
#7 0xb75d44bd in TAO_ORB_Core::run(ACE_Time_Value*, int) () from /tao_builds/jenkins/workspace/doc_ace6tao2_mosquito_linux_gcc_d0o1i0c1/ATCD/ACE/lib/libTAO.so.2.5.18
#8 0xb75cdd11 in CORBA::ORB::run(ACE_Time_Value*) () from /tao_builds/jenkins/workspace/doc_ace6tao2_mosquito_linux_gcc_d0o1i0c1/ATCD/ACE/lib/libTAO.so.2.5.18
#9 0xb75cdd3a in CORBA::ORB::run() () from /tao_builds/jenkins/workspace/doc_ace6tao2_mosquito_linux_gcc_d0o1i0c1/ATCD/ACE/lib/libTAO.so.2.5.18
#10 0x0045f15f in main ()
======= End stuck stacks =======
[Details] ERROR: server returned -1
[Details] ERROR: The error situation was not achieved
[Details] ERROR: The acceptor was not reregistered
[Details] Error: TAO/tests/HandleExhaustion/run_test.pl returned with status 3