Failed Test Brief Log By Build


doc_ace6tao2_ant_linux-sb_gcc_d0o1

tests/SOCK_Acceptor_Test

[Details] Error: SOCK_Acceptor_Test FAILED with exit status 1 after Time:0s
[Details] Error: (log/SOCK_Acceptor_Test.log): (-1|3002206016) open: Operation not supported
[Details] Error: (log/SOCK_Acceptor_Test.log): (-1|3002206016) open: Operation not supported
[Details] 2022-11-26 00:30:37.628@LM_ERROR@(-1|3002206016) open: Operation not supported
[Details] 2022-11-26 00:30:37.628@LM_ERROR@(-1|3002206016) open: Operation not supported

doc_ace6tao2_ant_linux-se_gcc_d0o1

tests/MT_SOCK_Test

[Details] Error: (log/MT_SOCK_Test.log): (25896|25896) server: Incorrect # client connections. Expected:5-10 Actual:11
[Details] 2022-11-26 07:02:10.964@LM_ERROR@(25896|25896) server: Incorrect # client connections. Expected:5-10 Actual:11

doc_ace6tao2_cricket_win2012r2-x64_vc10_d1o0

tests/Bug_2434_Regression_Test

[Details] ACE_ASSERT: file Bug_2434_Regression_Test.cpp, line 51 assertion failed for 'tv1 == tv2'.Aborting...
[Details] Error: Bug_2434_Regression_Test FAILED with exit status 3 after Time:0s
[Details] Error: (log/Bug_2434_Regression_Test.log): ACE_ASSERT: file Bug_2434_Regression_Test.cpp, line 51 assertion failed for 'tv1 == tv2'.Aborting...
[Details] Error (log/Bug_2434_Regression_Test.log): no line with 'Ending'
[Details] 2022-11-26 00:58:04.411@LM_ERROR@ACE_ASSERT: file Bug_2434_Regression_Test.cpp, line 51 assertion failed for 'tv1 == tv2'.Aborting...

tests/Bug_2610_Regression_Test

[Details] Error: Bug_2610_Regression_Test FAILED with exit status 1 after Time:0s
[Details] Error: (log/Bug_2610_Regression_Test.log): Svc_Handler leakage detected, 3 objects remain
[Details] Error (log/Bug_2610_Regression_Test.log): no line with 'Ending'
[Details] 2022-11-26 00:58:05.784@LM_ERROR@Svc_Handler leakage detected, 3 objects remain

tests/Bug_2772_Regression_Test

[Details] ERROR: Bug_2772_Regression_Test timedout
[Details] Error: Bug_2772_Regression_Test FAILED (time out after Time:315s)
[Details] Error (log/Bug_2772_Regression_Test.log): no line with 'Ending'

tests/Reactor_Fairness_Test

[Details] Error: Reactor_Fairness_Test FAILED with exit status 1 after Time:91s
[Details] Error: (log/Reactor_Fairness_Test.log): Too much unfairness (max 324968, min 0)
[Details] 2022-11-26 01:12:41.892@LM_ERROR@Too much unfairness (max 324968, min 0)

tests/Service_Config_Stream_Test

[Details] Error: Service_Config_Stream_Test FAILED with exit status 3221225477 after Time:0s

tests/TSS_Leak_Test

[Details] Error: TSS_Leak_Test FAILED with exit status 1 after Time:0s
[Details] Error: (log/TSS_Leak_Test.log): ERROR: 1 X objects (should be 0)
[Details] 2022-11-26 01:16:47.992@LM_ERROR@ERROR: 1 X objects (should be 0)

tests/SSL/SSL_Asynch_Stream_Test

[Details] ERROR: SSL_Asynch_Stream_Test timedout
[Details] Error: SSL_Asynch_Stream_Test FAILED (time out after Time:315s)
[Details] Error: (log/SSL_Asynch_Stream_Test.log):
[Details] Error (log/SSL_Asynch_Stream_Test.log): no line with 'Ending'
[Details] 2022-11-26 01:19:29.573@LM_ERROR@
[Details] (4328|4052) ERROR: ACCESS VIOLATION

TAO/tests/Bug_1551_Regression/run_test.pl

[Details] ERROR - Timeout waiting for client threads
[Details] ERROR: client returned 1

TAO/tests/Bug_2085_Regression/run_test.pl

[Details] (5348) ERROR, test_string_to_object for <> didn't result in minor code 7
[Details] (5348) ERROR, test_string_to_object for <> didn't result in minor code 8
[Details] (5348) ERROR, test_string_to_object for <> didn't result in minor code 9
[Details] (5348) ERROR, test_string_to_object for <> didn't result in minor code 10
[Details] ERROR: test returned 4

TAO/tests/Bug_2319_Regression/run_test.pl

[Details] (4084|1400) ERROR: ACCESS VIOLATION
[Details] ERROR: server timedout
[Details] ERROR: test returned -1

TAO/tests/Bug_2543_Regression/run_test.pl

[Details] Error: extract out of any failed
[Details] ERROR: test returned 1

TAO/tests/Bug_3566_Regression/run_test.pl

[Details] (2380|6100) EXCEPTION, Exception caught:

TAO/tests/Bug_3942_Regression/run_test.pl

[Details] ERROR: test returned 4294967295

TAO/tests/OBV/Collocated/Forward/run_test.pl

[Details] ERROR: tc == tc_result

TAO/tests/POA/Bug_1592_Regression/run_test.pl

[Details] ERROR: PortableInterceptor::ServerRequestInterceptor
[Details] ERROR: ending interception point incorrectly called prior to
[Details] ERROR: PortableServer::ServantLocator::postinvoke().
[Details] ERROR: server returned 1

TAO/tests/Big_Twoways/run_test.pl

[Details] Giving start signal . . . (3636|4776) ERROR: Session::svc, send 1 messages out of 1000
[Details] (3636|4776) EXCEPTION, Session::svc -
[Details] ERROR: client timedout
[Details] ERROR: client returned -1
[Details] ERROR: timeout waiting for sessions
[Details] ERROR: client timedout
[Details] ERROR: client returned -1
[Details] ERROR: client timedout
[Details] ERROR: client returned -1
[Details] ERROR: client timedout
[Details] ERROR: client returned -1
[Details] ERROR: server returned 1

TAO/orbsvcs/tests/Bug_2247_Regression/run_test.pl

[Details] ERROR: Manager 0 returned 255
[Details] ERROR: Manager 1 returned 255
[Details] ERROR: Manager 2 returned 255
[Details] ERROR: server 2 returned 3

TAO/orbsvcs/tests/InterfaceRepo/Persistence_Test/run_test.pl

[Details] (3532|5896) ERROR: ACCESS VIOLATION
[Details] (5340|6112) EXCEPTION, Ptest::run
[Details] ERROR: client returned 1
[Details] ERROR: server returned 3221225477

TAO/orbsvcs/tests/ImplRepo/ReconnectServer/run_test.pl

[Details] ERROR: Client returned 1

TAO/orbsvcs/tests/ImplRepo/ReconnectServer/run_test.pl -forwardalways

[Details] ERROR: client timedout
[Details] ERROR: Client returned -1

TAO/orbsvcs/tests/Notify/Bug_3663_Regression/run_test.pl

[Details] (5128|1412) ERROR: ACCESS VIOLATION
[Details] ERROR: Bug_3663_Regression returned 3221225477

TAO/orbsvcs/tests/Security/Secure_Invocation/run_test.pl

[Details] (5260|3048) EXCEPTION, Caught exception:
[Details] ERROR: client returned 1
[Details] ERROR: server timedout
[Details] ERROR: server returned -1

TAO/orbsvcs/tests/Security/Bug_1107_Regression/run_test.pl

[Details] (5332|3040) EXCEPTION, Caught unexpected exception (probable failure):
[Details] ERROR: client returned 1
[Details] ERROR: server timedout
[Details] ERROR: server returned -1

TAO/orbsvcs/tests/Security/Big_Request/run_test.pl

[Details] (5968|3976) EXCEPTION, ERROR
[Details] ERROR: client returned 4294967295
[Details] ERROR: server timedout
[Details] ERROR: server returned -1

TAO/orbsvcs/tests/Security/Callback/run_test.pl

[Details] (4780|2480) EXCEPTION, Caught exception
[Details] ERROR: client returned 4294967295
[Details] ERROR: server timedout
[Details] ERROR: server returned -1

TAO/orbsvcs/tests/Security/Crash_Test/run_test.pl

[Details] (4848|4540) EXCEPTION, CLIENT (%P): Caught exception:
[Details] (3908|5364) EXCEPTION, CLIENT (%P): Caught exception:
[Details] ERROR: Stopping client #1 returned 1
[Details] (5548|5672) EXCEPTION, CLIENT (%P): Caught exception:
[Details] ERROR: Stopping client #2 returned 1
[Details] ERROR: Stopping client #3 returned 1
[Details] ERROR: server timedout
[Details] ERROR: server returned -1

TAO/orbsvcs/tests/Security/Null_Cipher/run_test.pl

[Details] (884|3844) EXCEPTION, Caught exception:
[Details] ERROR: client returned 1
[Details] ERROR: server timedout
[Details] ERROR: server returned -1

TAO/orbsvcs/DevGuideExamples/Security/ParticipatingApp/run_test.pl

[Details] (2784|1404) EXCEPTION, Client: main block
[Details] ERROR: client returned 1
[Details] ERROR: MessengerServer timedout
[Details] ERROR: server returned -1

TAO/orbsvcs/DevGuideExamples/Security/PolicyControllingApp/run_test.pl

[Details] (4500|1896) EXCEPTION, Client: main block
[Details] ERROR: Messenger Client returned 1

TAO/orbsvcs/DevGuideExamples/Security/SecurityUnawareApp/run_test.pl

[Details] ERROR: Messenger Client1 returned 1
[Details] ERROR: Messenger Client2 returned 1
[Details] ERROR: Messenger Server returned 4294967295

doc_ace6tao2_hornet_win7-x64_vc14_i1d0o1w1

tests/Bug_2434_Regression_Test

[Details] ACE_ASSERT: file Bug_2434_Regression_Test.cpp, line 51 assertion failed for 'tv1 == tv2'.Aborting...
[Details] Error: Bug_2434_Regression_Test FAILED with exit status 3 after Time:0s
[Details] Error: (log/Bug_2434_Regression_Test.log): ACE_ASSERT: file Bug_2434_Regression_Test.cpp, line 51 assertion failed for 'tv1 == tv2'.Aborting...
[Details] Error (log/Bug_2434_Regression_Test.log): no line with 'Ending'
[Details] 2022-11-26 02:59:37.538@LM_ERROR@ACE_ASSERT: file Bug_2434_Regression_Test.cpp, line 51 assertion failed for 'tv1 == tv2'.Aborting...

tests/INET_Addr_Test

[Details] Error: (log/INET_Addr_Test.log): ACE_INET_Addr::ACE_INET_Addr: v6.ipv6-test.com: Valid name, no data record for type
[Details] 2022-11-26 03:01:42.877@LM_ERROR@ACE_INET_Addr::ACE_INET_Addr: v6.ipv6-test.com: Valid name, no data record for type

tests/MT_Reactor_Timer_Test

[Details] ACE_ASSERT: file MT_Reactor_Timer_Test.cpp, line 350 assertion failed for 'time_limit.sec () == 0'.Aborting...
[Details] Error: MT_Reactor_Timer_Test FAILED with exit status 3 after Time:13s
[Details] Error: (log/MT_Reactor_Timer_Test.log): ACE_ASSERT: file MT_Reactor_Timer_Test.cpp, line 350 assertion failed for 'time_limit.sec () == 0'.Aborting...
[Details] Error (log/MT_Reactor_Timer_Test.log): no line with 'Ending'
[Details] 2022-11-26 03:02:25.441@LM_ERROR@ACE_ASSERT: file MT_Reactor_Timer_Test.cpp, line 350 assertion failed for 'time_limit.sec () == 0'.Aborting...

tests/Multihomed_INET_Addr_Test

[Details] Error: Multihomed_INET_Addr_Test FAILED with exit status 1 after Time:0s
[Details] Error: (log/Multihomed_INET_Addr_Test.log): Failed second get_secondary_addresses check
[Details] Error: (log/Multihomed_INET_Addr_Test.log): Failed second get_addresses check (for secondary addresses)
[Details] Error: (log/Multihomed_INET_Addr_Test.log): Failed second get_secondary_addresses check
[Details] Error: (log/Multihomed_INET_Addr_Test.log): Failed second get_secondary_addresses check
[Details] Error: (log/Multihomed_INET_Addr_Test.log): Failed second get_addresses check (for secondary addresses)
[Details] Error: (log/Multihomed_INET_Addr_Test.log): Failed second get_addresses check (for secondary addresses)
[Details] Error: (log/Multihomed_INET_Addr_Test.log): Failed second get_secondary_addresses check
[Details] Error: (log/Multihomed_INET_Addr_Test.log): Failed second get_secondary_addresses check
[Details] Error: (log/Multihomed_INET_Addr_Test.log): Failed second get_secondary_addresses check
[Details] Error: (log/Multihomed_INET_Addr_Test.log): Failed second get_addresses check (for secondary addresses)
[Details] Error: (log/Multihomed_INET_Addr_Test.log): Failed second get_addresses check (for secondary addresses)
[Details] Error: (log/Multihomed_INET_Addr_Test.log): Failed second get_addresses check (for secondary addresses)
[Details] Error: (log/Multihomed_INET_Addr_Test.log): Failed second get_secondary_addresses check
[Details] Error: (log/Multihomed_INET_Addr_Test.log): Failed second get_secondary_addresses check
[Details] Error: (log/Multihomed_INET_Addr_Test.log): Failed second get_secondary_addresses check
[Details] Error: (log/Multihomed_INET_Addr_Test.log): Failed second get_secondary_addresses check
[Details] Error: (log/Multihomed_INET_Addr_Test.log): Failed second get_addresses check (for secondary addresses)
[Details] Error: (log/Multihomed_INET_Addr_Test.log): Failed second get_addresses check (for secondary addresses)
[Details] Error: (log/Multihomed_INET_Addr_Test.log): Failed second get_addresses check (for secondary addresses)
[Details] Error: (log/Multihomed_INET_Addr_Test.log): Failed second get_addresses check (for secondary addresses)
[Details] Error: (log/Multihomed_INET_Addr_Test.log): Failed second get_secondary_addresses check
[Details] Error: (log/Multihomed_INET_Addr_Test.log): Failed second get_secondary_addresses check
[Details] Error: (log/Multihomed_INET_Addr_Test.log): Failed second get_secondary_addresses check
[Details] Error: (log/Multihomed_INET_Addr_Test.log): Failed second get_secondary_addresses check
[Details] Error: (log/Multihomed_INET_Addr_Test.log): Failed second get_secondary_addresses check
[Details] Error: (log/Multihomed_INET_Addr_Test.log): Failed second get_addresses check (for secondary addresses)
[Details] Error: (log/Multihomed_INET_Addr_Test.log): Failed second get_addresses check (for secondary addresses)
[Details] Error: (log/Multihomed_INET_Addr_Test.log): Failed second get_addresses check (for secondary addresses)
[Details] Error: (log/Multihomed_INET_Addr_Test.log): Failed second get_addresses check (for secondary addresses)
[Details] Error: (log/Multihomed_INET_Addr_Test.log): Failed second get_addresses check (for secondary addresses)
[Details] 2022-11-26 03:04:41.306@LM_ERROR@Failed second get_secondary_addresses check
[Details] 2022-11-26 03:04:41.306@LM_ERROR@Failed second get_addresses check (for secondary addresses)
[Details] 2022-11-26 03:04:41.306@LM_ERROR@Failed second get_secondary_addresses check
[Details] 2022-11-26 03:04:41.306@LM_ERROR@Failed second get_secondary_addresses check
[Details] 2022-11-26 03:04:41.306@LM_ERROR@Failed second get_addresses check (for secondary addresses)
[Details] 2022-11-26 03:04:41.306@LM_ERROR@Failed second get_addresses check (for secondary addresses)
[Details] 2022-11-26 03:04:41.306@LM_ERROR@Failed second get_secondary_addresses check
[Details] 2022-11-26 03:04:41.306@LM_ERROR@Failed second get_secondary_addresses check
[Details] 2022-11-26 03:04:41.306@LM_ERROR@Failed second get_secondary_addresses check
[Details] 2022-11-26 03:04:41.306@LM_ERROR@Failed second get_addresses check (for secondary addresses)
[Details] 2022-11-26 03:04:41.306@LM_ERROR@Failed second get_addresses check (for secondary addresses)
[Details] 2022-11-26 03:04:41.306@LM_ERROR@Failed second get_addresses check (for secondary addresses)
[Details] 2022-11-26 03:04:41.306@LM_ERROR@Failed second get_secondary_addresses check
[Details] 2022-11-26 03:04:41.306@LM_ERROR@Failed second get_secondary_addresses check
[Details] 2022-11-26 03:04:41.306@LM_ERROR@Failed second get_secondary_addresses check
[Details] 2022-11-26 03:04:41.306@LM_ERROR@Failed second get_secondary_addresses check
[Details] 2022-11-26 03:04:41.306@LM_ERROR@Failed second get_addresses check (for secondary addresses)
[Details] 2022-11-26 03:04:41.306@LM_ERROR@Failed second get_addresses check (for secondary addresses)
[Details] 2022-11-26 03:04:41.306@LM_ERROR@Failed second get_addresses check (for secondary addresses)
[Details] 2022-11-26 03:04:41.306@LM_ERROR@Failed second get_addresses check (for secondary addresses)
[Details] 2022-11-26 03:04:41.306@LM_ERROR@Failed second get_secondary_addresses check
[Details] 2022-11-26 03:04:41.306@LM_ERROR@Failed second get_secondary_addresses check
[Details] 2022-11-26 03:04:41.306@LM_ERROR@Failed second get_secondary_addresses check
[Details] 2022-11-26 03:04:41.306@LM_ERROR@Failed second get_secondary_addresses check
[Details] 2022-11-26 03:04:41.306@LM_ERROR@Failed second get_secondary_addresses check
[Details] 2022-11-26 03:04:41.306@LM_ERROR@Failed second get_addresses check (for secondary addresses)
[Details] 2022-11-26 03:04:41.307@LM_ERROR@Failed second get_addresses check (for secondary addresses)
[Details] 2022-11-26 03:04:41.307@LM_ERROR@Failed second get_addresses check (for secondary addresses)
[Details] 2022-11-26 03:04:41.307@LM_ERROR@Failed second get_addresses check (for secondary addresses)
[Details] 2022-11-26 03:04:41.307@LM_ERROR@Failed second get_addresses check (for secondary addresses)

tests/OS_Test

[Details] Error: (log/OS_Test.log): Error, ace_isblank should return != 0 for tab but it returned 0
[Details] 2022-11-26 03:04:53.870@LM_ERROR@Error, ace_isblank should return != 0 for tab but it returned 0

tests/SOCK_Dgram_Test

[Details] Error: (log/SOCK_Dgram_Test.log): (6840|360) local addr is not equal to sent-to addr
[Details] 2022-11-26 03:13:01.757@LM_ERROR@(6840|360) local addr is not equal to sent-to addr

TAO/tests/BiDirectional/run_test3557.pl

[Details] ERROR: client timedout
[Details] ERROR: client returned -1
[Details] (4836|5664) EXCEPTION, Caught exception:
[Details] (4836|5664) ERROR: ACCESS VIOLATION
[Details] ERROR: server returned 3221225477

TAO/tests/BiDirectional/run_test_ipv6.pl

[Details] (3324|3520) EXCEPTION, Caught exception:
[Details] ERROR: cannot find file <C:\tao_builds\jenkins\workspace\doc_vc14_i1d0o1w1\TAO\tests\BiDirectional\server.ior>

TAO/tests/DIOP/run_test.pl

[Details] (6576|4076) EXCEPTION, Caught exception:
[Details] ERROR: cannot find file <C:\tao_builds\jenkins\workspace\doc_vc14_i1d0o1w1\TAO\tests\DIOP\test.ior>

TAO/tests/IPV6/run_test.pl

[Details] (5088|5244) EXCEPTION, Exception caught:
[Details] ERROR: cannot find file <C:\tao_builds\jenkins\workspace\doc_vc14_i1d0o1w1\TAO\tests\IPV6\server.ior>
[Details] (7016|5872) EXCEPTION, Exception caught:
[Details] ERROR: cannot find file <C:\tao_builds\jenkins\workspace\doc_vc14_i1d0o1w1\TAO\tests\IPV6\server.ior>

TAO/tests/CallbackTest/run_test_ipv6.pl

[Details] (2600|1184) EXCEPTION, Exception caught:
[Details] ERROR: cannot find file <C:\tao_builds\jenkins\workspace\doc_vc14_i1d0o1w1\TAO\tests\CallbackTest\server.ior>

TAO/tests/POA/EndpointPolicy/run_test_dh.pl

[Details] (1480|2468) EXCEPTION, initialization error
[Details] ERROR: multiprotocol server returned 1

TAO/tests/IORManipulation/filter/run_test.pl

[Details] ERROR: profiles were not correctly filtered
[Details] ERROR: server returned 1

TAO/tests/Connection_Timeout/run_test.pl

[Details] (1712|5296) ERROR: Too long to timeout: 4.500651
[Details] ERROR: test returned 1

TAO/tests/GIOP_Fragments/PMB_With_Fragments/run_test.pl

[Details] ERROR: client returned 19712
[Details] ERROR: server timedout
[Details] ERROR: server returned -1

TAO/orbsvcs/tests/AVStreams/Pluggable/run_test.pl -p TCP,UDP,RTP_UDP

[Details] ERROR: ftp returned 255
[Details] ERROR: ftp returned 255

TAO/orbsvcs/tests/AVStreams/Full_Profile/run_test.pl

[Details] ERROR: ftp returned 255
[Details] ERROR: ftp returned 255

TAO/orbsvcs/tests/AVStreams/Multicast/run_test.pl

[Details] (6396|4764) ERROR: ACCESS VIOLATION
[Details] ERROR: client returned 3221225477

TAO/orbsvcs/tests/AVStreams/Simple_Two_Stage/run_test.pl -p TCP,UDP,RTP_UDP

[Details] ERROR: ftp returned 255
[Details] ERROR: ftp returned 255
[Details] ERROR: ftp returned 255

TAO/orbsvcs/tests/AVStreams/Simple_Two_Stage_With_QoS/run_test.pl -p TCP,UDP,RTP_UDP

[Details] ERROR: ftp returned 255
[Details] ERROR: ftp returned 255

TAO/orbsvcs/tests/AVStreams/Simple_Three_Stage/run_test.pl

[Details] ERROR: Distributer returned 255

TAO/orbsvcs/tests/AVStreams/Asynch_Three_Stage/run_test.pl

[Details] ERROR: distributer returned 255
[Details] (5956|3220) EXCEPTION, TAO_StreamCtrl::bind_devs
[Details] (5956|3220) EXCEPTION, TAO_StreamCtrl::start
[Details] (5956|3220) EXCEPTION, receiver::init
[Details] (3304|2700) EXCEPTION, TAO_StreamCtrl::bind_devs
[Details] (5760|3676) EXCEPTION, TAO_StreamCtrl::bind_devs
[Details] ERROR: distributer returned 255
[Details] ERROR: Receiver 1 returned 4294967295

TAO/orbsvcs/tests/AVStreams/Component_Switching/run_test.pl

[Details] (3264|4604) EXCEPTION, TAO_StreamCtrl::bind_devs
[Details] (3604|2036) EXCEPTION, TAO_StreamCtrl::bind_devs
[Details] (3684|7148) EXCEPTION, TAO_StreamCtrl::bind_devs
[Details] ERROR: distributer 3 returned 255
[Details] ERROR: distributer 2 returned 255
[Details] ERROR: distributer 1 returned 255

TAO/orbsvcs/tests/Bug_2247_Regression/run_test.pl

[Details] ERROR: server 2 returned 3

TAO/orbsvcs/tests/Bug_2777_Regression/run_test.pl

[Details] (2004|4304) EXCEPTION, Exception in nslist
[Details] ERROR: Regression - tao_nslist returned 1

TAO/orbsvcs/tests/HTIOP/Hello/run_test.pl

[Details] (2916|2072) EXCEPTION, Exception caught:
[Details] ERROR: client returned 1
[Details] ERROR: server timedout
[Details] ERROR: server returned -1

TAO/orbsvcs/tests/HTIOP/AMI/run_test.pl

[Details] ERROR: client returned 3221225477
[Details] ERROR: server timedout
[Details] ERROR: server returned -1

TAO/orbsvcs/tests/HTIOP/BiDirectional/run_test.pl

[Details] (6476|7080) EXCEPTION, Caught exception:
[Details] ERROR: client returned 1
[Details] ERROR: server timedout
[Details] ERROR: server returned -1

TAO/orbsvcs/tests/Notify/Basic/run_test_ipv6.pl notify.reactive.conf

[Details] (3968|5552) EXCEPTION, Error:
[Details] ERROR: ConnectDisconnect returned 1
[Details] (2272|3880) EXCEPTION, Error:
[Details] ERROR: Events returned 1
[Details] (6052|6576) EXCEPTION, Error:
[Details] ERROR: IdAssignment returned 1
[Details] (5440|4100) EXCEPTION, Error:
[Details] ERROR: LifeCycle returned 1
[Details] (1732|580) EXCEPTION, Error:
[Details] ERROR: Simple returned 1
[Details] (3336|1364) EXCEPTION, Error:
[Details] ERROR: MultiTypes returned 1
[Details] (6092|5512) EXCEPTION, Error:
[Details] ERROR: Filter returned 1
[Details] (6328|4776) EXCEPTION, Error:
[Details] ERROR: Updates returned 1
[Details] (7008|4992) EXCEPTION, Error:
[Details] ERROR: Sequence returned 1

TAO/orbsvcs/tests/Notify/Basic/run_test_ipv6.pl notify.mt.conf

[Details] (3196|5340) EXCEPTION, Error:
[Details] ERROR: AdminProperties returned 1
[Details] (4292|3448) EXCEPTION, Error:
[Details] ERROR: ConnectDisconnect returned 1
[Details] (7088|4476) EXCEPTION, Error:
[Details] ERROR: Events returned 1
[Details] (6324|2036) EXCEPTION, Error:
[Details] ERROR: IdAssignment returned 1
[Details] (7160|6852) EXCEPTION, Error:
[Details] ERROR: LifeCycle returned 1
[Details] (7148|4228) EXCEPTION, Error:
[Details] ERROR: Simple returned 1
[Details] (5636|6352) EXCEPTION, Error:
[Details] ERROR: MultiTypes returned 1
[Details] (3604|7040) EXCEPTION, Error:
[Details] ERROR: Filter returned 1
[Details] (4728|6028) EXCEPTION, Error:
[Details] ERROR: Updates returned 1
[Details] (6912|6380) EXCEPTION, Error:
[Details] ERROR: Sequence returned 1
[Details] (3452|6500) EXCEPTION, Error:
[Details] ERROR: AdminProperties returned 1
[Details] (5420|3016) EXCEPTION, Error:
[Details] ERROR: ConnectDisconnect returned 1
[Details] (608|5528) EXCEPTION, Error:
[Details] ERROR: Events returned 1
[Details] (2812|5632) EXCEPTION, Error:
[Details] ERROR: IdAssignment returned 1
[Details] (3948|6996) EXCEPTION, Error:
[Details] ERROR: LifeCycle returned 1
[Details] (6760|4364) EXCEPTION, Error:
[Details] ERROR: Simple returned 1
[Details] (7068|5928) EXCEPTION, Error:
[Details] ERROR: MultiTypes returned 1
[Details] (7100|6184) EXCEPTION, Error:
[Details] ERROR: Filter returned 1
[Details] (6212|4112) EXCEPTION, Error:
[Details] ERROR: Updates returned 1
[Details] (5316|5144) EXCEPTION, Error:
[Details] ERROR: Sequence returned 1

TAO/orbsvcs/tests/Notify/Basic/run_test_ipv6.pl notify.rt.conf

[Details] (2468|4784) EXCEPTION, Error:
[Details] ERROR: ConnectDisconnect returned 1
[Details] (788|3572) EXCEPTION, Error:
[Details] ERROR: Events returned 1
[Details] (5012|5372) EXCEPTION, Error:
[Details] ERROR: IdAssignment returned 1
[Details] (6960|4748) EXCEPTION, Error:
[Details] ERROR: LifeCycle returned 1
[Details] (3416|2280) EXCEPTION, Error:
[Details] ERROR: Simple returned 1
[Details] (1968|6820) EXCEPTION, Error:
[Details] ERROR: MultiTypes returned 1
[Details] (4328|2680) EXCEPTION, Error:
[Details] ERROR: Filter returned 1
[Details] (6108|4544) EXCEPTION, Error:
[Details] ERROR: Updates returned 1
[Details] (3120|4272) EXCEPTION, Error:
[Details] ERROR: Sequence returned 1

TAO/orbsvcs/tests/Notify/Persistent_Filter/run_test.pl

[Details] (6772|3596) EXCEPTION, Consumer system error:
[Details] ERROR: Consumer returned 1

TAO/examples/RTScheduling/Fixed_Priority_Scheduler/run_test.pl

[Details] (4476|1260) EXCEPTION, Caught exception:
[Details] ERROR: client returned 1

TAO/examples/RTScheduling/MIF_Scheduler/run_test.pl

[Details] (5044|3284) EXCEPTION, Caught exception:

TAO/orbsvcs/tests/IOR_MCast/run_test_ipv6.pl

[Details] ERROR: Unable to enable multicast on specified address.
[Details] (6712|2348) EXCEPTION, client
[Details] (6712|2348) ERROR: ACCESS VIOLATION
[Details] ERROR: server returned 3221225477

TAO/orbsvcs/tests/Bug_3444_Regression/run_test.pl

[Details] (6628|5924) EXCEPTION, Exception in server.cpp:
[Details] ERROR: cannot find file <C:\tao_builds\jenkins\workspace\doc_vc14_i1d0o1w1\TAO\orbsvcs\tests\Bug_3444_Regression\server.ior>

TAO/orbsvcs/tests/Bug_3444_Regression/run_test_ipv6.pl

[Details] (5672|3524) EXCEPTION, Exception in server.cpp:
[Details] ERROR: cannot find file <C:\tao_builds\jenkins\workspace\doc_vc14_i1d0o1w1\TAO\orbsvcs\tests\Bug_3444_Regression\server.ior>

TAO/examples/PluggableUDP/tests/SimplePerformance/run_test.pl

[Details] (6480|4888) EXCEPTION, Caught exception:
[Details] ERROR: cannot find file <C:\tao_builds\jenkins\workspace\doc_vc14_i1d0o1w1\TAO\examples\PluggableUDP\tests\SimplePerformance\test.ior>

TAO/examples/PluggableUDP/tests/Performance/run_test.pl

[Details] (2296|5604) EXCEPTION, Caught exception:
[Details] ERROR: cannot find file <C:\tao_builds\jenkins\workspace\doc_vc14_i1d0o1w1\TAO\examples\PluggableUDP\tests\Performance\test.ior>

doc_ace6tao2_katydid_win10-x64_vs2019_d1o0

tests/Bug_2434_Regression_Test

[Details] ACE_ASSERT: file C:\tao_builds\jenkins\workspace\doc_vs2019_d1o0\ACE\tests\Bug_2434_Regression_Test.cpp, line 51 assertion failed for 'tv1 == tv2'.Aborting...
[Details] abort() has been calledError: Bug_2434_Regression_Test FAILED with exit status 3 after Time:0s
[Details] Error: (log/Bug_2434_Regression_Test.log): ACE_ASSERT: file C:\tao_builds\jenkins\workspace\doc_vs2019_d1o0\ACE\tests\Bug_2434_Regression_Test.cpp, line 51 assertion failed for 'tv1 == tv2'.Aborting...
[Details] Error (log/Bug_2434_Regression_Test.log): no line with 'Ending'
[Details] 2022-11-26 02:37:30.224@LM_ERROR@ACE_ASSERT: file C:\tao_builds\jenkins\workspace\doc_vs2019_d1o0\ACE\tests\Bug_2434_Regression_Test.cpp, line 51 assertion failed for 'tv1 == tv2'.Aborting...

tests/SSL/Thread_Pool_Reactor_SSL_Test

[Details] ERROR: Thread_Pool_Reactor_SSL_Test timedout
[Details] Error: Thread_Pool_Reactor_SSL_Test FAILED (time out after Time:315s)
[Details] Error: (log/Thread_Pool_Reactor_SSL_Test.log): ACE_SSL (1532|4864) error code: 336151568 - error:14094410:SSL routines:ssl3_read_bytes:sslv3 alert handshake failure
[Details] Error: (log/Thread_Pool_Reactor_SSL_Test.log): ACE_SSL (1532|2312) error code: 337092801 - error:1417A0C1:SSL routines:tls_post_process_client_hello:no shared cipher
[Details] Error: (log/Thread_Pool_Reactor_SSL_Test.log): ACE_SSL (1532|2312) error code: 336462231 - error:140E0197:SSL routines:SSL_shutdown:shutdown while in init
[Details] Error: (log/Thread_Pool_Reactor_SSL_Test.log): ACE_SSL (1532|4864) error code: 336462231 - error:140E0197:SSL routines:SSL_shutdown:shutdown while in init
[Details] Error: (log/Thread_Pool_Reactor_SSL_Test.log): (2312) Handler 0x1db20840: Expected 4 messages; got 0
[Details] Error: (log/Thread_Pool_Reactor_SSL_Test.log): ACE_SSL (1532|4480) error code: 336151568 - error:14094410:SSL routines:ssl3_read_bytes:sslv3 alert handshake failure
[Details] Error: (log/Thread_Pool_Reactor_SSL_Test.log): ACE_SSL (1532|4480) error code: 336462231 - error:140E0197:SSL routines:SSL_shutdown:shutdown while in init
[Details] Error: (log/Thread_Pool_Reactor_SSL_Test.log): ACE_SSL (1532|6344) error code: 337092801 - error:1417A0C1:SSL routines:tls_post_process_client_hello:no shared cipher
[Details] Error: (log/Thread_Pool_Reactor_SSL_Test.log): ACE_SSL (1532|6344) error code: 336462231 - error:140E0197:SSL routines:SSL_shutdown:shutdown while in init
[Details] Error: (log/Thread_Pool_Reactor_SSL_Test.log): (6344) Handler 0x1e4b6cc0: Expected 4 messages; got 0
[Details] Error: (log/Thread_Pool_Reactor_SSL_Test.log): ACE_SSL (1532|1736) error code: 336151568 - error:14094410:SSL routines:ssl3_read_bytes:sslv3 alert handshake failure
[Details] Error: (log/Thread_Pool_Reactor_SSL_Test.log): ACE_SSL (1532|7540) error code: 337092801 - error:1417A0C1:SSL routines:tls_post_process_client_hello:no shared cipher
[Details] Error: (log/Thread_Pool_Reactor_SSL_Test.log): ACE_SSL (1532|1736) error code: 336462231 - error:140E0197:SSL routines:SSL_shutdown:shutdown while in init
[Details] Error: (log/Thread_Pool_Reactor_SSL_Test.log): ACE_SSL (1532|7540) error code: 336462231 - error:140E0197:SSL routines:SSL_shutdown:shutdown while in init
[Details] Error: (log/Thread_Pool_Reactor_SSL_Test.log): (7540) Handler 0x1db08aa0: Expected 4 messages; got 0
[Details] Error: (log/Thread_Pool_Reactor_SSL_Test.log): ACE_SSL (1532|6344) error code: 337092801 - error:1417A0C1:SSL routines:tls_post_process_client_hello:no shared cipher
[Details] Error: (log/Thread_Pool_Reactor_SSL_Test.log): ACE_SSL (1532|2332) error code: 336151568 - error:14094410:SSL routines:ssl3_read_bytes:sslv3 alert handshake failure
[Details] Error: (log/Thread_Pool_Reactor_SSL_Test.log): ACE_SSL (1532|6344) error code: 336462231 - error:140E0197:SSL routines:SSL_shutdown:shutdown while in init
[Details] Error: (log/Thread_Pool_Reactor_SSL_Test.log): ACE_SSL (1532|2332) error code: 336462231 - error:140E0197:SSL routines:SSL_shutdown:shutdown while in init
[Details] Error: (log/Thread_Pool_Reactor_SSL_Test.log): (6344) Handler 0x1db08aa0: Expected 4 messages; got 0
[Details] Error: (log/Thread_Pool_Reactor_SSL_Test.log): (4864) connect: unknown error: 336462231
[Details] Error: (log/Thread_Pool_Reactor_SSL_Test.log): (2332) connect: unknown error: 336462231
[Details] Error: (log/Thread_Pool_Reactor_SSL_Test.log): (1736) connect: unknown error: 336462231
[Details] Error: (log/Thread_Pool_Reactor_SSL_Test.log): ACE_SSL (1532|2332) error code: 336462231 - error:140E0197:SSL routines:SSL_shutdown:shutdown while in init
[Details] Error: (log/Thread_Pool_Reactor_SSL_Test.log): (2332) connect: unknown error: 336462231
[Details] Error: (log/Thread_Pool_Reactor_SSL_Test.log): ACE_SSL (1532|1736) error code: 336462231 - error:140E0197:SSL routines:SSL_shutdown:shutdown while in init
[Details] Error: (log/Thread_Pool_Reactor_SSL_Test.log): ACE_SSL (1532|2332) error code: 336462231 - error:140E0197:SSL routines:SSL_shutdown:shutdown while in init
[Details] Error: (log/Thread_Pool_Reactor_SSL_Test.log): (4480) connect: unknown error: 336462231
[Details] Error: (log/Thread_Pool_Reactor_SSL_Test.log): (2332) connect: unknown error: 336462231
[Details] Error: (log/Thread_Pool_Reactor_SSL_Test.log): ACE_SSL (1532|4480) error code: 336462231 - error:140E0197:SSL routines:SSL_shutdown:shutdown while in init
[Details] Error: (log/Thread_Pool_Reactor_SSL_Test.log): ACE_SSL (1532|2332) error code: 336462231 - error:140E0197:SSL routines:SSL_shutdown:shutdown while in init
[Details] Error: (log/Thread_Pool_Reactor_SSL_Test.log): (4480) connect: unknown error: 336462231
[Details] Error: (log/Thread_Pool_Reactor_SSL_Test.log): (2332) connect: unknown error: 336462231
[Details] Error: (log/Thread_Pool_Reactor_SSL_Test.log): (1736) connect: unknown error: 336462231
[Details] Error: (log/Thread_Pool_Reactor_SSL_Test.log): ACE_SSL (1532|2332) error code: 336462231 - error:140E0197:SSL routines:SSL_shutdown:shutdown while in init
[Details] Error: (log/Thread_Pool_Reactor_SSL_Test.log): (2332) connect: unknown error: 336462231
[Details] Error: (log/Thread_Pool_Reactor_SSL_Test.log): ACE_SSL (1532|1736) error code: 336462231 - error:140E0197:SSL routines:SSL_shutdown:shutdown while in init
[Details] Error: (log/Thread_Pool_Reactor_SSL_Test.log): (1736) connect: unknown error: 336462231
[Details] Error: (log/Thread_Pool_Reactor_SSL_Test.log): ACE_SSL (1532|2332) error code: 336462231 - error:140E0197:SSL routines:SSL_shutdown:shutdown while in init
[Details] Error: (log/Thread_Pool_Reactor_SSL_Test.log): (2332) connect: unknown error: 336462231
[Details] Error: (log/Thread_Pool_Reactor_SSL_Test.log): ACE_SSL (1532|1736) error code: 336462231 - error:140E0197:SSL routines:SSL_shutdown:shutdown while in init
[Details] Error: (log/Thread_Pool_Reactor_SSL_Test.log): ACE_SSL (1532|2332) error code: 336462231 - error:140E0197:SSL routines:SSL_shutdown:shutdown while in init
[Details] Error: (log/Thread_Pool_Reactor_SSL_Test.log): ACE_SSL (1532|4864) error code: 336462231 - error:140E0197:SSL routines:SSL_shutdown:shutdown while in init
[Details] Error: (log/Thread_Pool_Reactor_SSL_Test.log): (2332) connect: unknown error: 336462231
[Details] Error: (log/Thread_Pool_Reactor_SSL_Test.log): ACE_SSL (1532|7540) error code: 336462231 - error:140E0197:SSL routines:SSL_shutdown:shutdown while in init
[Details] Error: (log/Thread_Pool_Reactor_SSL_Test.log): (7540) Handler 0x1db11560: Expected 4 messages; got 0
[Details] Error: (log/Thread_Pool_Reactor_SSL_Test.log): ACE_SSL (1532|2332) error code: 336462231 - error:140E0197:SSL routines:SSL_shutdown:shutdown while in init
[Details] Error: (log/Thread_Pool_Reactor_SSL_Test.log): (2332) connect: unknown error: 336462231
[Details] Error: (log/Thread_Pool_Reactor_SSL_Test.log): (4864) connect: unknown error: 336462231
[Details] Error: (log/Thread_Pool_Reactor_SSL_Test.log): ACE_SSL (1532|2332) error code: 336462231 - error:140E0197:SSL routines:SSL_shutdown:shutdown while in init
[Details] Error: (log/Thread_Pool_Reactor_SSL_Test.log): (2332) connect: unknown error: 336462231
[Details] Error: (log/Thread_Pool_Reactor_SSL_Test.log): ACE_SSL (1532|4864) error code: 336462231 - error:140E0197:SSL routines:SSL_shutdown:shutdown while in init
[Details] Error: (log/Thread_Pool_Reactor_SSL_Test.log): (1736) connect: unknown error: 336462231
[Details] Error: (log/Thread_Pool_Reactor_SSL_Test.log): ACE_SSL (1532|2332) error code: 336462231 - error:140E0197:SSL routines:SSL_shutdown:shutdown while in init
[Details] Error: (log/Thread_Pool_Reactor_SSL_Test.log): (2332) connect: unknown error: 336462231
[Details] Error: (log/Thread_Pool_Reactor_SSL_Test.log): ACE_SSL (1532|1736) error code: 336462231 - error:140E0197:SSL routines:SSL_shutdown:shutdown while in init
[Details] Error: (log/Thread_Pool_Reactor_SSL_Test.log): ACE_SSL (1532|4480) error code: 336462231 - error:140E0197:SSL routines:SSL_shutdown:shutdown while in init
[Details] Error: (log/Thread_Pool_Reactor_SSL_Test.log): (1736) connect: unknown error: 336462231
[Details] Error: (log/Thread_Pool_Reactor_SSL_Test.log): ACE_SSL (1532|6344) error code: 336462231 - error:140E0197:SSL routines:SSL_shutdown:shutdown while in init
[Details] Error: (log/Thread_Pool_Reactor_SSL_Test.log): (4864) connect: unknown error: 336462231
[Details] Error: (log/Thread_Pool_Reactor_SSL_Test.log): (6344) Handler 0x1db11560: Expected 4 messages; got 0
[Details] Error: (log/Thread_Pool_Reactor_SSL_Test.log): ACE_SSL (1532|1736) error code: 336462231 - error:140E0197:SSL routines:SSL_shutdown:shutdown while in init
[Details] Error: (log/Thread_Pool_Reactor_SSL_Test.log): (1736) connect: unknown error: 336462231
[Details] Error: (log/Thread_Pool_Reactor_SSL_Test.log): ACE_SSL (1532|4864) error code: 336462231 - error:140E0197:SSL routines:SSL_shutdown:shutdown while in init
[Details] Error: (log/Thread_Pool_Reactor_SSL_Test.log): ACE_SSL (1532|1736) error code: 336462231 - error:140E0197:SSL routines:SSL_shutdown:shutdown while in init
[Details] Error: (log/Thread_Pool_Reactor_SSL_Test.log): (4864) connect: unknown error: 336462231
[Details] Error: (log/Thread_Pool_Reactor_SSL_Test.log): (1736) connect: unknown error: 336462231
[Details] Error: (log/Thread_Pool_Reactor_SSL_Test.log): ACE_SSL (1532|4864) error code: 336462231 - error:140E0197:SSL routines:SSL_shutdown:shutdown while in init
[Details] Error: (log/Thread_Pool_Reactor_SSL_Test.log): ACE_SSL (1532|1736) error code: 336462231 - error:140E0197:SSL routines:SSL_shutdown:shutdown while in init
[Details] Error: (log/Thread_Pool_Reactor_SSL_Test.log): (4864) connect: unknown error: 336462231
[Details] Error: (log/Thread_Pool_Reactor_SSL_Test.log): (1736) connect: unknown error: 336462231
[Details] Error: (log/Thread_Pool_Reactor_SSL_Test.log): ACE_SSL (1532|4864) error code: 336462231 - error:140E0197:SSL routines:SSL_shutdown:shutdown while in init
[Details] Error: (log/Thread_Pool_Reactor_SSL_Test.log): ACE_SSL (1532|1736) error code: 336462231 - error:140E0197:SSL routines:SSL_shutdown:shutdown while in init
[Details] Error: (log/Thread_Pool_Reactor_SSL_Test.log): (4864) connect: unknown error: 336462231
[Details] Error: (log/Thread_Pool_Reactor_SSL_Test.log): (1736) connect: unknown error: 336462231
[Details] Error: (log/Thread_Pool_Reactor_SSL_Test.log): ACE_SSL (1532|7540) error code: 336462231 - error:140E0197:SSL routines:SSL_shutdown:shutdown while in init
[Details] Error: (log/Thread_Pool_Reactor_SSL_Test.log): ACE_SSL (1532|1736) error code: 336462231 - error:140E0197:SSL routines:SSL_shutdown:shutdown while in init
[Details] Error: (log/Thread_Pool_Reactor_SSL_Test.log): (1736) connect: unknown error: 336462231
[Details] Error: (log/Thread_Pool_Reactor_SSL_Test.log): ACE_SSL (1532|4864) error code: 336462231 - error:140E0197:SSL routines:SSL_shutdown:shutdown while in init
[Details] Error: (log/Thread_Pool_Reactor_SSL_Test.log): (4480) connect: unknown error: 336462231
[Details] Error: (log/Thread_Pool_Reactor_SSL_Test.log): (4864) connect: unknown error: 336462231
[Details] Error: (log/Thread_Pool_Reactor_SSL_Test.log): ACE_SSL (1532|4480) error code: 336462231 - error:140E0197:SSL routines:SSL_shutdown:shutdown while in init
[Details] Error: (log/Thread_Pool_Reactor_SSL_Test.log): (4480) connect: unknown error: 336462231
[Details] Error: (log/Thread_Pool_Reactor_SSL_Test.log): ACE_SSL (1532|4864) error code: 336462231 - error:140E0197:SSL routines:SSL_shutdown:shutdown while in init
[Details] Error: (log/Thread_Pool_Reactor_SSL_Test.log): (4864) connect: unknown error: 336462231
[Details] Error: (log/Thread_Pool_Reactor_SSL_Test.log): ACE_SSL (1532|4480) error code: 336462231 - error:140E0197:SSL routines:SSL_shutdown:shutdown while in init
[Details] Error: (log/Thread_Pool_Reactor_SSL_Test.log): (4480) connect: unknown error: 336462231
[Details] Error: (log/Thread_Pool_Reactor_SSL_Test.log): ACE_SSL (1532|4864) error code: 336462231 - error:140E0197:SSL routines:SSL_shutdown:shutdown while in init
[Details] Error: (log/Thread_Pool_Reactor_SSL_Test.log): (4864) connect: unknown error: 336462231
[Details] Error: (log/Thread_Pool_Reactor_SSL_Test.log): ACE_SSL (1532|4480) error code: 336462231 - error:140E0197:SSL routines:SSL_shutdown:shutdown while in init
[Details] Error: (log/Thread_Pool_Reactor_SSL_Test.log): (4480) connect: unknown error: 336462231
[Details] Error: (log/Thread_Pool_Reactor_SSL_Test.log): ACE_SSL (1532|4864) error code: 336462231 - error:140E0197:SSL routines:SSL_shutdown:shutdown while in init
[Details] Error: (log/Thread_Pool_Reactor_SSL_Test.log): ACE_SSL (1532|4480) error code: 336462231 - error:140E0197:SSL routines:SSL_shutdown:shutdown while in init
[Details] Error: (log/Thread_Pool_Reactor_SSL_Test.log): (4864) connect: unknown error: 336462231
[Details] Error: (log/Thread_Pool_Reactor_SSL_Test.log): (4480) connect: unknown error: 336462231
[Details] Error: (log/Thread_Pool_Reactor_SSL_Test.log): (7540) Handler 0x1db11560: Expected 4 messages; got 0
[Details] Error: (log/Thread_Pool_Reactor_SSL_Test.log): ACE_SSL (1532|4480) error code: 336462231 - error:140E0197:SSL routines:SSL_shutdown:shutdown while in init
[Details] Error: (log/Thread_Pool_Reactor_SSL_Test.log): (4480) connect: unknown error: 336462231
[Details] Error: (log/Thread_Pool_Reactor_SSL_Test.log): ACE_SSL (1532|4480) error code: 336462231 - error:140E0197:SSL routines:SSL_shutdown:shutdown while in init
[Details] Error: (log/Thread_Pool_Reactor_SSL_Test.log): ACE_SSL (1532|6344) error code: 336462231 - error:140E0197:SSL routines:SSL_shutdown:shutdown while in init
[Details] Error: (log/Thread_Pool_Reactor_SSL_Test.log): (4480) connect: unknown error: 336462231
[Details] Error: (log/Thread_Pool_Reactor_SSL_Test.log): (6344) Handler 0x1db20f00: Expected 4 messages; got 0
[Details] Error: (log/Thread_Pool_Reactor_SSL_Test.log): ACE_SSL (1532|4480) error code: 336462231 - error:140E0197:SSL routines:SSL_shutdown:shutdown while in init
[Details] Error: (log/Thread_Pool_Reactor_SSL_Test.log): (4480) connect: unknown error: 336462231
[Details] Error: (log/Thread_Pool_Reactor_SSL_Test.log): ACE_SSL (1532|7540) error code: 336462231 - error:140E0197:SSL routines:SSL_shutdown:shutdown while in init
[Details] Error: (log/Thread_Pool_Reactor_SSL_Test.log): (7540) Handler 0x1db0ce20: Expected 4 messages; got 0
[Details] Error: (log/Thread_Pool_Reactor_SSL_Test.log): ACE_SSL (1532|6344) error code: 336462231 - error:140E0197:SSL routines:SSL_shutdown:shutdown while in init
[Details] Error: (log/Thread_Pool_Reactor_SSL_Test.log): (6344) Handler 0x1db0ce20: Expected 4 messages; got 0
[Details] Error: (log/Thread_Pool_Reactor_SSL_Test.log): ACE_SSL (1532|7540) error code: 336462231 - error:140E0197:SSL routines:SSL_shutdown:shutdown while in init
[Details] Error: (log/Thread_Pool_Reactor_SSL_Test.log): (7540) Handler 0x1db0ce20: Expected 4 messages; got 0
[Details] Error: (log/Thread_Pool_Reactor_SSL_Test.log): ACE_SSL (1532|6344) error code: 336462231 - error:140E0197:SSL routines:SSL_shutdown:shutdown while in init
[Details] Error: (log/Thread_Pool_Reactor_SSL_Test.log): (6344) Handler 0x1db0ce20: Expected 4 messages; got 0
[Details] Error: (log/Thread_Pool_Reactor_SSL_Test.log): ACE_SSL (1532|7540) error code: 336462231 - error:140E0197:SSL routines:SSL_shutdown:shutdown while in init
[Details] Error: (log/Thread_Pool_Reactor_SSL_Test.log): (7540) Handler 0x1db0ce20: Expected 4 messages; got 0
[Details] Error: (log/Thread_Pool_Reactor_SSL_Test.log): ACE_SSL (1532|6344) error code: 336462231 - error:140E0197:SSL routines:SSL_shutdown:shutdown while in init
[Details] Error: (log/Thread_Pool_Reactor_SSL_Test.log): (6344) Handler 0x1db0ce20: Expected 4 messages; got 0
[Details] Error: (log/Thread_Pool_Reactor_SSL_Test.log): ACE_SSL (1532|7540) error code: 336462231 - error:140E0197:SSL routines:SSL_shutdown:shutdown while in init
[Details] Error: (log/Thread_Pool_Reactor_SSL_Test.log): (7540) Handler 0x1db0ce20: Expected 4 messages; got 0
[Details] Error: (log/Thread_Pool_Reactor_SSL_Test.log): ACE_SSL (1532|6344) error code: 336462231 - error:140E0197:SSL routines:SSL_shutdown:shutdown while in init
[Details] Error: (log/Thread_Pool_Reactor_SSL_Test.log): (6344) Handler 0x1db0ce20: Expected 4 messages; got 0
[Details] Error: (log/Thread_Pool_Reactor_SSL_Test.log): ACE_SSL (1532|7540) error code: 336462231 - error:140E0197:SSL routines:SSL_shutdown:shutdown while in init
[Details] Error: (log/Thread_Pool_Reactor_SSL_Test.log): (7540) Handler 0x1db0ce20: Expected 4 messages; got 0
[Details] Error: (log/Thread_Pool_Reactor_SSL_Test.log): ACE_SSL (1532|6344) error code: 336462231 - error:140E0197:SSL routines:SSL_shutdown:shutdown while in init
[Details] Error: (log/Thread_Pool_Reactor_SSL_Test.log): (6344) Handler 0x1db0ce20: Expected 4 messages; got 0
[Details] Error: (log/Thread_Pool_Reactor_SSL_Test.log): ACE_SSL (1532|7540) error code: 336462231 - error:140E0197:SSL routines:SSL_shutdown:shutdown while in init
[Details] Error: (log/Thread_Pool_Reactor_SSL_Test.log): (7540) Handler 0x1db0ce20: Expected 4 messages; got 0
[Details] Error: (log/Thread_Pool_Reactor_SSL_Test.log): ACE_SSL (1532|6344) error code: 336462231 - error:140E0197:SSL routines:SSL_shutdown:shutdown while in init
[Details] Error: (log/Thread_Pool_Reactor_SSL_Test.log): (6344) Handler 0x1db0ce20: Expected 4 messages; got 0
[Details] Error: (log/Thread_Pool_Reactor_SSL_Test.log): ACE_SSL (1532|7540) error code: 336462231 - error:140E0197:SSL routines:SSL_shutdown:shutdown while in init
[Details] Error: (log/Thread_Pool_Reactor_SSL_Test.log): (7540) Handler 0x1db0ce20: Expected 4 messages; got 0
[Details] Error: (log/Thread_Pool_Reactor_SSL_Test.log): ACE_SSL (1532|6344) error code: 336462231 - error:140E0197:SSL routines:SSL_shutdown:shutdown while in init
[Details] Error: (log/Thread_Pool_Reactor_SSL_Test.log): (6344) Handler 0x1db0ce20: Expected 4 messages; got 0
[Details] Error: (log/Thread_Pool_Reactor_SSL_Test.log): ACE_SSL (1532|7540) error code: 336462231 - error:140E0197:SSL routines:SSL_shutdown:shutdown while in init
[Details] Error: (log/Thread_Pool_Reactor_SSL_Test.log): (7540) Handler 0x1db0ce20: Expected 4 messages; got 0
[Details] Error: (log/Thread_Pool_Reactor_SSL_Test.log): ACE_SSL (1532|6344) error code: 336462231 - error:140E0197:SSL routines:SSL_shutdown:shutdown while in init
[Details] Error: (log/Thread_Pool_Reactor_SSL_Test.log): (6344) Handler 0x1db0ce20: Expected 4 messages; got 0
[Details] Error: (log/Thread_Pool_Reactor_SSL_Test.log): ACE_SSL (1532|7540) error code: 336462231 - error:140E0197:SSL routines:SSL_shutdown:shutdown while in init
[Details] Error: (log/Thread_Pool_Reactor_SSL_Test.log): (7540) Handler 0x1db0ce20: Expected 4 messages; got 0
[Details] Error: (log/Thread_Pool_Reactor_SSL_Test.log): ACE_SSL (1532|6344) error code: 336462231 - error:140E0197:SSL routines:SSL_shutdown:shutdown while in init
[Details] Error: (log/Thread_Pool_Reactor_SSL_Test.log): (6344) Handler 0x1db0ce20: Expected 4 messages; got 0
[Details] Error: (log/Thread_Pool_Reactor_SSL_Test.log): ACE_SSL (1532|7540) error code: 336462231 - error:140E0197:SSL routines:SSL_shutdown:shutdown while in init
[Details] Error: (log/Thread_Pool_Reactor_SSL_Test.log): (7540) Handler 0x1db0ce20: Expected 4 messages; got 0
[Details] Error: (log/Thread_Pool_Reactor_SSL_Test.log): ACE_SSL (1532|6344) error code: 336462231 - error:140E0197:SSL routines:SSL_shutdown:shutdown while in init
[Details] Error: (log/Thread_Pool_Reactor_SSL_Test.log): (6344) Handler 0x1db0ce20: Expected 4 messages; got 0
[Details] Error: (log/Thread_Pool_Reactor_SSL_Test.log): ACE_SSL (1532|7540) error code: 336462231 - error:140E0197:SSL routines:SSL_shutdown:shutdown while in init
[Details] Error: (log/Thread_Pool_Reactor_SSL_Test.log): (7540) Handler 0x1db0ce20: Expected 4 messages; got 0
[Details] Error: (log/Thread_Pool_Reactor_SSL_Test.log): ACE_SSL (1532|6344) error code: 336462231 - error:140E0197:SSL routines:SSL_shutdown:shutdown while in init
[Details] Error: (log/Thread_Pool_Reactor_SSL_Test.log): (6344) Handler 0x1db0ce20: Expected 4 messages; got 0
[Details] Error: (log/Thread_Pool_Reactor_SSL_Test.log): ACE_SSL (1532|7540) error code: 336462231 - error:140E0197:SSL routines:SSL_shutdown:shutdown while in init
[Details] Error: (log/Thread_Pool_Reactor_SSL_Test.log): (7540) Handler 0x1db0ce20: Expected 4 messages; got 0
[Details] Error: (log/Thread_Pool_Reactor_SSL_Test.log): ACE_SSL (1532|6344) error code: 336462231 - error:140E0197:SSL routines:SSL_shutdown:shutdown while in init
[Details] Error: (log/Thread_Pool_Reactor_SSL_Test.log): (6344) Handler 0x1db0ce20: Expected 4 messages; got 0
[Details] Error: (log/Thread_Pool_Reactor_SSL_Test.log): ACE_SSL (1532|7540) error code: 336462231 - error:140E0197:SSL routines:SSL_shutdown:shutdown while in init
[Details] Error: (log/Thread_Pool_Reactor_SSL_Test.log): (7540) Handler 0x1db0ce20: Expected 4 messages; got 0
[Details] Error: (log/Thread_Pool_Reactor_SSL_Test.log): ACE_SSL (1532|6344) error code: 336462231 - error:140E0197:SSL routines:SSL_shutdown:shutdown while in init
[Details] Error: (log/Thread_Pool_Reactor_SSL_Test.log): (6344) Handler 0x1db0ce20: Expected 4 messages; got 0
[Details] Error: (log/Thread_Pool_Reactor_SSL_Test.log): ACE_SSL (1532|7540) error code: 336462231 - error:140E0197:SSL routines:SSL_shutdown:shutdown while in init
[Details] Error: (log/Thread_Pool_Reactor_SSL_Test.log): (7540) Handler 0x1db0ce20: Expected 4 messages; got 0
[Details] Error: (log/Thread_Pool_Reactor_SSL_Test.log): ACE_SSL (1532|6344) error code: 336462231 - error:140E0197:SSL routines:SSL_shutdown:shutdown while in init
[Details] Error: (log/Thread_Pool_Reactor_SSL_Test.log): (6344) Handler 0x1db0ce20: Expected 4 messages; got 0
[Details] Error: (log/Thread_Pool_Reactor_SSL_Test.log): ACE_SSL (1532|7540) error code: 336462231 - error:140E0197:SSL routines:SSL_shutdown:shutdown while in init
[Details] Error: (log/Thread_Pool_Reactor_SSL_Test.log): (7540) Handler 0x1db0ce20: Expected 4 messages; got 0
[Details] Error: (log/Thread_Pool_Reactor_SSL_Test.log): ACE_SSL (1532|6344) error code: 336462231 - error:140E0197:SSL routines:SSL_shutdown:shutdown while in init
[Details] Error: (log/Thread_Pool_Reactor_SSL_Test.log): (6344) Handler 0x1db0ce20: Expected 4 messages; got 0
[Details] Error: (log/Thread_Pool_Reactor_SSL_Test.log): ACE_SSL (1532|7540) error code: 336462231 - error:140E0197:SSL routines:SSL_shutdown:shutdown while in init
[Details] Error: (log/Thread_Pool_Reactor_SSL_Test.log): (7540) Handler 0x1db0ce20: Expected 4 messages; got 0
[Details] Error: (log/Thread_Pool_Reactor_SSL_Test.log): ACE_SSL (1532|6344) error code: 336462231 - error:140E0197:SSL routines:SSL_shutdown:shutdown while in init
[Details] Error: (log/Thread_Pool_Reactor_SSL_Test.log): (6344) Handler 0x1db0ce20: Expected 4 messages; got 0
[Details] Error: (log/Thread_Pool_Reactor_SSL_Test.log): ACE_SSL (1532|7540) error code: 337092801 - error:1417A0C1:SSL routines:tls_post_process_client_hello:no shared cipher
[Details] Error: (log/Thread_Pool_Reactor_SSL_Test.log): ACE_SSL (1532|6460) error code: 336151568 - error:14094410:SSL routines:ssl3_read_bytes:sslv3 alert handshake failure
[Details] Error: (log/Thread_Pool_Reactor_SSL_Test.log): ACE_SSL (1532|7540) error code: 336462231 - error:140E0197:SSL routines:SSL_shutdown:shutdown while in init
[Details] Error: (log/Thread_Pool_Reactor_SSL_Test.log): ACE_SSL (1532|6460) error code: 336462231 - error:140E0197:SSL routines:SSL_shutdown:shutdown while in init
[Details] Error: (log/Thread_Pool_Reactor_SSL_Test.log): (7540) Handler 0x1db0ce20: Expected 4 messages; got 0
[Details] Error: (log/Thread_Pool_Reactor_SSL_Test.log): (6460) connect: unknown error: 336462231 Error while connecting
[Details] Error: (log/Thread_Pool_Reactor_SSL_Test.log): (6460) send_n: unknown error: 336462231
[Details] Error: (log/Thread_Pool_Reactor_SSL_Test.log): ACE_SSL (1532|6460) error code: 336462231 - error:140E0197:SSL routines:SSL_shutdown:shutdown while in init
[Details] Error (log/Thread_Pool_Reactor_SSL_Test.log): no line with 'Ending'
[Details] 2022-11-26 02:53:40.855@LM_ERROR@ACE_SSL (1532|4864) error code: 336151568 - error:14094410:SSL routines:ssl3_read_bytes:sslv3 alert handshake failure
[Details] 2022-11-26 02:53:40.855@LM_ERROR@ACE_SSL (1532|2312) error code: 337092801 - error:1417A0C1:SSL routines:tls_post_process_client_hello:no shared cipher
[Details] 2022-11-26 02:53:40.855@LM_ERROR@ACE_SSL (1532|2312) error code: 336462231 - error:140E0197:SSL routines:SSL_shutdown:shutdown while in init
[Details] 2022-11-26 02:53:40.855@LM_ERROR@ACE_SSL (1532|4864) error code: 336462231 - error:140E0197:SSL routines:SSL_shutdown:shutdown while in init
[Details] 2022-11-26 02:53:40.855@LM_ERROR@(2312) Handler 0x1db20840: Expected 4 messages; got 0
[Details] 2022-11-26 02:53:40.855@LM_ERROR@ACE_SSL (1532|4480) error code: 336151568 - error:14094410:SSL routines:ssl3_read_bytes:sslv3 alert handshake failure
[Details] 2022-11-26 02:53:40.855@LM_ERROR@ACE_SSL (1532|4480) error code: 336462231 - error:140E0197:SSL routines:SSL_shutdown:shutdown while in init
[Details] 2022-11-26 02:53:40.855@LM_ERROR@ACE_SSL (1532|6344) error code: 337092801 - error:1417A0C1:SSL routines:tls_post_process_client_hello:no shared cipher
[Details] 2022-11-26 02:53:40.855@LM_ERROR@ACE_SSL (1532|6344) error code: 336462231 - error:140E0197:SSL routines:SSL_shutdown:shutdown while in init
[Details] 2022-11-26 02:53:40.855@LM_ERROR@(6344) Handler 0x1e4b6cc0: Expected 4 messages; got 0
[Details] 2022-11-26 02:53:40.855@LM_ERROR@ACE_SSL (1532|1736) error code: 336151568 - error:14094410:SSL routines:ssl3_read_bytes:sslv3 alert handshake failure
[Details] 2022-11-26 02:53:40.855@LM_ERROR@ACE_SSL (1532|7540) error code: 337092801 - error:1417A0C1:SSL routines:tls_post_process_client_hello:no shared cipher
[Details] 2022-11-26 02:53:40.855@LM_ERROR@ACE_SSL (1532|1736) error code: 336462231 - error:140E0197:SSL routines:SSL_shutdown:shutdown while in init
[Details] 2022-11-26 02:53:40.855@LM_ERROR@ACE_SSL (1532|7540) error code: 336462231 - error:140E0197:SSL routines:SSL_shutdown:shutdown while in init
[Details] 2022-11-26 02:53:40.855@LM_ERROR@(7540) Handler 0x1db08aa0: Expected 4 messages; got 0
[Details] 2022-11-26 02:53:40.871@LM_ERROR@ACE_SSL (1532|6344) error code: 337092801 - error:1417A0C1:SSL routines:tls_post_process_client_hello:no shared cipher
[Details] 2022-11-26 02:53:40.871@LM_ERROR@ACE_SSL (1532|2332) error code: 336151568 - error:14094410:SSL routines:ssl3_read_bytes:sslv3 alert handshake failure
[Details] 2022-11-26 02:53:40.871@LM_ERROR@ACE_SSL (1532|6344) error code: 336462231 - error:140E0197:SSL routines:SSL_shutdown:shutdown while in init
[Details] 2022-11-26 02:53:40.871@LM_ERROR@ACE_SSL (1532|2332) error code: 336462231 - error:140E0197:SSL routines:SSL_shutdown:shutdown while in init
[Details] 2022-11-26 02:53:40.871@LM_ERROR@(6344) Handler 0x1db08aa0: Expected 4 messages; got 0
[Details] 2022-11-26 02:53:40.855@LM_ERROR@(4864) connect: unknown error: 336462231
[Details] 2022-11-26 02:53:40.871@LM_ERROR@(2332) connect: unknown error: 336462231
[Details] 2022-11-26 02:53:40.855@LM_ERROR@(1736) connect: unknown error: 336462231
[Details] 2022-11-26 02:53:40.934@LM_ERROR@ACE_SSL (1532|2332) error code: 336462231 - error:140E0197:SSL routines:SSL_shutdown:shutdown while in init
[Details] 2022-11-26 02:53:40.934@LM_ERROR@(2332) connect: unknown error: 336462231
[Details] 2022-11-26 02:53:40.934@LM_ERROR@ACE_SSL (1532|1736) error code: 336462231 - error:140E0197:SSL routines:SSL_shutdown:shutdown while in init
[Details] 2022-11-26 02:53:40.934@LM_ERROR@ACE_SSL (1532|2332) error code: 336462231 - error:140E0197:SSL routines:SSL_shutdown:shutdown while in init
[Details] 2022-11-26 02:53:40.855@LM_ERROR@(4480) connect: unknown error: 336462231
[Details] 2022-11-26 02:53:40.934@LM_ERROR@(2332) connect: unknown error: 336462231
[Details] 2022-11-26 02:53:40.934@LM_ERROR@ACE_SSL (1532|4480) error code: 336462231 - error:140E0197:SSL routines:SSL_shutdown:shutdown while in init
[Details] 2022-11-26 02:53:40.934@LM_ERROR@ACE_SSL (1532|2332) error code: 336462231 - error:140E0197:SSL routines:SSL_shutdown:shutdown while in init
[Details] 2022-11-26 02:53:40.934@LM_ERROR@(4480) connect: unknown error: 336462231
[Details] 2022-11-26 02:53:40.934@LM_ERROR@(2332) connect: unknown error: 336462231
[Details] 2022-11-26 02:53:40.934@LM_ERROR@(1736) connect: unknown error: 336462231
[Details] 2022-11-26 02:53:40.934@LM_ERROR@ACE_SSL (1532|2332) error code: 336462231 - error:140E0197:SSL routines:SSL_shutdown:shutdown while in init
[Details] 2022-11-26 02:53:40.934@LM_ERROR@(2332) connect: unknown error: 336462231
[Details] 2022-11-26 02:53:40.934@LM_ERROR@ACE_SSL (1532|1736) error code: 336462231 - error:140E0197:SSL routines:SSL_shutdown:shutdown while in init
[Details] 2022-11-26 02:53:40.934@LM_ERROR@(1736) connect: unknown error: 336462231
[Details] 2022-11-26 02:53:40.934@LM_ERROR@ACE_SSL (1532|2332) error code: 336462231 - error:140E0197:SSL routines:SSL_shutdown:shutdown while in init
[Details] 2022-11-26 02:53:40.934@LM_ERROR@(2332) connect: unknown error: 336462231
[Details] 2022-11-26 02:53:40.934@LM_ERROR@ACE_SSL (1532|1736) error code: 336462231 - error:140E0197:SSL routines:SSL_shutdown:shutdown while in init
[Details] 2022-11-26 02:53:40.934@LM_ERROR@ACE_SSL (1532|2332) error code: 336462231 - error:140E0197:SSL routines:SSL_shutdown:shutdown while in init
[Details] 2022-11-26 02:53:40.934@LM_ERROR@ACE_SSL (1532|4864) error code: 336462231 - error:140E0197:SSL routines:SSL_shutdown:shutdown while in init
[Details] 2022-11-26 02:53:40.934@LM_ERROR@(2332) connect: unknown error: 336462231
[Details] 2022-11-26 02:53:40.934@LM_ERROR@ACE_SSL (1532|7540) error code: 336462231 - error:140E0197:SSL routines:SSL_shutdown:shutdown while in init
[Details] 2022-11-26 02:53:40.934@LM_ERROR@(7540) Handler 0x1db11560: Expected 4 messages; got 0
[Details] 2022-11-26 02:53:40.934@LM_ERROR@ACE_SSL (1532|2332) error code: 336462231 - error:140E0197:SSL routines:SSL_shutdown:shutdown while in init
[Details] 2022-11-26 02:53:40.934@LM_ERROR@(2332) connect: unknown error: 336462231
[Details] 2022-11-26 02:53:40.934@LM_ERROR@(4864) connect: unknown error: 336462231
[Details] 2022-11-26 02:53:40.934@LM_ERROR@ACE_SSL (1532|2332) error code: 336462231 - error:140E0197:SSL routines:SSL_shutdown:shutdown while in init
[Details] 2022-11-26 02:53:40.934@LM_ERROR@(2332) connect: unknown error: 336462231
[Details] 2022-11-26 02:53:40.934@LM_ERROR@ACE_SSL (1532|4864) error code: 336462231 - error:140E0197:SSL routines:SSL_shutdown:shutdown while in init
[Details] 2022-11-26 02:53:40.934@LM_ERROR@(1736) connect: unknown error: 336462231
[Details] 2022-11-26 02:53:40.934@LM_ERROR@ACE_SSL (1532|2332) error code: 336462231 - error:140E0197:SSL routines:SSL_shutdown:shutdown while in init
[Details] 2022-11-26 02:53:40.934@LM_ERROR@(2332) connect: unknown error: 336462231
[Details] 2022-11-26 02:53:40.934@LM_ERROR@ACE_SSL (1532|1736) error code: 336462231 - error:140E0197:SSL routines:SSL_shutdown:shutdown while in init
[Details] 2022-11-26 02:53:40.934@LM_ERROR@ACE_SSL (1532|4480) error code: 336462231 - error:140E0197:SSL routines:SSL_shutdown:shutdown while in init
[Details] 2022-11-26 02:53:40.934@LM_ERROR@(1736) connect: unknown error: 336462231
[Details] 2022-11-26 02:53:40.934@LM_ERROR@ACE_SSL (1532|6344) error code: 336462231 - error:140E0197:SSL routines:SSL_shutdown:shutdown while in init
[Details] 2022-11-26 02:53:40.934@LM_ERROR@(4864) connect: unknown error: 336462231
[Details] 2022-11-26 02:53:40.934@LM_ERROR@(6344) Handler 0x1db11560: Expected 4 messages; got 0
[Details] 2022-11-26 02:53:40.934@LM_ERROR@ACE_SSL (1532|1736) error code: 336462231 - error:140E0197:SSL routines:SSL_shutdown:shutdown while in init
[Details] 2022-11-26 02:53:40.934@LM_ERROR@(1736) connect: unknown error: 336462231
[Details] 2022-11-26 02:53:40.934@LM_ERROR@ACE_SSL (1532|4864) error code: 336462231 - error:140E0197:SSL routines:SSL_shutdown:shutdown while in init
[Details] 2022-11-26 02:53:40.934@LM_ERROR@ACE_SSL (1532|1736) error code: 336462231 - error:140E0197:SSL routines:SSL_shutdown:shutdown while in init
[Details] 2022-11-26 02:53:40.934@LM_ERROR@(4864) connect: unknown error: 336462231
[Details] 2022-11-26 02:53:40.934@LM_ERROR@(1736) connect: unknown error: 336462231
[Details] 2022-11-26 02:53:40.934@LM_ERROR@ACE_SSL (1532|4864) error code: 336462231 - error:140E0197:SSL routines:SSL_shutdown:shutdown while in init
[Details] 2022-11-26 02:53:40.934@LM_ERROR@ACE_SSL (1532|1736) error code: 336462231 - error:140E0197:SSL routines:SSL_shutdown:shutdown while in init
[Details] 2022-11-26 02:53:40.934@LM_ERROR@(4864) connect: unknown error: 336462231
[Details] 2022-11-26 02:53:40.934@LM_ERROR@(1736) connect: unknown error: 336462231
[Details] 2022-11-26 02:53:40.934@LM_ERROR@ACE_SSL (1532|4864) error code: 336462231 - error:140E0197:SSL routines:SSL_shutdown:shutdown while in init
[Details] 2022-11-26 02:53:40.934@LM_ERROR@ACE_SSL (1532|1736) error code: 336462231 - error:140E0197:SSL routines:SSL_shutdown:shutdown while in init
[Details] 2022-11-26 02:53:40.934@LM_ERROR@(4864) connect: unknown error: 336462231
[Details] 2022-11-26 02:53:40.934@LM_ERROR@(1736) connect: unknown error: 336462231
[Details] 2022-11-26 02:53:40.934@LM_ERROR@ACE_SSL (1532|7540) error code: 336462231 - error:140E0197:SSL routines:SSL_shutdown:shutdown while in init
[Details] 2022-11-26 02:53:40.934@LM_ERROR@ACE_SSL (1532|1736) error code: 336462231 - error:140E0197:SSL routines:SSL_shutdown:shutdown while in init
[Details] 2022-11-26 02:53:40.949@LM_ERROR@(1736) connect: unknown error: 336462231
[Details] 2022-11-26 02:53:40.949@LM_ERROR@ACE_SSL (1532|4864) error code: 336462231 - error:140E0197:SSL routines:SSL_shutdown:shutdown while in init
[Details] 2022-11-26 02:53:40.934@LM_ERROR@(4480) connect: unknown error: 336462231
[Details] 2022-11-26 02:53:40.949@LM_ERROR@(4864) connect: unknown error: 336462231
[Details] 2022-11-26 02:53:40.949@LM_ERROR@ACE_SSL (1532|4480) error code: 336462231 - error:140E0197:SSL routines:SSL_shutdown:shutdown while in init
[Details] 2022-11-26 02:53:40.949@LM_ERROR@(4480) connect: unknown error: 336462231
[Details] 2022-11-26 02:53:40.949@LM_ERROR@ACE_SSL (1532|4864) error code: 336462231 - error:140E0197:SSL routines:SSL_shutdown:shutdown while in init
[Details] 2022-11-26 02:53:40.949@LM_ERROR@(4864) connect: unknown error: 336462231
[Details] 2022-11-26 02:53:40.949@LM_ERROR@ACE_SSL (1532|4480) error code: 336462231 - error:140E0197:SSL routines:SSL_shutdown:shutdown while in init
[Details] 2022-11-26 02:53:40.949@LM_ERROR@(4480) connect: unknown error: 336462231
[Details] 2022-11-26 02:53:40.949@LM_ERROR@ACE_SSL (1532|4864) error code: 336462231 - error:140E0197:SSL routines:SSL_shutdown:shutdown while in init
[Details] 2022-11-26 02:53:40.949@LM_ERROR@(4864) connect: unknown error: 336462231
[Details] 2022-11-26 02:53:40.949@LM_ERROR@ACE_SSL (1532|4480) error code: 336462231 - error:140E0197:SSL routines:SSL_shutdown:shutdown while in init
[Details] 2022-11-26 02:53:40.949@LM_ERROR@(4480) connect: unknown error: 336462231
[Details] 2022-11-26 02:53:40.949@LM_ERROR@ACE_SSL (1532|4864) error code: 336462231 - error:140E0197:SSL routines:SSL_shutdown:shutdown while in init
[Details] 2022-11-26 02:53:40.949@LM_ERROR@ACE_SSL (1532|4480) error code: 336462231 - error:140E0197:SSL routines:SSL_shutdown:shutdown while in init
[Details] 2022-11-26 02:53:40.949@LM_ERROR@(4864) connect: unknown error: 336462231
[Details] 2022-11-26 02:53:40.949@LM_ERROR@(4480) connect: unknown error: 336462231
[Details] 2022-11-26 02:53:40.949@LM_ERROR@(7540) Handler 0x1db11560: Expected 4 messages; got 0
[Details] 2022-11-26 02:53:40.949@LM_ERROR@ACE_SSL (1532|4480) error code: 336462231 - error:140E0197:SSL routines:SSL_shutdown:shutdown while in init
[Details] 2022-11-26 02:53:40.949@LM_ERROR@(4480) connect: unknown error: 336462231
[Details] 2022-11-26 02:53:40.949@LM_ERROR@ACE_SSL (1532|4480) error code: 336462231 - error:140E0197:SSL routines:SSL_shutdown:shutdown while in init
[Details] 2022-11-26 02:53:40.949@LM_ERROR@ACE_SSL (1532|6344) error code: 336462231 - error:140E0197:SSL routines:SSL_shutdown:shutdown while in init
[Details] 2022-11-26 02:53:40.949@LM_ERROR@(4480) connect: unknown error: 336462231
[Details] 2022-11-26 02:53:40.949@LM_ERROR@(6344) Handler 0x1db20f00: Expected 4 messages; got 0
[Details] 2022-11-26 02:53:40.949@LM_ERROR@ACE_SSL (1532|4480) error code: 336462231 - error:140E0197:SSL routines:SSL_shutdown:shutdown while in init
[Details] 2022-11-26 02:53:40.949@LM_ERROR@(4480) connect: unknown error: 336462231
[Details] 2022-11-26 02:53:40.949@LM_ERROR@ACE_SSL (1532|7540) error code: 336462231 - error:140E0197:SSL routines:SSL_shutdown:shutdown while in init
[Details] 2022-11-26 02:53:40.949@LM_ERROR@(7540) Handler 0x1db0ce20: Expected 4 messages; got 0
[Details] 2022-11-26 02:53:40.949@LM_ERROR@ACE_SSL (1532|6344) error code: 336462231 - error:140E0197:SSL routines:SSL_shutdown:shutdown while in init
[Details] 2022-11-26 02:53:40.949@LM_ERROR@(6344) Handler 0x1db0ce20: Expected 4 messages; got 0
[Details] 2022-11-26 02:53:40.949@LM_ERROR@ACE_SSL (1532|7540) error code: 336462231 - error:140E0197:SSL routines:SSL_shutdown:shutdown while in init
[Details] 2022-11-26 02:53:40.949@LM_ERROR@(7540) Handler 0x1db0ce20: Expected 4 messages; got 0
[Details] 2022-11-26 02:53:40.949@LM_ERROR@ACE_SSL (1532|6344) error code: 336462231 - error:140E0197:SSL routines:SSL_shutdown:shutdown while in init
[Details] 2022-11-26 02:53:40.949@LM_ERROR@(6344) Handler 0x1db0ce20: Expected 4 messages; got 0
[Details] 2022-11-26 02:53:40.949@LM_ERROR@ACE_SSL (1532|7540) error code: 336462231 - error:140E0197:SSL routines:SSL_shutdown:shutdown while in init
[Details] 2022-11-26 02:53:40.949@LM_ERROR@(7540) Handler 0x1db0ce20: Expected 4 messages; got 0
[Details] 2022-11-26 02:53:40.949@LM_ERROR@ACE_SSL (1532|6344) error code: 336462231 - error:140E0197:SSL routines:SSL_shutdown:shutdown while in init
[Details] 2022-11-26 02:53:40.949@LM_ERROR@(6344) Handler 0x1db0ce20: Expected 4 messages; got 0
[Details] 2022-11-26 02:53:40.949@LM_ERROR@ACE_SSL (1532|7540) error code: 336462231 - error:140E0197:SSL routines:SSL_shutdown:shutdown while in init
[Details] 2022-11-26 02:53:40.949@LM_ERROR@(7540) Handler 0x1db0ce20: Expected 4 messages; got 0
[Details] 2022-11-26 02:53:40.949@LM_ERROR@ACE_SSL (1532|6344) error code: 336462231 - error:140E0197:SSL routines:SSL_shutdown:shutdown while in init
[Details] 2022-11-26 02:53:40.949@LM_ERROR@(6344) Handler 0x1db0ce20: Expected 4 messages; got 0
[Details] 2022-11-26 02:53:40.949@LM_ERROR@ACE_SSL (1532|7540) error code: 336462231 - error:140E0197:SSL routines:SSL_shutdown:shutdown while in init
[Details] 2022-11-26 02:53:40.949@LM_ERROR@(7540) Handler 0x1db0ce20: Expected 4 messages; got 0
[Details] 2022-11-26 02:53:40.965@LM_ERROR@ACE_SSL (1532|6344) error code: 336462231 - error:140E0197:SSL routines:SSL_shutdown:shutdown while in init
[Details] 2022-11-26 02:53:40.965@LM_ERROR@(6344) Handler 0x1db0ce20: Expected 4 messages; got 0
[Details] 2022-11-26 02:53:40.965@LM_ERROR@ACE_SSL (1532|7540) error code: 336462231 - error:140E0197:SSL routines:SSL_shutdown:shutdown while in init
[Details] 2022-11-26 02:53:40.965@LM_ERROR@(7540) Handler 0x1db0ce20: Expected 4 messages; got 0
[Details] 2022-11-26 02:53:40.965@LM_ERROR@ACE_SSL (1532|6344) error code: 336462231 - error:140E0197:SSL routines:SSL_shutdown:shutdown while in init
[Details] 2022-11-26 02:53:40.965@LM_ERROR@(6344) Handler 0x1db0ce20: Expected 4 messages; got 0
[Details] 2022-11-26 02:53:40.965@LM_ERROR@ACE_SSL (1532|7540) error code: 336462231 - error:140E0197:SSL routines:SSL_shutdown:shutdown while in init
[Details] 2022-11-26 02:53:40.965@LM_ERROR@(7540) Handler 0x1db0ce20: Expected 4 messages; got 0
[Details] 2022-11-26 02:53:40.965@LM_ERROR@ACE_SSL (1532|6344) error code: 336462231 - error:140E0197:SSL routines:SSL_shutdown:shutdown while in init
[Details] 2022-11-26 02:53:40.965@LM_ERROR@(6344) Handler 0x1db0ce20: Expected 4 messages; got 0
[Details] 2022-11-26 02:53:40.965@LM_ERROR@ACE_SSL (1532|7540) error code: 336462231 - error:140E0197:SSL routines:SSL_shutdown:shutdown while in init
[Details] 2022-11-26 02:53:40.965@LM_ERROR@(7540) Handler 0x1db0ce20: Expected 4 messages; got 0
[Details] 2022-11-26 02:53:40.965@LM_ERROR@ACE_SSL (1532|6344) error code: 336462231 - error:140E0197:SSL routines:SSL_shutdown:shutdown while in init
[Details] 2022-11-26 02:53:40.965@LM_ERROR@(6344) Handler 0x1db0ce20: Expected 4 messages; got 0
[Details] 2022-11-26 02:53:40.965@LM_ERROR@ACE_SSL (1532|7540) error code: 336462231 - error:140E0197:SSL routines:SSL_shutdown:shutdown while in init
[Details] 2022-11-26 02:53:40.965@LM_ERROR@(7540) Handler 0x1db0ce20: Expected 4 messages; got 0
[Details] 2022-11-26 02:53:40.965@LM_ERROR@ACE_SSL (1532|6344) error code: 336462231 - error:140E0197:SSL routines:SSL_shutdown:shutdown while in init
[Details] 2022-11-26 02:53:40.965@LM_ERROR@(6344) Handler 0x1db0ce20: Expected 4 messages; got 0
[Details] 2022-11-26 02:53:40.965@LM_ERROR@ACE_SSL (1532|7540) error code: 336462231 - error:140E0197:SSL routines:SSL_shutdown:shutdown while in init
[Details] 2022-11-26 02:53:40.965@LM_ERROR@(7540) Handler 0x1db0ce20: Expected 4 messages; got 0
[Details] 2022-11-26 02:53:40.965@LM_ERROR@ACE_SSL (1532|6344) error code: 336462231 - error:140E0197:SSL routines:SSL_shutdown:shutdown while in init
[Details] 2022-11-26 02:53:40.965@LM_ERROR@(6344) Handler 0x1db0ce20: Expected 4 messages; got 0
[Details] 2022-11-26 02:53:40.965@LM_ERROR@ACE_SSL (1532|7540) error code: 336462231 - error:140E0197:SSL routines:SSL_shutdown:shutdown while in init
[Details] 2022-11-26 02:53:40.965@LM_ERROR@(7540) Handler 0x1db0ce20: Expected 4 messages; got 0
[Details] 2022-11-26 02:53:40.965@LM_ERROR@ACE_SSL (1532|6344) error code: 336462231 - error:140E0197:SSL routines:SSL_shutdown:shutdown while in init
[Details] 2022-11-26 02:53:40.965@LM_ERROR@(6344) Handler 0x1db0ce20: Expected 4 messages; got 0
[Details] 2022-11-26 02:53:40.965@LM_ERROR@ACE_SSL (1532|7540) error code: 336462231 - error:140E0197:SSL routines:SSL_shutdown:shutdown while in init
[Details] 2022-11-26 02:53:40.965@LM_ERROR@(7540) Handler 0x1db0ce20: Expected 4 messages; got 0
[Details] 2022-11-26 02:53:40.980@LM_ERROR@ACE_SSL (1532|6344) error code: 336462231 - error:140E0197:SSL routines:SSL_shutdown:shutdown while in init
[Details] 2022-11-26 02:53:40.980@LM_ERROR@(6344) Handler 0x1db0ce20: Expected 4 messages; got 0
[Details] 2022-11-26 02:53:40.980@LM_ERROR@ACE_SSL (1532|7540) error code: 336462231 - error:140E0197:SSL routines:SSL_shutdown:shutdown while in init
[Details] 2022-11-26 02:53:40.980@LM_ERROR@(7540) Handler 0x1db0ce20: Expected 4 messages; got 0
[Details] 2022-11-26 02:53:40.980@LM_ERROR@ACE_SSL (1532|6344) error code: 336462231 - error:140E0197:SSL routines:SSL_shutdown:shutdown while in init
[Details] 2022-11-26 02:53:40.980@LM_ERROR@(6344) Handler 0x1db0ce20: Expected 4 messages; got 0
[Details] 2022-11-26 02:53:40.980@LM_ERROR@ACE_SSL (1532|7540) error code: 336462231 - error:140E0197:SSL routines:SSL_shutdown:shutdown while in init
[Details] 2022-11-26 02:53:40.980@LM_ERROR@(7540) Handler 0x1db0ce20: Expected 4 messages; got 0
[Details] 2022-11-26 02:53:40.980@LM_ERROR@ACE_SSL (1532|6344) error code: 336462231 - error:140E0197:SSL routines:SSL_shutdown:shutdown while in init
[Details] 2022-11-26 02:53:40.980@LM_ERROR@(6344) Handler 0x1db0ce20: Expected 4 messages; got 0
[Details] 2022-11-26 02:53:40.980@LM_ERROR@ACE_SSL (1532|7540) error code: 336462231 - error:140E0197:SSL routines:SSL_shutdown:shutdown while in init
[Details] 2022-11-26 02:53:40.980@LM_ERROR@(7540) Handler 0x1db0ce20: Expected 4 messages; got 0
[Details] 2022-11-26 02:53:40.980@LM_ERROR@ACE_SSL (1532|6344) error code: 336462231 - error:140E0197:SSL routines:SSL_shutdown:shutdown while in init
[Details] 2022-11-26 02:53:40.980@LM_ERROR@(6344) Handler 0x1db0ce20: Expected 4 messages; got 0
[Details] 2022-11-26 02:53:40.980@LM_ERROR@ACE_SSL (1532|7540) error code: 336462231 - error:140E0197:SSL routines:SSL_shutdown:shutdown while in init
[Details] 2022-11-26 02:53:40.980@LM_ERROR@(7540) Handler 0x1db0ce20: Expected 4 messages; got 0
[Details] 2022-11-26 02:53:40.980@LM_ERROR@ACE_SSL (1532|6344) error code: 336462231 - error:140E0197:SSL routines:SSL_shutdown:shutdown while in init
[Details] 2022-11-26 02:53:40.980@LM_ERROR@(6344) Handler 0x1db0ce20: Expected 4 messages; got 0
[Details] 2022-11-26 02:53:40.980@LM_ERROR@ACE_SSL (1532|7540) error code: 337092801 - error:1417A0C1:SSL routines:tls_post_process_client_hello:no shared cipher
[Details] 2022-11-26 02:53:40.980@LM_ERROR@ACE_SSL (1532|6460) error code: 336151568 - error:14094410:SSL routines:ssl3_read_bytes:sslv3 alert handshake failure
[Details] 2022-11-26 02:53:40.980@LM_ERROR@ACE_SSL (1532|7540) error code: 336462231 - error:140E0197:SSL routines:SSL_shutdown:shutdown while in init
[Details] 2022-11-26 02:53:40.980@LM_ERROR@ACE_SSL (1532|6460) error code: 336462231 - error:140E0197:SSL routines:SSL_shutdown:shutdown while in init
[Details] 2022-11-26 02:53:40.980@LM_ERROR@(7540) Handler 0x1db0ce20: Expected 4 messages; got 0
[Details] 2022-11-26 02:53:40.980@LM_ERROR@(6460) connect: unknown error: 336462231 Error while connecting
[Details] 2022-11-26 02:53:40.980@LM_ERROR@(6460) send_n: unknown error: 336462231
[Details] 2022-11-26 02:53:40.980@LM_ERROR@ACE_SSL (1532|6460) error code: 336462231 - error:140E0197:SSL routines:SSL_shutdown:shutdown while in init

TAO/tests/NestedUpcall/MT_Client_Test/run_test.pl

[Details] (1556|7772) EXCEPTION, MT_Client::init

TAO/tests/DII_Deferred_Transient/run_test.pl

[Details] ERROR: client timedout
[Details] ERROR: client returned -1

TAO/orbsvcs/tests/AVStreams/Pluggable/run_test.pl -p TCP,UDP,RTP_UDP

[Details] ERROR: ftp returned 1
[Details] ERROR: ftp returned 1

TAO/orbsvcs/tests/AVStreams/Simple_Two_Stage_With_QoS/run_test.pl -p TCP,UDP,RTP_UDP

[Details] ERROR: ftp returned 4294967295
[Details] ERROR: ftp returned 4294967295

TAO/orbsvcs/tests/Bug_2247_Regression/run_test.pl

[Details] ERROR: Manager 0 returned 3221225477
[Details] ERROR: Manager 1 returned 3221225477
[Details] ERROR: Manager 2 returned 3221225477
[Details] ERROR: server 2 returned 3

TAO/orbsvcs/tests/Bug_2248_Regression/run_test.pl

[Details] abort() has been calledERROR: client timedout
[Details] ERROR: client returned -1

TAO/orbsvcs/tests/ImplRepo/ReconnectServer/run_test.pl

[Details] ERROR: Client returned 1

TAO/orbsvcs/tests/ImplRepo/ReconnectServer/run_test.pl -forwardalways

[Details] ERROR: client timedout
[Details] ERROR: Client returned -1

TAO/orbsvcs/tests/Security/Secure_Invocation/run_test.pl

[Details] (6248|6284) EXCEPTION, Caught exception:
[Details] ERROR: client returned 1
[Details] ERROR: server timedout
[Details] ERROR: server returned -1

TAO/orbsvcs/tests/Security/Bug_1107_Regression/run_test.pl

[Details] (2760|4400) EXCEPTION, Caught unexpected exception (probable failure):
[Details] ERROR: client returned 1
[Details] ERROR: server timedout
[Details] ERROR: server returned -1

TAO/orbsvcs/tests/Security/Big_Request/run_test.pl

[Details] (764|5404) EXCEPTION, ERROR
[Details] ERROR: client returned 4294967295
[Details] ERROR: server timedout
[Details] ERROR: server returned -1

TAO/orbsvcs/tests/Security/Callback/run_test.pl

[Details] (1900|2924) EXCEPTION, Caught exception
[Details] ERROR: client returned 4294967295
[Details] ERROR: server timedout
[Details] ERROR: server returned -1

TAO/orbsvcs/tests/Security/Crash_Test/run_test.pl

[Details] (6260|5460) EXCEPTION, CLIENT (%P): Caught exception:
[Details] (1956|7760) EXCEPTION, CLIENT (%P): Caught exception:
[Details] ERROR: Stopping client #1 returned 1
[Details] (6884|3788) EXCEPTION, CLIENT (%P): Caught exception:
[Details] ERROR: Stopping client #2 returned 1
[Details] ERROR: Stopping client #3 returned 1
[Details] ERROR: server timedout
[Details] ERROR: server returned -1

TAO/orbsvcs/tests/Security/Null_Cipher/run_test.pl

[Details] (6868|7976) EXCEPTION, Caught exception:
[Details] ERROR: client returned 1
[Details] ERROR: server timedout
[Details] ERROR: server returned -1

TAO/orbsvcs/DevGuideExamples/Security/ParticipatingApp/run_test.pl

[Details] (5060|768) EXCEPTION, Client: main block
[Details] ERROR: client returned 1
[Details] ERROR: MessengerServer timedout
[Details] ERROR: server returned -1

TAO/orbsvcs/DevGuideExamples/Security/PolicyControllingApp/run_test.pl

[Details] (2364|3376) EXCEPTION, Client: main block
[Details] ERROR: Messenger Client returned 1

TAO/orbsvcs/DevGuideExamples/Security/SecurityUnawareApp/run_test.pl

[Details] ERROR: Messenger Client1 returned 1
[Details] ERROR: Messenger Client2 returned 1
[Details] ERROR: Messenger Server returned 4294967295

doc_ace6tao2_mosquito_linux_gcc_d0o1i0c1

tests/Bug_2610_Regression_Test

[Details] Error: Bug_2610_Regression_Test FAILED with exit status 1 after Time:0s
[Details] Error: (log/Bug_2610_Regression_Test.log): Svc_Handler leakage detected, 3 objects remain
[Details] Error (log/Bug_2610_Regression_Test.log): no line with 'Ending'
[Details] 2022-11-26 03:23:34.250@LM_ERROR@Svc_Handler leakage detected, 3 objects remain

tests/Bug_2772_Regression_Test

[Details] ERROR: Bug_2772_Regression_Test timedout
[Details] Error: Bug_2772_Regression_Test FAILED (time out after Time:317s)
[Details] Error (log/Bug_2772_Regression_Test.log): no line with 'Ending'

tests/Bug_3911_Regression_Test

[Details] /tao_builds/jenkins/workspace/doc_ace6tao2_mosquito_linux_gcc_d0o1i0c1/ATCD/ACE/tests/Bug_3911_Regression_Test: symbol lookup error: /tao_builds/jenkins/workspace/doc_ace6tao2_mosquito_linux_gcc_d0o1i0c1/ATCD/ACE/tests/Bug_3911_Regression_Test: undefined symbol: _ZNK20ACE_MMAP_Memory_Pool9base_addrEv
[Details] Error: Bug_3911_Regression_Test FAILED with exit status 127 after Time:0s
[Details] Error (log/Bug_3911_Regression_Test.log): no line with 'Ending'

tests/MT_Reference_Counted_Event_Handler_Test

[Details] Unexpected error 9 on netlink descriptor 8ERROR: <MT_Reference_Counted_Event_Handler_Test> exited with coredump from signal 6 : ABRT
[Details] fmt=<optimized out>) at ../sysdeps/posix/libc_fatal.c:175
[Details] #5 0xb72133cc in __GI___libc_fatal (
[Details] at ../sysdeps/posix/libc_fatal.c:185
[Details] Error: MT_Reference_Counted_Event_Handler_Test FAILED with exit status 255 after Time:45s
[Details] Error: MT_Reference_Counted_Event_Handler_Test dumped core
[Details] Error (log/MT_Reference_Counted_Event_Handler_Test.log): no line with 'Ending'

tests/MT_SOCK_Test

[Details] ERROR: MT_SOCK_Test timedout
[Details] Error: MT_SOCK_Test FAILED (time out after Time:317s)
[Details] Error: (log/MT_SOCK_Test.log): (28602|28602) server: Incorrect # client connections. Expected:5-10 Actual:28
[Details] Error (log/MT_SOCK_Test.log): no line with 'Ending'
[Details] 2022-11-26 03:33:21.214@LM_ERROR@(28602|28602) server: Incorrect # client connections. Expected:5-10 Actual:28

tests/Reactor_Fairness_Test

[Details] Error: Reactor_Fairness_Test FAILED with exit status 1 after Time:91s
[Details] Error: (log/Reactor_Fairness_Test.log): Too much unfairness (max 214002, min 0)
[Details] 2022-11-26 03:41:48.874@LM_ERROR@Too much unfairness (max 214002, min 0)

tests/Service_Config_Stream_Test

[Details] ERROR: <Service_Config_Stream_Test> exited with coredump from signal 11 : SEGV
[Details] Program terminated with signal SIGSEGV, Segmentation fault.
[Details] Error: Service_Config_Stream_Test FAILED with exit status 255 after Time:1s
[Details] Error: Service_Config_Stream_Test dumped core

tests/TSS_Leak_Test

[Details] Error: TSS_Leak_Test FAILED with exit status 1 after Time:0s
[Details] Error: (log/TSS_Leak_Test.log): ERROR: 1 X objects (should be 0)
[Details] 2022-11-26 03:45:47.419@LM_ERROR@ERROR: 1 X objects (should be 0)

TAO/tests/Bug_2085_Regression/run_test.pl

[Details] (1546) ERROR, test_string_to_object for <> didn't result in minor code 7
[Details] (1546) ERROR, test_string_to_object for <> didn't result in minor code 8
[Details] (1546) ERROR, test_string_to_object for <> didn't result in minor code 9
[Details] (1546) ERROR, test_string_to_object for <> didn't result in minor code 10
[Details] ERROR: test returned 4
[Details] Error: TAO/tests/Bug_2085_Regression/run_test.pl returned with status 1

TAO/tests/Bug_2543_Regression/run_test.pl

[Details] Error: extract out of any failed
[Details] ERROR: test returned 1
[Details] Error: TAO/tests/Bug_2543_Regression/run_test.pl returned with status 1

TAO/tests/Bug_3566_Regression/run_test.pl

[Details] (1780|1780) EXCEPTION, Exception caught:

TAO/tests/OBV/Collocated/Forward/run_test.pl

[Details] ERROR: tc == tc_result

TAO/tests/HandleExhaustion/run_test.pl

[Details] ERROR: client timedout
[Details] ERROR: client returned -1
[Details] ERROR: server timedout
[Details] ERROR: server returned -1
[Details] ERROR: The error situation was not achieved
[Details] ERROR: The acceptor was not reregistered
[Details] Error: TAO/tests/HandleExhaustion/run_test.pl returned with status 3

doc_ace6tao2_tick_linux_gcc_d0o1

tests/MT_SOCK_Test

[Details] Error: (log/MT_SOCK_Test.log): (17836|17836) server: Incorrect # client connections. Expected:5-10 Actual:12
[Details] 2022-11-26 06:44:35.498@LM_ERROR@(17836|17836) server: Incorrect # client connections. Expected:5-10 Actual:12

tests/Token_Strategy_Test

[Details] Error: Token_Strategy_Test FAILED with exit status 1 after Time:0s
[Details] Error: (log/Token_Strategy_Test.log): (tid = 22401) FIFO: mean less than std_dev.
[Details] 2022-11-26 06:52:27.651@LM_ERROR@ (tid = 22401) FIFO: mean less than std_dev.

TAO/DevGuideExamples/RTCORBA/run_test.pl

[Details] ERROR: cannot find file </tao_builds/jenkins/workspace/doc_ace6tao2_tick_linux_gcc_d0o1/ATCD/TAO/DevGuideExamples/RTCORBA/Messenger.ior>
[Details] Error: TAO/DevGuideExamples/RTCORBA/run_test.pl returned with status 1

TAO/orbsvcs/tests/Bug_2112_Regression/run_test.pl

[Details] Error, caught transient exception
[Details] ERROR: test returned 1
[Details] Error: TAO/orbsvcs/tests/Bug_2112_Regression/run_test.pl returned with status 1

TAO/orbsvcs/tests/ImplRepo/servers_interact_on_startup/run_test.pl

[Details] ERROR: client timedout
[Details] ERROR: client 0 not terminated correctly
[Details] ERROR: client timedout
[Details] ERROR: client 1 not terminated correctly
[Details] Error: TAO/orbsvcs/tests/ImplRepo/servers_interact_on_startup/run_test.pl returned with status 1

TAO/orbsvcs/tests/ImplRepo/servers_interact_on_startup/run_test.pl -delay 20 -imr_start

[Details] ERROR: /tao_builds/jenkins/workspace/doc_ace6tao2_tick_linux_gcc_d0o1/ATCD/ACE/bin/tao_imr timedout
[Details] Error: TAO/orbsvcs/tests/ImplRepo/servers_interact_on_startup/run_test.pl -delay 20 -imr_start returned with status 255

TAO/orbsvcs/tests/ImplRepo/servers_interact_on_startup/run_test.pl -multistart

[Details] ERROR: /tao_builds/jenkins/workspace/doc_ace6tao2_tick_linux_gcc_d0o1/ATCD/ACE/bin/tao_imr timedout
[Details] ERROR: /tao_builds/jenkins/workspace/doc_ace6tao2_tick_linux_gcc_d0o1/ATCD/ACE/bin/tao_imr timedout
[Details] ERROR: /tao_builds/jenkins/workspace/doc_ace6tao2_tick_linux_gcc_d0o1/ATCD/ACE/bin/tao_imr timedout
[Details] ERROR: cannot find file TestObject_1.status
[Details] (5135|5135) EXCEPTION, Exception
[Details] ERROR: server timedout
[Details] ERROR: Server 2 not terminated correctly
[Details] (5143|5143) EXCEPTION, Exception
[Details] (5144|5144) EXCEPTION, Exception
[Details] Error: TAO/orbsvcs/tests/ImplRepo/servers_interact_on_startup/run_test.pl -multistart returned with status 1

TAO/orbsvcs/tests/Security/Secure_Invocation/run_test.pl

[Details] (6220|6220) EXCEPTION, Caught exception:
[Details] ERROR: client returned 1
[Details] ERROR: server timedout
[Details] ERROR: server returned -1
[Details] Error: TAO/orbsvcs/tests/Security/Secure_Invocation/run_test.pl returned with status 1

TAO/orbsvcs/tests/Security/Bug_1107_Regression/run_test.pl

[Details] (6232|6232) EXCEPTION, Caught unexpected exception (probable failure):
[Details] ERROR: client returned 1
[Details] ERROR: server timedout
[Details] ERROR: server returned -1
[Details] Error: TAO/orbsvcs/tests/Security/Bug_1107_Regression/run_test.pl returned with status 1

TAO/orbsvcs/tests/Security/Big_Request/run_test.pl

[Details] (6248|6248) EXCEPTION, ERROR
[Details] ERROR: <client> failed: No such file or directory
[Details] ERROR: client returned 255
[Details] ERROR: server timedout
[Details] ERROR: server returned -1
[Details] Error: TAO/orbsvcs/tests/Security/Big_Request/run_test.pl returned with status 1

TAO/orbsvcs/tests/Security/Callback/run_test.pl

[Details] (6266|6266) EXCEPTION, Caught exception
[Details] ERROR: <client> failed: No such file or directory
[Details] ERROR: client returned 255
[Details] ERROR: server timedout
[Details] ERROR: server returned -1
[Details] Error: TAO/orbsvcs/tests/Security/Callback/run_test.pl returned with status 1

TAO/orbsvcs/tests/Security/Crash_Test/run_test.pl

[Details] (6354|6354) EXCEPTION, CLIENT (%P): Caught exception:
[Details] (6353|6353) EXCEPTION, CLIENT (%P): Caught exception:
[Details] (6352|6352) EXCEPTION, CLIENT (%P): Caught exception:
[Details] ERROR: Stopping client #1 returned 1
[Details] ERROR: Stopping client #2 returned 1
[Details] ERROR: Stopping client #3 returned 1
[Details] ERROR: server timedout
[Details] ERROR: server returned -1
[Details] Error: TAO/orbsvcs/tests/Security/Crash_Test/run_test.pl returned with status 1

TAO/orbsvcs/tests/Security/Null_Cipher/run_test.pl

[Details] (6372|6372) EXCEPTION, Caught exception:
[Details] ERROR: client returned 1
[Details] ERROR: server timedout
[Details] ERROR: server returned -1
[Details] Error: TAO/orbsvcs/tests/Security/Null_Cipher/run_test.pl returned with status 1

TAO/orbsvcs/tests/LoadBalancing/LoadMonitor/CPU/run_test.pl

[Details] ERROR: Unable to retrieve loads from LoadManager.
[Details] ERROR: client returned 1
[Details] Error: TAO/orbsvcs/tests/LoadBalancing/LoadMonitor/CPU/run_test.pl returned with status 1

TAO/orbsvcs/DevGuideExamples/NotifyService/Messenger/run_test.pl

[Details] ERROR: </tao_builds/jenkins/workspace/doc_ace6tao2_tick_linux_gcc_d0o1/ATCD/TAO/orbsvcs/Notify_Service/tao_cosnotification> exited with coredump from signal 11 : SEGV
[Details] ERROR: Notification Service returned 255
[Details] Error: TAO/orbsvcs/DevGuideExamples/NotifyService/Messenger/run_test.pl returned with status 1

TAO/orbsvcs/DevGuideExamples/Security/ParticipatingApp/run_test.pl

[Details] (6864|6864) EXCEPTION, Client: main block
[Details] ERROR: client returned 1
[Details] ERROR: MessengerServer timedout
[Details] ERROR: server returned -1
[Details] Error: TAO/orbsvcs/DevGuideExamples/Security/ParticipatingApp/run_test.pl returned with status 1

TAO/orbsvcs/DevGuideExamples/Security/PolicyControllingApp/run_test.pl

[Details] (6873|6873) EXCEPTION, Client: main block
[Details] ERROR: Messenger Client returned 1
[Details] Error: TAO/orbsvcs/DevGuideExamples/Security/PolicyControllingApp/run_test.pl returned with status 1

TAO/orbsvcs/DevGuideExamples/Security/SecurityUnawareApp/run_test.pl

[Details] ERROR: Messenger Client1 returned 1
[Details] ERROR: Messenger Client2 returned 1
[Details] Error: TAO/orbsvcs/DevGuideExamples/Security/SecurityUnawareApp/run_test.pl returned with status 1

doc_ace6tao2_tick_linux_gcc_d0o1b32

tests/Bug_3943_Regression_Test

[Details] ERROR: <Bug_3943_Regression_Test> exited with coredump from signal 11 : SEGV
[Details] Error: Bug_3943_Regression_Test FAILED with exit status 255 after Time:51s
[Details] Error: (log/Bug_3943_Regression_Test.log): (27664|27666) ACE_OS::sendv: Bad address, 2 iovecs each are too large send returned errno=14
[Details] Error: (log/Bug_3943_Regression_Test.log): (27664|27666) 2 iovecs each are too large: expected > 0, got -1
[Details] Error (log/Bug_3943_Regression_Test.log): no line with 'Ending'
[Details] 2022-11-26 12:56:17.926@LM_ERROR@(27664|27666) ACE_OS::sendv: Bad address, 2 iovecs each are too large send returned errno=14
[Details] 2022-11-26 12:56:17.926@LM_ERROR@(27664|27666) 2 iovecs each are too large: expected > 0, got -1

tests/MT_SOCK_Test

[Details] Error: (log/MT_SOCK_Test.log): (28072|28072) server: Incorrect # client connections. Expected:5-10 Actual:12
[Details] 2022-11-26 13:00:04.905@LM_ERROR@(28072|28072) server: Incorrect # client connections. Expected:5-10 Actual:12

doc_ace6tao2_tick_linux_gcc_d1o0

tests/MT_SOCK_Test

[Details] Error: (log/MT_SOCK_Test.log): (7181|7181) server: Incorrect # client connections. Expected:5-10 Actual:12
[Details] 2022-11-26 16:23:29.513@LM_ERROR@(7181|7181) server: Incorrect # client connections. Expected:5-10 Actual:12

TAO/DevGuideExamples/RTCORBA/run_test.pl

[Details] ERROR: cannot find file </tao_builds/jenkins/workspace/doc_ace6tao2_tick_linux_gcc_d1o0/ATCD/TAO/DevGuideExamples/RTCORBA/Messenger.ior>
[Details] Error: TAO/DevGuideExamples/RTCORBA/run_test.pl returned with status 1

TAO/orbsvcs/tests/Bug_2112_Regression/run_test.pl

[Details] Error, caught transient exception
[Details] ERROR: test returned 1
[Details] Error: TAO/orbsvcs/tests/Bug_2112_Regression/run_test.pl returned with status 1

TAO/orbsvcs/tests/Security/Secure_Invocation/run_test.pl

[Details] (27791|27791) EXCEPTION, Caught exception:
[Details] ERROR: client returned 1
[Details] ERROR: server timedout
[Details] ERROR: server returned -1
[Details] Error: TAO/orbsvcs/tests/Security/Secure_Invocation/run_test.pl returned with status 1

TAO/orbsvcs/tests/Security/Bug_1107_Regression/run_test.pl

[Details] (27804|27804) EXCEPTION, Caught unexpected exception (probable failure):
[Details] ERROR: client returned 1
[Details] ERROR: server timedout
[Details] ERROR: server returned -1
[Details] Error: TAO/orbsvcs/tests/Security/Bug_1107_Regression/run_test.pl returned with status 1

TAO/orbsvcs/tests/Security/Big_Request/run_test.pl

[Details] (27821|27821) EXCEPTION, ERROR
[Details] ERROR: <client> failed: No such file or directory
[Details] ERROR: client returned 255
[Details] ERROR: server timedout
[Details] ERROR: server returned -1
[Details] Error: TAO/orbsvcs/tests/Security/Big_Request/run_test.pl returned with status 1

TAO/orbsvcs/tests/Security/Callback/run_test.pl

[Details] (27836|27836) EXCEPTION, Caught exception
[Details] ERROR: <client> failed: No such file or directory
[Details] ERROR: client returned 255
[Details] ERROR: server timedout
[Details] ERROR: server returned -1
[Details] Error: TAO/orbsvcs/tests/Security/Callback/run_test.pl returned with status 1

TAO/orbsvcs/tests/Security/Crash_Test/run_test.pl

[Details] (27927|27927) EXCEPTION, CLIENT (%P): Caught exception:
[Details] (27925|27925) EXCEPTION, CLIENT (%P): Caught exception:
[Details] (27926|27926) EXCEPTION, CLIENT (%P): Caught exception:
[Details] ERROR: Stopping client #1 returned 1
[Details] ERROR: Stopping client #2 returned 1
[Details] ERROR: Stopping client #3 returned 1
[Details] ERROR: server timedout
[Details] ERROR: server returned -1
[Details] Error: TAO/orbsvcs/tests/Security/Crash_Test/run_test.pl returned with status 1

TAO/orbsvcs/tests/Security/Null_Cipher/run_test.pl

[Details] (27945|27945) EXCEPTION, Caught exception:
[Details] ERROR: client returned 1
[Details] ERROR: server timedout
[Details] ERROR: server returned -1
[Details] Error: TAO/orbsvcs/tests/Security/Null_Cipher/run_test.pl returned with status 1

TAO/orbsvcs/tests/LoadBalancing/LoadMonitor/CPU/run_test.pl

[Details] ERROR: Unable to retrieve loads from LoadManager.
[Details] ERROR: client returned 1
[Details] Error: TAO/orbsvcs/tests/LoadBalancing/LoadMonitor/CPU/run_test.pl returned with status 1

TAO/orbsvcs/DevGuideExamples/Security/ParticipatingApp/run_test.pl

[Details] (28426|28426) EXCEPTION, Client: main block
[Details] ERROR: client returned 1
[Details] ERROR: MessengerServer timedout
[Details] ERROR: server returned -1
[Details] Error: TAO/orbsvcs/DevGuideExamples/Security/ParticipatingApp/run_test.pl returned with status 1

TAO/orbsvcs/DevGuideExamples/Security/PolicyControllingApp/run_test.pl

[Details] (28438|28438) EXCEPTION, Client: main block
[Details] ERROR: Messenger Client returned 1
[Details] Error: TAO/orbsvcs/DevGuideExamples/Security/PolicyControllingApp/run_test.pl returned with status 1

TAO/orbsvcs/DevGuideExamples/Security/SecurityUnawareApp/run_test.pl

[Details] ERROR: Messenger Client1 returned 1
[Details] ERROR: Messenger Client2 returned 1
[Details] Error: TAO/orbsvcs/DevGuideExamples/Security/SecurityUnawareApp/run_test.pl returned with status 1

doc_ace6tao2_wiro_linux_clang_d1o0

tests/Auto_Event_Test

[Details] Error: Auto_Event_Test FAILED with exit status 1 after Time:26s
[Details] Error: (log/Auto_Event_Test.log): Timed wait fails length test
[Details] Error: (log/Auto_Event_Test.log): Expected 3000 ms, actual 11969 ms; 1100 allowed
[Details] 2022-11-26 22:28:44.130@LM_ERROR@Timed wait fails length test
[Details] 2022-11-26 22:28:44.131@LM_ERROR@Expected 3000 ms, actual 11969 ms; 1100 allowed

tests/Bug_2610_Regression_Test

[Details] Error: Bug_2610_Regression_Test FAILED with exit status 1 after Time:1s
[Details] Error: (log/Bug_2610_Regression_Test.log): Svc_Handler leakage detected, 3 objects remain
[Details] Error (log/Bug_2610_Regression_Test.log): no line with 'Ending'
[Details] 2022-11-26 22:29:16.991@LM_ERROR@Svc_Handler leakage detected, 3 objects remain

tests/Bug_2772_Regression_Test

[Details] ERROR: Bug_2772_Regression_Test timedout
[Details] 146 ../sysdeps/nptl/futex-internal.h: No such file or directory.
[Details] Error: Bug_2772_Regression_Test FAILED (time out after Time:318s)
[Details] Error (log/Bug_2772_Regression_Test.log): no line with 'Ending'

tests/Bug_3911_Regression_Test

[Details] ERROR: <Bug_3911_Regression_Test> exited with coredump from signal 11 : SEGV
[Details] Error: Bug_3911_Regression_Test FAILED with exit status 255 after Time:0s
[Details] Error (log/Bug_3911_Regression_Test.log): no line with 'Ending'

tests/MT_Reference_Counted_Event_Handler_Test

[Details] Error: (log/MT_Reference_Counted_Event_Handler_Test.log): epoll_ctl: Bad file descriptor
[Details] Error: (log/MT_Reference_Counted_Event_Handler_Test.log): (2442140) create_connection h 9, register_handler: Bad file descriptor
[Details] 2022-11-26 22:38:36.497@LM_ERROR@epoll_ctl: Bad file descriptor
[Details] 2022-11-26 22:38:36.497@LM_ERROR@(2442140) create_connection h 9, register_handler: Bad file descriptor

tests/Reactor_Fairness_Test

[Details] Error: Reactor_Fairness_Test FAILED with exit status 1 after Time:91s
[Details] Error: (log/Reactor_Fairness_Test.log): Too much unfairness (max 131096, min 0)
[Details] 2022-11-26 22:43:01.057@LM_ERROR@Too much unfairness (max 131096, min 0)

tests/Service_Config_Stream_Test

[Details] ERROR: <Service_Config_Stream_Test> exited with coredump from signal 11 : SEGV
[Details] Error: Service_Config_Stream_Test FAILED with exit status 255 after Time:0s

tests/TSS_Leak_Test

[Details] Error: TSS_Leak_Test FAILED with exit status 1 after Time:0s
[Details] Error: (log/TSS_Leak_Test.log): ERROR: 1 X objects (should be 0)
[Details] 2022-11-26 22:47:32.273@LM_ERROR@ERROR: 1 X objects (should be 0)

tests/non_mpc_makefile/Bug_3708_Regression.pl

[Details] make: clang++: No such file or directory
[Details] make: clang++: No such file or directory

TAO/tests/Bug_1551_Regression/run_test.pl

[Details] ERROR - Timeout waiting for client threads
[Details] ERROR - Timeout waiting for client threads
[Details] ERROR - Timeout waiting for client threads
[Details] ERROR: client returned 1
[Details] Error: TAO/tests/Bug_1551_Regression/run_test.pl returned with status 1

TAO/tests/Bug_2085_Regression/run_test.pl

[Details] (2548966) ERROR, test_string_to_object for <> didn't result in minor code 7
[Details] (2548966) ERROR, test_string_to_object for <> didn't result in minor code 8
[Details] (2548966) ERROR, test_string_to_object for <> didn't result in minor code 9
[Details] (2548966) ERROR, test_string_to_object for <> didn't result in minor code 10
[Details] ERROR: test returned 4
[Details] Error: TAO/tests/Bug_2085_Regression/run_test.pl returned with status 1

TAO/tests/Bug_2319_Regression/run_test.pl

[Details] ERROR: <server> exited with coredump from signal 11 : SEGV
[Details] ERROR: test returned 255
[Details] Error: TAO/tests/Bug_2319_Regression/run_test.pl returned with status 1

TAO/tests/Bug_2543_Regression/run_test.pl

[Details] Error: extract out of any failed
[Details] ERROR: test returned 1
[Details] Error: TAO/tests/Bug_2543_Regression/run_test.pl returned with status 1

TAO/tests/Bug_3566_Regression/run_test.pl

[Details] (2551389|2551389) EXCEPTION, Exception caught:

TAO/tests/Bug_3647_Regression/run_test.pl

[Details] client(2551428|2551428) - running pings.................client(2551428|2551428) EXCEPTION, Exception caught:
[Details] ERROR: client returned 1
[Details] ERROR: middle_server timedout
[Details] 69 ../sysdeps/unix/sysv/linux/select.c: No such file or directory.
[Details] ERROR: middle returned -1
[Details] Error: TAO/tests/Bug_3647_Regression/run_test.pl returned with status 1

TAO/tests/OBV/Collocated/Forward/run_test.pl

[Details] ERROR: tc == tc_result

TAO/tests/HandleExhaustion/run_test.pl

[Details] ERROR: client timedout
[Details] 69 ../sysdeps/unix/sysv/linux/select.c: No such file or directory.
[Details] ERROR: client returned -1
[Details] ERROR: server timedout
[Details] 43 ./nptl/pthread_sigmask.c: No such file or directory.
[Details] ERROR: server returned -1
[Details] ERROR: The error situation was not achieved
[Details] ERROR: The acceptor was not reregistered
[Details] Error: TAO/tests/HandleExhaustion/run_test.pl returned with status 3

TAO/tests/Muxing/run_test.pl

[Details] (2551925|2551925) EXCEPTION, Exception caught:
[Details] ERROR: client returned 1
[Details] (2551937|2551937) EXCEPTION, Exception caught:
[Details] ERROR: client returned 1
[Details] Error: TAO/tests/Muxing/run_test.pl returned with status 1

TAO/tests/POA/Bug_1592_Regression/run_test.pl

[Details] ERROR: PortableInterceptor::ServerRequestInterceptor
[Details] ERROR: ending interception point incorrectly called prior to
[Details] ERROR: PortableServer::ServantLocator::postinvoke().
[Details] ERROR: server returned 1
[Details] Error: TAO/tests/POA/Bug_1592_Regression/run_test.pl returned with status 1

TAO/DevGuideExamples/RTCORBA/run_test.pl

[Details] ERROR: cannot find file </tao_builds/jenkins/workspace/doc_ace6tao2_wiro_linux_clang_d1o0/TAO/DevGuideExamples/RTCORBA/Messenger.ior>
[Details] Error: TAO/DevGuideExamples/RTCORBA/run_test.pl returned with status 1

TAO/orbsvcs/tests/Bug_2112_Regression/run_test.pl

[Details] Error, caught transient exception
[Details] ERROR: test returned 1
[Details] Error: TAO/orbsvcs/tests/Bug_2112_Regression/run_test.pl returned with status 1

TAO/orbsvcs/tests/InterfaceRepo/Persistence_Test/run_test.pl

[Details] (2559220|2559220) EXCEPTION, Ptest::run
[Details] ERROR: client returned 1
[Details] ERROR: </tao_builds/jenkins/workspace/doc_ace6tao2_wiro_linux_clang_d1o0/TAO/orbsvcs/IFR_Service/tao_ifr_service> exited with coredump from signal 11 : SEGV
[Details] ERROR: server returned 255
[Details] Error: TAO/orbsvcs/tests/InterfaceRepo/Persistence_Test/run_test.pl returned with status 1

TAO/orbsvcs/tests/ImplRepo/run_test.pl persistent_ir

[Details] TAO_ImR_Client (2559322|2559322) - ERROR: could not ImRify object with all profiles. Defaulting to ImR-ifying profile_in_use

TAO/orbsvcs/tests/ImplRepo/run_test.pl persistent_ir_hash

[Details] TAO_ImR_Client (2559361|2559361) - ERROR: could not ImRify object with all profiles. Defaulting to ImR-ifying profile_in_use

TAO/orbsvcs/tests/ImplRepo/run_test.pl persistent_ir_shared

[Details] TAO_ImR_Client (2559376|2559376) - ERROR: could not ImRify object with all profiles. Defaulting to ImR-ifying profile_in_use

TAO/orbsvcs/tests/ImplRepo/run_test.pl failover -replica

[Details] (2559410|2559410) EXCEPTION, get_planes
[Details] (2559409|2559409) EXCEPTION, get_planes
[Details] (2559410|2559410) EXCEPTION, get_planes
[Details] (2559409|2559409) EXCEPTION, get_planes
[Details] (2559410|2559410) EXCEPTION, get_planes
[Details] (2559409|2559409) EXCEPTION, get_planes
[Details] (2559410|2559410) EXCEPTION, get_planes
[Details] (2559409|2559409) EXCEPTION, get_planes
[Details] (2559410|2559410) EXCEPTION, get_planes
[Details] (2559409|2559409) EXCEPTION, get_planes
[Details] (2559410|2559410) EXCEPTION, get_planes
[Details] (2559409|2559409) EXCEPTION, get_planes
[Details] (2559410|2559410) EXCEPTION, get_planes
[Details] (2559409|2559409) EXCEPTION, get_planes
[Details] (2559410|2559410) EXCEPTION, get_planes
[Details] (2559409|2559409) EXCEPTION, get_planes
[Details] (2559410|2559410) EXCEPTION, get_planes
[Details] (2559409|2559409) EXCEPTION, get_planes
[Details] (2559410|2559410) EXCEPTION, get_planes
[Details] (2559409|2559409) EXCEPTION, get_planes
[Details] ERROR: Airplane Client 0 returned 1
[Details] ERROR: <airplane_client> still running upon object destruction
[Details] ERROR: </tao_builds/jenkins/workspace/doc_ace6tao2_wiro_linux_clang_d1o0/TAO/orbsvcs/ImplRepo_Service/tao_imr_activator> still running upon object destruction
[Details] ERROR: </tao_builds/jenkins/workspace/doc_ace6tao2_wiro_linux_clang_d1o0/TAO/orbsvcs/ImplRepo_Service/tao_imr_locator> still running upon object destruction
[Details] Error: TAO/orbsvcs/tests/ImplRepo/run_test.pl failover -replica returned with status 9

TAO/orbsvcs/tests/ImplRepo/run_test.pl backup_restart -replica

[Details] (2559440|2559440) EXCEPTION, get_planes
[Details] (2559440|2559440) EXCEPTION, get_planes
[Details] (2559440|2559440) EXCEPTION, get_planes
[Details] (2559439|2559439) EXCEPTION, get_planes
[Details] (2559440|2559440) EXCEPTION, get_planes
[Details] (2559439|2559439) EXCEPTION, get_planes
[Details] (2559440|2559440) EXCEPTION, get_planes
[Details] (2559439|2559439) EXCEPTION, get_planes
[Details] (2559440|2559440) EXCEPTION, get_planes
[Details] (2559439|2559439) EXCEPTION, get_planes
[Details] (2559440|2559440) EXCEPTION, get_planes
[Details] (2559439|2559439) EXCEPTION, get_planes
[Details] (2559440|2559440) EXCEPTION, get_planes
[Details] (2559439|2559439) EXCEPTION, get_planes
[Details] (2559440|2559440) EXCEPTION, get_planes
[Details] (2559439|2559439) EXCEPTION, get_planes
[Details] (2559440|2559440) EXCEPTION, get_planes
[Details] (2559439|2559439) EXCEPTION, get_planes
[Details] (2559439|2559439) EXCEPTION, get_planes
[Details] (2559439|2559439) EXCEPTION, get_planes
[Details] ERROR: Airplane Client 0 returned 1
[Details] ERROR: <airplane_client> still running upon object destruction
[Details] ERROR: </tao_builds/jenkins/workspace/doc_ace6tao2_wiro_linux_clang_d1o0/TAO/orbsvcs/ImplRepo_Service/tao_imr_activator> still running upon object destruction
[Details] ERROR: </tao_builds/jenkins/workspace/doc_ace6tao2_wiro_linux_clang_d1o0/TAO/orbsvcs/ImplRepo_Service/tao_imr_locator> still running upon object destruction
[Details] Error: TAO/orbsvcs/tests/ImplRepo/run_test.pl backup_restart -replica returned with status 9

TAO/orbsvcs/tests/ImplRepo/run_test.pl persistent_ft -replica

[Details] ERROR: cannot find file </tao_builds/jenkins/workspace/doc_ace6tao2_wiro_linux_clang_d1o0/TAO/orbsvcs/tests/ImplRepo/airplane0.ior>
[Details] ERROR: </tao_builds/jenkins/workspace/doc_ace6tao2_wiro_linux_clang_d1o0/TAO/orbsvcs/ImplRepo_Service/tao_imr_locator> still running upon object destruction
[Details] Error: TAO/orbsvcs/tests/ImplRepo/run_test.pl persistent_ft -replica returned with status 9

TAO/orbsvcs/tests/ImplRepo/run_test.pl persistent_listingcorrupt -replica

[Details] ERROR: /tao_builds/jenkins/workspace/doc_ace6tao2_wiro_linux_clang_d1o0/ACE/bin/tao_imr timedout
[Details] 69 ../sysdeps/unix/sysv/linux/select.c: No such file or directory.
[Details] ERROR: tao_imr (0) returned -1
[Details] (2559453|2559453) EXCEPTION, System Exception
[Details] Error: TAO/orbsvcs/tests/ImplRepo/run_test.pl persistent_listingcorrupt -replica returned with status 1

TAO/orbsvcs/tests/ImplRepo/double_start/run_test.pl -kill

[Details] (2559652|2559652) EXCEPTION, client:
[Details] ERROR: <client> failed: No child processes

TAO/orbsvcs/tests/LoadBalancing/LoadMonitor/CPU/run_test.pl

[Details] ERROR: Unable to retrieve loads from LoadManager.
[Details] ERROR: client returned 1
[Details] Error: TAO/orbsvcs/tests/LoadBalancing/LoadMonitor/CPU/run_test.pl returned with status 1

TAO/orbsvcs/tests/LoadBalancing/GenericFactory/DeadMemberDetection_App_Ctrl/run_test.pl

[Details] (2561524|2561524) EXCEPTION, Exception caught in client.cpp:
[Details] ERROR: client returned 1

doc_ace6tao2_wiro_linux_gcc-12_d1o0

tests/Bug_2610_Regression_Test

[Details] Error: Bug_2610_Regression_Test FAILED with exit status 1 after Time:0s
[Details] Error: (log/Bug_2610_Regression_Test.log): Svc_Handler leakage detected, 3 objects remain
[Details] Error (log/Bug_2610_Regression_Test.log): no line with 'Ending'
[Details] 2022-11-26 10:32:49.188@LM_ERROR@Svc_Handler leakage detected, 3 objects remain

tests/Bug_2772_Regression_Test

[Details] ERROR: Bug_2772_Regression_Test timedout
[Details] 146 ../sysdeps/nptl/futex-internal.h: No such file or directory.
[Details] Error: Bug_2772_Regression_Test FAILED (time out after Time:318s)
[Details] Error (log/Bug_2772_Regression_Test.log): no line with 'Ending'

tests/Bug_3911_Regression_Test

[Details] ERROR: <Bug_3911_Regression_Test> exited with coredump from signal 11 : SEGV
[Details] Error: Bug_3911_Regression_Test FAILED with exit status 255 after Time:0s
[Details] Error (log/Bug_3911_Regression_Test.log): no line with 'Ending'

tests/Reactor_Fairness_Test

[Details] Error: Reactor_Fairness_Test FAILED with exit status 1 after Time:91s
[Details] Error: (log/Reactor_Fairness_Test.log): Too much unfairness (max 130634, min 0)
[Details] 2022-11-26 10:46:36.740@LM_ERROR@Too much unfairness (max 130634, min 0)

tests/Service_Config_Stream_Test

[Details] ERROR: <Service_Config_Stream_Test> exited with coredump from signal 11 : SEGV
[Details] Error: Service_Config_Stream_Test FAILED with exit status 255 after Time:0s

tests/TSS_Leak_Test

[Details] Error: TSS_Leak_Test FAILED with exit status 1 after Time:0s
[Details] Error: (log/TSS_Leak_Test.log): ERROR: 1 X objects (should be 0)
[Details] 2022-11-26 10:50:57.815@LM_ERROR@ERROR: 1 X objects (should be 0)

TAO/tests/Bug_1551_Regression/run_test.pl

[Details] ERROR - Timeout waiting for client threads
[Details] ERROR - Timeout waiting for client threads
[Details] pure virtual method called
[Details] pure virtual method called
[Details] ERROR - Timeout waiting for client threads
[Details] pure virtual method called
[Details] ERROR - Timeout waiting for client threads
[Details] pure virtual method called
[Details] ERROR - Timeout waiting for client threads
[Details] pure virtual method called
[Details] ERROR - Timeout waiting for client threads
[Details] pure virtual method called
[Details] ERROR - Timeout waiting for client threads
[Details] pure virtual method called
[Details] ERROR - Timeout waiting for client threads
[Details] ERROR - Timeout waiting for client threads
[Details] pure virtual method called
[Details] pure virtual method called
[Details] ERROR - Timeout waiting for client threads
[Details] ERROR - Timeout waiting for client threads
[Details] pure virtual method called
[Details] pure virtual method called
[Details] ERROR - Timeout waiting for client threads
[Details] pure virtual method called
[Details] ERROR - Timeout waiting for client threads
[Details] ERROR - Timeout waiting for client threads
[Details] pure virtual method called
[Details] pure virtual method called
[Details] ERROR - Timeout waiting for client threads
[Details] pure virtual method called
[Details] ERROR - Timeout waiting for client threads
[Details] pure virtual method called
[Details] ERROR - Timeout waiting for client threads
[Details] pure virtual method called
[Details] ERROR - Timeout waiting for client threads
[Details] ERROR - Timeout waiting for client threads
[Details] ERROR - Timeout waiting for client threads
[Details] pure virtual method called
[Details] ERROR: client returned 1
[Details] Error: TAO/tests/Bug_1551_Regression/run_test.pl returned with status 1

TAO/tests/Bug_2085_Regression/run_test.pl

[Details] (2006057) ERROR, test_string_to_object for <> didn't result in minor code 7
[Details] (2006057) ERROR, test_string_to_object for <> didn't result in minor code 8
[Details] (2006057) ERROR, test_string_to_object for <> didn't result in minor code 9
[Details] (2006057) ERROR, test_string_to_object for <> didn't result in minor code 10
[Details] ERROR: test returned 4
[Details] Error: TAO/tests/Bug_2085_Regression/run_test.pl returned with status 1

TAO/tests/Bug_2319_Regression/run_test.pl

[Details] ERROR: <server> exited with coredump from signal 11 : SEGV
[Details] ERROR: test returned 255
[Details] Error: TAO/tests/Bug_2319_Regression/run_test.pl returned with status 1

TAO/tests/Bug_2543_Regression/run_test.pl

[Details] Error: extract out of any failed
[Details] ERROR: test returned 1
[Details] Error: TAO/tests/Bug_2543_Regression/run_test.pl returned with status 1

TAO/tests/Bug_3566_Regression/run_test.pl

[Details] (2008494|2008494) EXCEPTION, Exception caught:

TAO/tests/RTCORBA/RTMutex/run_test.pl

[Details] ERROR: <server> failed:
[Details] ERROR: test returned 255
[Details] Error: TAO/tests/RTCORBA/RTMutex/run_test.pl returned with status 1

TAO/tests/OBV/Collocated/Forward/run_test.pl

[Details] ERROR: tc == tc_result

TAO/tests/HandleExhaustion/run_test.pl

[Details] ERROR: client timedout
[Details] 69 ../sysdeps/unix/sysv/linux/select.c: No such file or directory.
[Details] ERROR: client returned -1
[Details] ERROR: server timedout
[Details] ERROR: server returned -1
[Details] ERROR: The error situation was not achieved
[Details] ERROR: The acceptor was not reregistered
[Details] Error: TAO/tests/HandleExhaustion/run_test.pl returned with status 3

TAO/tests/POA/Bug_1592_Regression/run_test.pl

[Details] ERROR: PortableInterceptor::ServerRequestInterceptor
[Details] ERROR: ending interception point incorrectly called prior to
[Details] ERROR: PortableServer::ServantLocator::postinvoke().
[Details] ERROR: server returned 1
[Details] Error: TAO/tests/POA/Bug_1592_Regression/run_test.pl returned with status 1

TAO/tests/MT_Timeout/run_test.pl

[Details] (2011884|2011892) EXCEPTION, Exception caught:
[Details] (2011884|2011887) EXCEPTION, Exception caught:
[Details] (2011884|2011886) EXCEPTION, Exception caught:
[Details] (2011884|2011891) EXCEPTION, Exception caught:
[Details] (2011884|2011890) EXCEPTION, Exception caught:
[Details] (2011884|2011889) EXCEPTION, Exception caught:
[Details] (2011884|2011888) EXCEPTION, Exception caught:
[Details] (2011884|2011893) EXCEPTION, Exception caught:
[Details] (2011884|2011893) EXCEPTION, Exception caught:
[Details] (2011884|2011893) EXCEPTION, Exception caught:
[Details] (2011884|2011893) EXCEPTION, Exception caught:
[Details] (2011884|2011893) EXCEPTION, Exception caught:
[Details] (2011884|2011893) EXCEPTION, Exception caught:
[Details] (2011884|2011893) EXCEPTION, Exception caught:
[Details] (2011884|2011893) EXCEPTION, Exception caught:
[Details] (2011884|2011893) EXCEPTION, Exception caught:
[Details] (2011884|2011893) EXCEPTION, Exception caught:
[Details] (2011884|2011893) EXCEPTION, Exception caught:
[Details] (2011884|2011893) EXCEPTION, Exception caught:
[Details] (2011884|2011893) EXCEPTION, Exception caught:
[Details] (2011884|2011893) EXCEPTION, Exception caught:
[Details] (2011884|2011893) EXCEPTION, Exception caught:
[Details] (2011884|2011893) EXCEPTION, Exception caught:
[Details] (2011884|2011893) EXCEPTION, Exception caught:
[Details] (2011884|2011893) EXCEPTION, Exception caught:
[Details] (2011884|2011893) EXCEPTION, Exception caught:
[Details] (2011884|2011893) EXCEPTION, Exception caught:
[Details] (2011884|2011893) EXCEPTION, Exception caught:
[Details] (2011884|2011893) EXCEPTION, Exception caught:
[Details] (2011884|2011893) EXCEPTION, Exception caught:
[Details] (2011884|2011893) EXCEPTION, Exception caught:
[Details] (2011884|2011893) EXCEPTION, Exception caught:
[Details] (2011884|2011893) EXCEPTION, Exception caught:
[Details] (2011884|2011893) EXCEPTION, Exception caught:
[Details] (2011884|2011893) EXCEPTION, Exception caught:
[Details] (2011884|2011893) EXCEPTION, Exception caught:
[Details] (2011884|2011893) EXCEPTION, Exception caught:
[Details] (2011884|2011893) EXCEPTION, Exception caught:
[Details] (2011884|2011893) EXCEPTION, Exception caught:
[Details] (2011884|2011893) EXCEPTION, Exception caught:
[Details] (2011884|2011893) EXCEPTION, Exception caught:
[Details] (2011884|2011893) EXCEPTION, Exception caught:
[Details] (2011884|2011893) EXCEPTION, Exception caught:
[Details] (2011884|2011893) EXCEPTION, Exception caught:
[Details] (2011884|2011893) EXCEPTION, Exception caught:
[Details] (2011884|2011893) EXCEPTION, Exception caught:
[Details] (2011884|2011893) EXCEPTION, Exception caught:
[Details] (2011884|2011893) EXCEPTION, Exception caught:
[Details] (2011884|2011893) EXCEPTION, Exception caught:
[Details] (2011884|2011893) EXCEPTION, Exception caught:
[Details] (2011884|2011893) EXCEPTION, Exception caught:
[Details] (2011884|2011893) EXCEPTION, Exception caught:
[Details] (2011884|2011893) EXCEPTION, Exception caught:
[Details] (2011884|2011893) EXCEPTION, Exception caught:
[Details] (2011884|2011893) EXCEPTION, Exception caught:
[Details] (2011884|2011893) EXCEPTION, Exception caught:
[Details] (2011884|2011893) EXCEPTION, Exception caught:
[Details] (2011884|2011893) EXCEPTION, Exception caught:
[Details] (2011884|2011893) EXCEPTION, Exception caught:
[Details] (2011884|2011893) EXCEPTION, Exception caught:
[Details] (2011884|2011893) EXCEPTION, Exception caught:
[Details] (2011884|2011893) EXCEPTION, Exception caught:
[Details] (2011884|2011893) EXCEPTION, Exception caught:
[Details] (2011884|2011893) EXCEPTION, Exception caught:
[Details] (2011884|2011893) EXCEPTION, Exception caught:
[Details] (2011884|2011893) EXCEPTION, Exception caught:
[Details] (2011884|2011893) EXCEPTION, Exception caught:
[Details] (2011884|2011893) EXCEPTION, Exception caught:
[Details] (2011884|2011893) EXCEPTION, Exception caught:
[Details] (2011884|2011893) EXCEPTION, Exception caught:
[Details] (2011884|2011893) EXCEPTION, Exception caught:
[Details] (2011884|2011893) EXCEPTION, Exception caught:
[Details] (2011884|2011893) EXCEPTION, Exception caught:
[Details] (2011884|2011893) EXCEPTION, Exception caught:
[Details] (2011884|2011893) EXCEPTION, Exception caught:
[Details] (2011884|2011893) EXCEPTION, Exception caught:
[Details] (2011884|2011893) EXCEPTION, Exception caught:
[Details] (2011884|2011893) EXCEPTION, Exception caught:
[Details] (2011884|2011893) EXCEPTION, Exception caught:
[Details] (2011884|2011893) EXCEPTION, Exception caught:
[Details] (2011884|2011893) EXCEPTION, Exception caught:
[Details] (2011884|2011893) EXCEPTION, Exception caught:
[Details] (2011884|2011893) EXCEPTION, Exception caught:
[Details] (2011884|2011893) EXCEPTION, Exception caught:
[Details] (2011884|2011893) EXCEPTION, Exception caught:
[Details] (2011884|2011893) EXCEPTION, Exception caught:
[Details] (2011884|2011893) EXCEPTION, Exception caught:
[Details] (2011884|2011893) EXCEPTION, Exception caught:
[Details] (2011884|2011893) EXCEPTION, Exception caught:
[Details] (2011884|2011893) EXCEPTION, Exception caught:
[Details] (2011884|2011893) EXCEPTION, Exception caught:
[Details] (2011884|2011893) EXCEPTION, Exception caught:
[Details] (2011884|2011893) EXCEPTION, Exception caught:
[Details] (2011884|2011893) EXCEPTION, Exception caught:
[Details] (2011884|2011893) EXCEPTION, Exception caught:
[Details] (2011884|2011893) EXCEPTION, Exception caught:
[Details] (2011884|2011893) EXCEPTION, Exception caught:
[Details] (2011884|2011893) EXCEPTION, Exception caught:
[Details] (2011884|2011893) EXCEPTION, Exception caught:
[Details] (2011884|2011893) EXCEPTION, Exception caught:
[Details] (2011884|2011893) EXCEPTION, Exception caught:
[Details] (2011884|2011893) EXCEPTION, Exception caught:
[Details] (2011884|2011893) EXCEPTION, Exception caught:
[Details] (2011884|2011893) EXCEPTION, Exception caught:
[Details] (2011884|2011893) EXCEPTION, Exception caught:
[Details] (2011884|2011893) EXCEPTION, Exception caught:
[Details] (2011884|2011893) EXCEPTION, Exception caught:
[Details] (2011884|2011893) EXCEPTION, Exception caught:
[Details] (2011884|2011893) EXCEPTION, Exception caught:
[Details] (2011884|2011893) EXCEPTION, Exception caught:
[Details] (2011884|2011893) EXCEPTION, Exception caught:
[Details] (2011884|2011893) EXCEPTION, Exception caught:
[Details] (2011884|2011893) EXCEPTION, Exception caught:
[Details] (2011884|2011893) EXCEPTION, Exception caught:
[Details] (2011884|2011893) EXCEPTION, Exception caught:
[Details] (2011884|2011893) EXCEPTION, Exception caught:
[Details] (2011884|2011893) EXCEPTION, Exception caught:
[Details] (2011884|2011893) EXCEPTION, Exception caught:
[Details] (2011884|2011893) EXCEPTION, Exception caught:
[Details] (2011884|2011893) EXCEPTION, Exception caught:
[Details] (2011884|2011893) EXCEPTION, Exception caught:
[Details] (2011884|2011893) EXCEPTION, Exception caught:
[Details] (2011884|2011893) EXCEPTION, Exception caught:
[Details] (2011884|2011893) EXCEPTION, Exception caught:
[Details] (2011884|2011893) EXCEPTION, Exception caught:
[Details] (2011884|2011893) EXCEPTION, Exception caught:
[Details] (2011884|2011893) EXCEPTION, Exception caught:
[Details] (2011884|2011893) EXCEPTION, Exception caught:
[Details] (2011884|2011893) EXCEPTION, Exception caught:
[Details] (2011884|2011893) EXCEPTION, Exception caught:
[Details] (2011884|2011893) EXCEPTION, Exception caught:
[Details] (2011884|2011893) EXCEPTION, Exception caught:
[Details] (2011884|2011893) EXCEPTION, Exception caught:
[Details] (2011884|2011893) EXCEPTION, Exception caught:
[Details] (2011884|2011893) EXCEPTION, Exception caught:
[Details] (2011884|2011893) EXCEPTION, Exception caught:
[Details] (2011884|2011893) EXCEPTION, Exception caught:
[Details] (2011884|2011893) EXCEPTION, Exception caught:
[Details] (2011884|2011893) EXCEPTION, Exception caught:
[Details] (2011884|2011893) EXCEPTION, Exception caught:
[Details] (2011884|2011893) EXCEPTION, Exception caught:
[Details] (2011884|2011893) EXCEPTION, Exception caught:
[Details] (2011884|2011893) EXCEPTION, Exception caught:
[Details] (2011884|2011893) EXCEPTION, Exception caught:
[Details] (2011884|2011893) EXCEPTION, Exception caught:
[Details] (2011884|2011893) EXCEPTION, Exception caught:
[Details] (2011884|2011893) EXCEPTION, Exception caught:
[Details] (2011884|2011893) EXCEPTION, Exception caught:
[Details] (2011884|2011893) EXCEPTION, Exception caught:
[Details] (2011884|2011893) EXCEPTION, Exception caught:
[Details] (2011884|2011893) EXCEPTION, Exception caught:
[Details] (2011884|2011893) EXCEPTION, Exception caught:
[Details] (2011884|2011893) EXCEPTION, Exception caught:
[Details] (2011884|2011893) EXCEPTION, Exception caught:
[Details] (2011884|2011893) EXCEPTION, Exception caught:
[Details] (2011884|2011893) EXCEPTION, Exception caught:
[Details] (2011884|2011893) EXCEPTION, Exception caught:
[Details] (2011884|2011893) EXCEPTION, Exception caught:
[Details] (2011884|2011893) EXCEPTION, Exception caught:
[Details] (2011884|2011893) EXCEPTION, Exception caught:
[Details] (2011884|2011893) EXCEPTION, Exception caught:
[Details] (2011884|2011893) EXCEPTION, Exception caught:
[Details] (2011884|2011893) EXCEPTION, Exception caught:
[Details] (2011884|2011893) EXCEPTION, Exception caught:
[Details] (2011884|2011893) EXCEPTION, Exception caught:
[Details] (2011884|2011893) EXCEPTION, Exception caught:
[Details] (2011884|2011893) EXCEPTION, Exception caught:
[Details] (2011884|2011893) EXCEPTION, Exception caught:
[Details] (2011884|2011893) EXCEPTION, Exception caught:
[Details] (2011884|2011893) EXCEPTION, Exception caught:
[Details] (2011884|2011893) EXCEPTION, Exception caught:
[Details] (2011884|2011893) EXCEPTION, Exception caught:
[Details] (2011884|2011893) EXCEPTION, Exception caught:
[Details] (2011884|2011893) EXCEPTION, Exception caught:
[Details] (2011884|2011893) EXCEPTION, Exception caught:
[Details] (2011884|2011893) EXCEPTION, Exception caught:
[Details] (2011884|2011893) EXCEPTION, Exception caught:
[Details] (2011884|2011893) EXCEPTION, Exception caught:
[Details] (2011884|2011893) EXCEPTION, Exception caught:
[Details] (2011884|2011893) EXCEPTION, Exception caught:
[Details] (2011884|2011893) EXCEPTION, Exception caught:
[Details] (2011884|2011893) EXCEPTION, Exception caught:
[Details] (2011884|2011893) EXCEPTION, Exception caught:
[Details] (2011884|2011893) EXCEPTION, Exception caught:
[Details] (2011884|2011893) EXCEPTION, Exception caught:
[Details] (2011884|2011893) EXCEPTION, Exception caught:
[Details] (2011884|2011893) EXCEPTION, Exception caught:
[Details] (2011884|2011893) EXCEPTION, Exception caught:
[Details] (2011884|2011893) EXCEPTION, Exception caught:
[Details] (2011884|2011893) EXCEPTION, Exception caught:
[Details] (2011884|2011893) EXCEPTION, Exception caught:
[Details] (2011884|2011893) EXCEPTION, Exception caught:
[Details] (2011884|2011893) EXCEPTION, Exception caught:
[Details] (2011884|2011893) EXCEPTION, Exception caught:
[Details] (2011884|2011893) EXCEPTION, Exception caught:
[Details] (2011884|2011893) EXCEPTION, Exception caught:
[Details] (2011884|2011893) EXCEPTION, Exception caught:
[Details] (2011884|2011893) EXCEPTION, Exception caught:
[Details] (2011884|2011893) EXCEPTION, Exception caught:
[Details] (2011884|2011893) EXCEPTION, Exception caught:
[Details] (2011884|2011893) EXCEPTION, Exception caught:
[Details] (2011884|2011893) EXCEPTION, Exception caught:
[Details] (2011884|2011893) EXCEPTION, Exception caught:
[Details] (2011884|2011893) EXCEPTION, Exception caught:
[Details] (2011884|2011893) EXCEPTION, Exception caught:
[Details] (2011884|2011893) EXCEPTION, Exception caught:
[Details] (2011884|2011893) EXCEPTION, Exception caught:
[Details] (2011884|2011893) EXCEPTION, Exception caught:
[Details] (2011884|2011893) EXCEPTION, Exception caught:
[Details] (2011884|2011893) EXCEPTION, Exception caught:
[Details] (2011884|2011893) EXCEPTION, Exception caught:
[Details] (2011884|2011893) EXCEPTION, Exception caught:
[Details] (2011884|2011893) EXCEPTION, Exception caught:
[Details] (2011884|2011893) EXCEPTION, Exception caught:
[Details] (2011884|2011893) EXCEPTION, Exception caught:
[Details] (2011884|2011893) EXCEPTION, Exception caught:
[Details] (2011884|2011893) EXCEPTION, Exception caught:
[Details] (2011884|2011893) EXCEPTION, Exception caught:
[Details] (2011884|2011893) EXCEPTION, Exception caught:
[Details] (2011884|2011893) EXCEPTION, Exception caught:
[Details] (2011884|2011893) EXCEPTION, Exception caught:
[Details] (2011884|2011893) EXCEPTION, Exception caught:
[Details] (2011884|2011893) EXCEPTION, Exception caught:
[Details] (2011884|2011893) EXCEPTION, Exception caught:
[Details] (2011884|2011893) EXCEPTION, Exception caught:
[Details] (2011884|2011893) EXCEPTION, Exception caught:
[Details] (2011884|2011893) EXCEPTION, Exception caught:
[Details] (2011884|2011893) EXCEPTION, Exception caught:
[Details] (2011884|2011893) EXCEPTION, Exception caught:
[Details] (2011884|2011893) EXCEPTION, Exception caught:
[Details] (2011884|2011893) EXCEPTION, Exception caught:
[Details] (2011884|2011893) EXCEPTION, Exception caught:
[Details] (2011884|2011893) EXCEPTION, Exception caught:
[Details] (2011884|2011893) EXCEPTION, Exception caught:
[Details] (2011884|2011893) EXCEPTION, Exception caught:
[Details] (2011884|2011893) EXCEPTION, Exception caught:
[Details] (2011884|2011893) EXCEPTION, Exception caught:
[Details] (2011884|2011893) EXCEPTION, Exception caught:
[Details] (2011884|2011893) EXCEPTION, Exception caught:
[Details] (2011884|2011893) EXCEPTION, Exception caught:
[Details] (2011884|2011893) EXCEPTION, Exception caught:
[Details] (2011884|2011893) EXCEPTION, Exception caught:
[Details] (2011884|2011893) EXCEPTION, Exception caught:
[Details] (2011884|2011893) EXCEPTION, Exception caught:
[Details] (2011884|2011893) EXCEPTION, Exception caught:
[Details] (2011884|2011893) EXCEPTION, Exception caught:
[Details] (2011884|2011893) EXCEPTION, Exception caught:
[Details] (2011884|2011893) EXCEPTION, Exception caught:
[Details] (2011884|2011893) EXCEPTION, Exception caught:
[Details] (2011884|2011893) EXCEPTION, Exception caught:
[Details] (2011884|2011893) EXCEPTION, Exception caught:
[Details] (2011884|2011893) EXCEPTION, Exception caught:
[Details] (2011884|2011893) EXCEPTION, Exception caught:
[Details] (2011884|2011893) EXCEPTION, Exception caught:
[Details] (2011884|2011893) EXCEPTION, Exception caught:
[Details] (2011884|2011893) EXCEPTION, Exception caught:
[Details] (2011884|2011893) EXCEPTION, Exception caught:
[Details] (2011884|2011893) EXCEPTION, Exception caught:
[Details] (2011884|2011893) EXCEPTION, Exception caught:
[Details] (2011884|2011893) EXCEPTION, Exception caught:
[Details] (2011884|2011893) EXCEPTION, Exception caught:
[Details] (2011884|2011893) EXCEPTION, Exception caught:
[Details] (2011884|2011893) EXCEPTION, Exception caught:
[Details] (2011884|2011893) EXCEPTION, Exception caught:
[Details] (2011884|2011893) EXCEPTION, Exception caught:
[Details] (2011884|2011893) EXCEPTION, Exception caught:
[Details] (2011884|2011893) EXCEPTION, Exception caught:
[Details] (2011884|2011893) EXCEPTION, Exception caught:
[Details] (2011884|2011893) EXCEPTION, Exception caught:
[Details] (2011884|2011893) EXCEPTION, Exception caught:
[Details] (2011884|2011893) EXCEPTION, Exception caught:
[Details] (2011884|2011893) EXCEPTION, Exception caught:
[Details] (2011884|2011893) EXCEPTION, Exception caught:
[Details] (2011884|2011893) EXCEPTION, Exception caught:
[Details] (2011884|2011893) EXCEPTION, Exception caught:
[Details] (2011884|2011893) EXCEPTION, Exception caught:
[Details] (2011884|2011893) EXCEPTION, Exception caught:
[Details] (2011884|2011893) EXCEPTION, Exception caught:
[Details] (2011884|2011893) EXCEPTION, Exception caught:
[Details] (2011884|2011893) EXCEPTION, Exception caught:
[Details] (2011884|2011893) EXCEPTION, Exception caught:
[Details] (2011884|2011893) EXCEPTION, Exception caught:
[Details] (2011884|2011893) EXCEPTION, Exception caught:
[Details] (2011884|2011893) EXCEPTION, Exception caught:
[Details] (2011884|2011893) EXCEPTION, Exception caught:
[Details] (2011884|2011893) EXCEPTION, Exception caught:
[Details] (2011884|2011893) EXCEPTION, Exception caught:
[Details] (2011884|2011893) EXCEPTION, Exception caught:
[Details] (2011884|2011893) EXCEPTION, Exception caught:
[Details] (2011884|2011893) EXCEPTION, Exception caught:
[Details] (2011884|2011893) EXCEPTION, Exception caught:
[Details] (2011884|2011893) EXCEPTION, Exception caught:
[Details] (2011884|2011893) EXCEPTION, Exception caught:
[Details] (2011884|2011893) EXCEPTION, Exception caught:
[Details] (2011884|2011893) EXCEPTION, Exception caught:
[Details] (2011884|2011893) EXCEPTION, Exception caught:
[Details] (2011884|2011893) EXCEPTION, Exception caught:
[Details] (2011884|2011893) EXCEPTION, Exception caught:
[Details] (2011884|2011893) EXCEPTION, Exception caught:
[Details] (2011884|2011893) EXCEPTION, Exception caught:
[Details] (2011884|2011893) EXCEPTION, Exception caught:
[Details] (2011884|2011893) EXCEPTION, Exception caught:
[Details] (2011884|2011893) EXCEPTION, Exception caught:
[Details] (2011884|2011893) EXCEPTION, Exception caught:
[Details] (2011884|2011893) EXCEPTION, Exception caught:
[Details] (2011884|2011893) EXCEPTION, Exception caught:
[Details] (2011884|2011893) EXCEPTION, Exception caught:
[Details] (2011884|2011893) EXCEPTION, Exception caught:
[Details] (2011884|2011893) EXCEPTION, Exception caught:
[Details] (2011884|2011893) EXCEPTION, Exception caught:
[Details] (2011884|2011893) EXCEPTION, Exception caught:
[Details] (2011884|2011893) EXCEPTION, Exception caught:
[Details] (2011884|2011893) EXCEPTION, Exception caught:
[Details] (2011884|2011893) EXCEPTION, Exception caught:
[Details] (2011884|2011893) EXCEPTION, Exception caught:
[Details] (2011884|2011893) EXCEPTION, Exception caught:
[Details] (2011884|2011893) EXCEPTION, Exception caught:
[Details] (2011884|2011893) EXCEPTION, Exception caught:
[Details] (2011884|2011893) EXCEPTION, Exception caught:
[Details] (2011884|2011893) EXCEPTION, Exception caught:
[Details] (2011884|2011893) EXCEPTION, Exception caught:
[Details] (2011884|2011893) EXCEPTION, Exception caught:
[Details] (2011884|2011893) EXCEPTION, Exception caught:
[Details] (2011884|2011893) EXCEPTION, Exception caught:
[Details] (2011884|2011893) EXCEPTION, Exception caught:
[Details] (2011884|2011893) EXCEPTION, Exception caught:
[Details] (2011884|2011893) EXCEPTION, Exception caught:
[Details] (2011884|2011893) EXCEPTION, Exception caught:
[Details] (2011884|2011893) EXCEPTION, Exception caught:
[Details] (2011884|2011893) EXCEPTION, Exception caught:
[Details] (2011884|2011893) EXCEPTION, Exception caught:
[Details] (2011884|2011893) EXCEPTION, Exception caught:
[Details] (2011884|2011893) EXCEPTION, Exception caught:
[Details] (2011884|2011893) EXCEPTION, Exception caught:
[Details] (2011884|2011893) EXCEPTION, Exception caught:
[Details] (2011884|2011893) EXCEPTION, Exception caught:
[Details] (2011884|2011893) EXCEPTION, Exception caught:
[Details] (2011884|2011893) EXCEPTION, Exception caught:
[Details] (2011884|2011893) EXCEPTION, Exception caught:
[Details] (2011884|2011893) EXCEPTION, Exception caught:
[Details] (2011884|2011893) EXCEPTION, Exception caught:
[Details] (2011884|2011893) EXCEPTION, Exception caught:
[Details] (2011884|2011893) EXCEPTION, Exception caught:
[Details] (2011884|2011893) EXCEPTION, Exception caught:
[Details] (2011884|2011893) EXCEPTION, Exception caught:
[Details] (2011884|2011893) EXCEPTION, Exception caught:
[Details] (2011884|2011893) EXCEPTION, Exception caught:
[Details] (2011884|2011893) EXCEPTION, Exception caught:
[Details] (2011884|2011893) EXCEPTION, Exception caught:
[Details] (2011884|2011893) EXCEPTION, Exception caught:
[Details] (2011884|2011893) EXCEPTION, Exception caught:
[Details] (2011884|2011893) EXCEPTION, Exception caught:
[Details] (2011884|2011893) EXCEPTION, Exception caught:
[Details] (2011884|2011893) EXCEPTION, Exception caught:
[Details] (2011884|2011893) EXCEPTION, Exception caught:
[Details] (2011884|2011893) EXCEPTION, Exception caught:
[Details] (2011884|2011893) EXCEPTION, Exception caught:
[Details] (2011884|2011893) EXCEPTION, Exception caught:
[Details] (2011884|2011893) EXCEPTION, Exception caught:
[Details] (2011884|2011893) EXCEPTION, Exception caught:
[Details] (2011884|2011893) EXCEPTION, Exception caught:
[Details] (2011884|2011893) EXCEPTION, Exception caught:
[Details] (2011884|2011893) EXCEPTION, Exception caught:
[Details] (2011884|2011893) EXCEPTION, Exception caught:
[Details] (2011884|2011893) EXCEPTION, Exception caught:
[Details] (2011884|2011893) EXCEPTION, Exception caught:
[Details] (2011884|2011893) EXCEPTION, Exception caught:
[Details] (2011884|2011893) EXCEPTION, Exception caught:
[Details] (2011884|2011893) EXCEPTION, Exception caught:
[Details] (2011884|2011893) EXCEPTION, Exception caught:
[Details] (2011884|2011893) EXCEPTION, Exception caught:
[Details] (2011884|2011893) EXCEPTION, Exception caught:
[Details] (2011884|2011893) EXCEPTION, Exception caught:
[Details] (2011884|2011893) EXCEPTION, Exception caught:
[Details] (2011884|2011893) EXCEPTION, Exception caught:
[Details] (2011884|2011893) EXCEPTION, Exception caught:
[Details] (2011884|2011893) EXCEPTION, Exception caught:
[Details] (2011884|2011893) EXCEPTION, Exception caught:
[Details] (2011884|2011893) EXCEPTION, Exception caught:
[Details] (2011884|2011893) EXCEPTION, Exception caught:
[Details] (2011884|2011893) EXCEPTION, Exception caught:
[Details] (2011884|2011893) EXCEPTION, Exception caught:
[Details] (2011884|2011893) EXCEPTION, Exception caught:
[Details] (2011884|2011893) EXCEPTION, Exception caught:
[Details] (2011884|2011893) EXCEPTION, Exception caught:
[Details] (2011884|2011893) EXCEPTION, Exception caught:
[Details] (2011884|2011893) EXCEPTION, Exception caught:
[Details] (2011884|2011893) EXCEPTION, Exception caught:
[Details] (2011884|2011893) EXCEPTION, Exception caught:
[Details] (2011884|2011893) EXCEPTION, Exception caught:
[Details] (2011884|2011893) EXCEPTION, Exception caught:
[Details] (2011884|2011893) EXCEPTION, Exception caught:
[Details] (2011884|2011893) EXCEPTION, Exception caught:
[Details] (2011884|2011893) EXCEPTION, Exception caught:
[Details] (2011884|2011893) EXCEPTION, Exception caught:
[Details] (2011884|2011893) EXCEPTION, Exception caught:
[Details] (2011884|2011893) EXCEPTION, Exception caught:
[Details] (2011884|2011893) EXCEPTION, Exception caught:
[Details] (2011884|2011893) EXCEPTION, Exception caught:
[Details] (2011884|2011893) EXCEPTION, Exception caught:
[Details] (2011884|2011893) EXCEPTION, Exception caught:
[Details] (2011884|2011893) EXCEPTION, Exception caught:
[Details] (2011884|2011893) EXCEPTION, Exception caught:
[Details] (2011884|2011893) EXCEPTION, Exception caught:
[Details] (2011884|2011893) EXCEPTION, Exception caught:
[Details] (2011884|2011893) EXCEPTION, Exception caught:
[Details] (2011884|2011893) EXCEPTION, Exception caught:
[Details] (2011884|2011893) EXCEPTION, Exception caught:
[Details] (2011884|2011893) EXCEPTION, Exception caught:
[Details] (2011884|2011893) EXCEPTION, Exception caught:
[Details] (2011884|2011893) EXCEPTION, Exception caught:
[Details] (2011884|2011893) EXCEPTION, Exception caught:
[Details] (2011884|2011893) EXCEPTION, Exception caught:
[Details] (2011884|2011893) EXCEPTION, Exception caught:
[Details] (2011884|2011893) EXCEPTION, Exception caught:
[Details] (2011884|2011893) EXCEPTION, Exception caught:
[Details] (2011884|2011893) EXCEPTION, Exception caught:
[Details] (2011884|2011893) EXCEPTION, Exception caught:
[Details] (2011884|2011893) EXCEPTION, Exception caught:
[Details] (2011884|2011893) EXCEPTION, Exception caught:
[Details] (2011884|2011893) EXCEPTION, Exception caught:
[Details] (2011884|2011893) EXCEPTION, Exception caught:
[Details] (2011884|2011893) EXCEPTION, Exception caught:
[Details] (2011884|2011893) EXCEPTION, Exception caught:
[Details] (2011884|2011893) EXCEPTION, Exception caught:
[Details] (2011884|2011893) EXCEPTION, Exception caught:
[Details] (2011884|2011893) EXCEPTION, Exception caught:
[Details] (2011884|2011893) EXCEPTION, Exception caught:
[Details] (2011884|2011893) EXCEPTION, Exception caught:
[Details] (2011884|2011893) EXCEPTION, Exception caught:
[Details] (2011884|2011893) EXCEPTION, Exception caught:
[Details] (2011884|2011893) EXCEPTION, Exception caught:
[Details] (2011884|2011893) EXCEPTION, Exception caught:
[Details] (2011884|2011893) EXCEPTION, Exception caught:
[Details] (2011884|2011893) EXCEPTION, Exception caught:
[Details] (2011884|2011893) EXCEPTION, Exception caught:
[Details] (2011884|2011893) EXCEPTION, Exception caught:
[Details] (2011884|2011893) EXCEPTION, Exception caught:
[Details] (2011884|2011893) EXCEPTION, Exception caught:
[Details] (2011884|2011893) EXCEPTION, Exception caught:
[Details] (2011884|2011893) EXCEPTION, Exception caught:
[Details] (2011884|2011893) EXCEPTION, Exception caught:
[Details] (2011884|2011893) EXCEPTION, Exception caught:
[Details] (2011884|2011893) EXCEPTION, Exception caught:
[Details] (2011884|2011893) EXCEPTION, Exception caught:
[Details] (2011884|2011893) EXCEPTION, Exception caught:
[Details] (2011884|2011893) EXCEPTION, Exception caught:
[Details] (2011884|2011893) EXCEPTION, Exception caught:
[Details] (2011884|2011893) EXCEPTION, Exception caught:
[Details] (2011884|2011893) EXCEPTION, Exception caught:
[Details] (2011884|2011893) EXCEPTION, Exception caught:
[Details] (2011884|2011893) EXCEPTION, Exception caught:
[Details] (2011884|2011893) EXCEPTION, Exception caught:
[Details] (2011884|2011893) EXCEPTION, Exception caught:
[Details] (2011884|2011893) EXCEPTION, Exception caught:
[Details] (2011884|2011893) EXCEPTION, Exception caught:
[Details] (2011884|2011893) EXCEPTION, Exception caught:
[Details] (2011884|2011893) EXCEPTION, Exception caught:
[Details] (2011884|2011893) EXCEPTION, Exception caught:
[Details] (2011884|2011893) EXCEPTION, Exception caught:
[Details] (2011884|2011893) EXCEPTION, Exception caught:
[Details] (2011884|2011893) EXCEPTION, Exception caught:
[Details] (2011884|2011893) EXCEPTION, Exception caught:
[Details] (2011884|2011893) EXCEPTION, Exception caught:
[Details] (2011884|2011893) EXCEPTION, Exception caught:
[Details] (2011884|2011893) EXCEPTION, Exception caught:
[Details] (2011884|2011893) EXCEPTION, Exception caught:
[Details] (2011884|2011893) EXCEPTION, Exception caught:
[Details] (2011884|2011893) EXCEPTION, Exception caught:
[Details] (2011884|2011893) EXCEPTION, Exception caught:
[Details] (2011884|2011893) EXCEPTION, Exception caught:
[Details] (2011884|2011893) EXCEPTION, Exception caught:
[Details] (2011884|2011893) EXCEPTION, Exception caught:
[Details] (2011884|2011893) EXCEPTION, Exception caught:
[Details] (2011884|2011893) EXCEPTION, Exception caught:
[Details] (2011884|2011893) EXCEPTION, Exception caught:
[Details] (2011884|2011893) EXCEPTION, Exception caught:
[Details] (2011884|2011893) EXCEPTION, Exception caught:
[Details] (2011884|2011893) EXCEPTION, Exception caught:
[Details] (2011884|2011893) EXCEPTION, Exception caught:
[Details] (2011884|2011893) EXCEPTION, Exception caught:
[Details] (2011884|2011893) EXCEPTION, Exception caught:
[Details] (2011884|2011893) EXCEPTION, Exception caught:
[Details] (2011884|2011893) EXCEPTION, Exception caught:
[Details] (2011884|2011893) EXCEPTION, Exception caught:
[Details] (2011884|2011893) EXCEPTION, Exception caught:
[Details] (2011884|2011893) EXCEPTION, Exception caught:
[Details] (2011884|2011893) EXCEPTION, Exception caught:
[Details] (2011884|2011893) EXCEPTION, Exception caught:
[Details] (2011884|2011893) EXCEPTION, Exception caught:
[Details] (2011884|2011893) EXCEPTION, Exception caught:
[Details] (2011884|2011893) EXCEPTION, Exception caught:
[Details] (2011884|2011893) EXCEPTION, Exception caught:
[Details] (2011884|2011893) EXCEPTION, Exception caught:
[Details] (2011884|2011893) EXCEPTION, Exception caught:
[Details] (2011884|2011893) EXCEPTION, Exception caught:
[Details] (2011884|2011893) EXCEPTION, Exception caught:
[Details] (2011884|2011893) EXCEPTION, Exception caught:
[Details] (2011884|2011893) EXCEPTION, Exception caught:
[Details] (2011884|2011893) EXCEPTION, Exception caught:
[Details] (2011884|2011893) EXCEPTION, Exception caught:
[Details] (2011884|2011893) EXCEPTION, Exception caught:
[Details] (2011884|2011893) EXCEPTION, Exception caught:
[Details] (2011884|2011893) EXCEPTION, Exception caught:
[Details] (2011884|2011893) EXCEPTION, Exception caught:
[Details] (2011884|2011893) EXCEPTION, Exception caught:
[Details] (2011884|2011893) EXCEPTION, Exception caught:
[Details] (2011884|2011884) EXCEPTION, Exception caught:
[Details] ERROR: client returned 1
[Details] Error: TAO/tests/MT_Timeout/run_test.pl returned with status 1

TAO/DevGuideExamples/RTCORBA/run_test.pl

[Details] ERROR: cannot find file </tao_builds/jenkins/workspace/doc_ace6tao2_wiro_linux_gcc-12_d1o0/TAO/DevGuideExamples/RTCORBA/Messenger.ior>
[Details] Error: TAO/DevGuideExamples/RTCORBA/run_test.pl returned with status 1

TAO/orbsvcs/tests/InterfaceRepo/Persistence_Test/run_test.pl

[Details] (2016080|2016080) EXCEPTION, Ptest::run
[Details] ERROR: client returned 1
[Details] ERROR: </tao_builds/jenkins/workspace/doc_ace6tao2_wiro_linux_gcc-12_d1o0/TAO/orbsvcs/IFR_Service/tao_ifr_service> exited with coredump from signal 11 : SEGV
[Details] ERROR: server returned 255
[Details] Error: TAO/orbsvcs/tests/InterfaceRepo/Persistence_Test/run_test.pl returned with status 1

TAO/orbsvcs/tests/ImplRepo/run_test.pl nestea_ir

[Details] (2016168|2016168) EXCEPTION, Nestea_Client_i::init
[Details] ERROR: Nestea Client 2 returned 1
[Details] ERROR: tao_imr 1 returned 6
[Details] ERROR: tao_imr 1 returned 3
[Details] (2016174|2016174) EXCEPTION, Nestea_Client_i::init
[Details] ERROR: Nestea Client 2 returned 1
[Details] ERROR: tao_imr 1 returned 5
[Details] Error: TAO/orbsvcs/tests/ImplRepo/run_test.pl nestea_ir returned with status 1

TAO/orbsvcs/tests/ImplRepo/run_test.pl persistent_ir

[Details] TAO_ImR_Client (2016190|2016190) - ERROR: could not ImRify object with all profiles. Defaulting to ImR-ifying profile_in_use

TAO/orbsvcs/tests/ImplRepo/run_test.pl persistent_ir_hash

[Details] TAO_ImR_Client (2016221|2016221) - ERROR: could not ImRify object with all profiles. Defaulting to ImR-ifying profile_in_use

TAO/orbsvcs/tests/ImplRepo/run_test.pl persistent_ir_shared

[Details] TAO_ImR_Client (2016235|2016235) - ERROR: could not ImRify object with all profiles. Defaulting to ImR-ifying profile_in_use

TAO/orbsvcs/tests/ImplRepo/run_test.pl failover -replica

[Details] (2016267|2016267) EXCEPTION, get_planes
[Details] (2016268|2016268) EXCEPTION, get_planes
[Details] (2016267|2016267) EXCEPTION, get_planes
[Details] (2016268|2016268) EXCEPTION, get_planes
[Details] (2016267|2016267) EXCEPTION, get_planes
[Details] (2016268|2016268) EXCEPTION, get_planes
[Details] (2016267|2016267) EXCEPTION, get_planes
[Details] (2016268|2016268) EXCEPTION, get_planes
[Details] (2016267|2016267) EXCEPTION, get_planes
[Details] (2016268|2016268) EXCEPTION, get_planes
[Details] (2016267|2016267) EXCEPTION, get_planes
[Details] (2016268|2016268) EXCEPTION, get_planes
[Details] (2016267|2016267) EXCEPTION, get_planes
[Details] (2016268|2016268) EXCEPTION, get_planes
[Details] (2016267|2016267) EXCEPTION, get_planes
[Details] (2016268|2016268) EXCEPTION, get_planes
[Details] (2016267|2016267) EXCEPTION, get_planes
[Details] (2016268|2016268) EXCEPTION, get_planes
[Details] (2016267|2016267) EXCEPTION, get_planes
[Details] (2016268|2016268) EXCEPTION, get_planes
[Details] ERROR: Airplane Client 0 returned 1
[Details] ERROR: <airplane_client> still running upon object destruction
[Details] ERROR: </tao_builds/jenkins/workspace/doc_ace6tao2_wiro_linux_gcc-12_d1o0/TAO/orbsvcs/ImplRepo_Service/tao_imr_activator> still running upon object destruction
[Details] ERROR: </tao_builds/jenkins/workspace/doc_ace6tao2_wiro_linux_gcc-12_d1o0/TAO/orbsvcs/ImplRepo_Service/tao_imr_locator> still running upon object destruction
[Details] Error: TAO/orbsvcs/tests/ImplRepo/run_test.pl failover -replica returned with status 9

TAO/orbsvcs/tests/ImplRepo/run_test.pl backup_restart -replica

[Details] (2016299|2016299) EXCEPTION, get_planes
[Details] (2016300|2016300) EXCEPTION, get_planes
[Details] (2016299|2016299) EXCEPTION, get_planes
[Details] (2016300|2016300) EXCEPTION, get_planes
[Details] (2016299|2016299) EXCEPTION, get_planes
[Details] (2016300|2016300) EXCEPTION, get_planes
[Details] (2016299|2016299) EXCEPTION, get_planes
[Details] (2016300|2016300) EXCEPTION, get_planes
[Details] (2016299|2016299) EXCEPTION, get_planes
[Details] (2016300|2016300) EXCEPTION, get_planes
[Details] (2016299|2016299) EXCEPTION, get_planes
[Details] (2016300|2016300) EXCEPTION, get_planes
[Details] (2016299|2016299) EXCEPTION, get_planes
[Details] (2016300|2016300) EXCEPTION, get_planes
[Details] (2016299|2016299) EXCEPTION, get_planes
[Details] (2016300|2016300) EXCEPTION, get_planes
[Details] (2016299|2016299) EXCEPTION, get_planes
[Details] (2016300|2016300) EXCEPTION, get_planes
[Details] (2016299|2016299) EXCEPTION, get_planes
[Details] (2016300|2016300) EXCEPTION, get_planes
[Details] ERROR: Airplane Client 0 returned 1
[Details] ERROR: <airplane_client> still running upon object destruction
[Details] ERROR: </tao_builds/jenkins/workspace/doc_ace6tao2_wiro_linux_gcc-12_d1o0/TAO/orbsvcs/ImplRepo_Service/tao_imr_activator> still running upon object destruction
[Details] ERROR: </tao_builds/jenkins/workspace/doc_ace6tao2_wiro_linux_gcc-12_d1o0/TAO/orbsvcs/ImplRepo_Service/tao_imr_locator> still running upon object destruction
[Details] Error: TAO/orbsvcs/tests/ImplRepo/run_test.pl backup_restart -replica returned with status 9

TAO/orbsvcs/tests/ImplRepo/run_test.pl persistent_ft -replica

[Details] ERROR: cannot find file </tao_builds/jenkins/workspace/doc_ace6tao2_wiro_linux_gcc-12_d1o0/TAO/orbsvcs/tests/ImplRepo/airplane0.ior>
[Details] ERROR: </tao_builds/jenkins/workspace/doc_ace6tao2_wiro_linux_gcc-12_d1o0/TAO/orbsvcs/ImplRepo_Service/tao_imr_locator> still running upon object destruction
[Details] Error: TAO/orbsvcs/tests/ImplRepo/run_test.pl persistent_ft -replica returned with status 9

TAO/orbsvcs/tests/ImplRepo/run_test.pl persistent_listingcorrupt -replica

[Details] ERROR: cannot find file </tao_builds/jenkins/workspace/doc_ace6tao2_wiro_linux_gcc-12_d1o0/TAO/orbsvcs/tests/ImplRepo/airplane0.ior>
[Details] ERROR: </tao_builds/jenkins/workspace/doc_ace6tao2_wiro_linux_gcc-12_d1o0/TAO/orbsvcs/ImplRepo_Service/tao_imr_locator> still running upon object destruction
[Details] Error: TAO/orbsvcs/tests/ImplRepo/run_test.pl persistent_listingcorrupt -replica returned with status 9

TAO/orbsvcs/tests/ImplRepo/double_start/run_test.pl -kill

[Details] (2016514|2016514) EXCEPTION, client:
[Details] ERROR: <client> failed: No child processes

TAO/orbsvcs/tests/LoadBalancing/LoadMonitor/CPU/run_test.pl

[Details] ERROR: Unable to retrieve loads from LoadManager.
[Details] ERROR: client returned 1
[Details] Error: TAO/orbsvcs/tests/LoadBalancing/LoadMonitor/CPU/run_test.pl returned with status 1