Daily Build Log (Brief)


Compile


/tao_builds/jenkins/workspace/dds_oci_tao-2_2_0_mealworm_linux_gcc_d0o1/OpenDDS/tests/DCPS/Compiler/typecode/GNUmakefile.Compiler_Typecode

[Details] typecodeTypeSupportImpl.cpp: In function 'bool OpenDDS::DCPS::vread(OpenDDS::DCPS::ValueReader&, my_module::my_union&)':
[Details] typecodeTypeSupportImpl.cpp:695: warning: 'd' may be used uninitialized in this function

/tao_builds/jenkins/workspace/dds_oci_tao-2_2_0_mealworm_linux_gcc_d0o1/OpenDDS/tests/DCPS/Compiler/typeobject_generator/GNUmakefile.TypeObjectTest

[Details] TypeObjectTestTypeSupportImpl.cpp: In function 'bool OpenDDS::DCPS::vread(OpenDDS::DCPS::ValueReader&, SomeUnion&)':
[Details] TypeObjectTestTypeSupportImpl.cpp:1106: warning: 'd' may be used uninitialized in this function

/tao_builds/jenkins/workspace/dds_oci_tao-2_2_0_mealworm_linux_gcc_d0o1/OpenDDS/tests/DCPS/Compiler/xcdr/GNUmakefile.xcdr

[Details] xcdrbasetypesTypeSupportImpl.cpp: In function 'bool OpenDDS::DCPS::vread(OpenDDS::DCPS::ValueReader&, FinalUnion&)':
[Details] xcdrbasetypesTypeSupportImpl.cpp:2961: warning: 'd' may be used uninitialized in this function
[Details] xcdrbasetypesTypeSupportImpl.cpp: In function 'bool OpenDDS::DCPS::vread(OpenDDS::DCPS::ValueReader&, MutableUnion&)':
[Details] xcdrbasetypesTypeSupportImpl.cpp:2313: warning: 'd' may be used uninitialized in this function

/tao_builds/jenkins/workspace/dds_oci_tao-2_2_0_mealworm_linux_gcc_d0o1/OpenDDS/tests/DCPS/MetaStruct/GNUmakefile.MetaStructTest

[Details] MetaStructTestTypeSupportImpl.cpp: In function 'bool OpenDDS::DCPS::vread(OpenDDS::DCPS::ValueReader&, MutableUnion&)':
[Details] MetaStructTestTypeSupportImpl.cpp:1708: warning: 'd' may be used uninitialized in this function
[Details] MetaStructTestTypeSupportImpl.cpp: In function 'bool OpenDDS::DCPS::vread(OpenDDS::DCPS::ValueReader&, MyUnion&)':
[Details] MetaStructTestTypeSupportImpl.cpp:1152: warning: 'd' may be used uninitialized in this function

/tao_builds/jenkins/workspace/dds_oci_tao-2_2_0_mealworm_linux_gcc_d0o1/OpenDDS/tests/DCPS/DynamicTypes/Pub/GNUmakefile.XTypes_Dynamic_Pub

[Details] dynamicTypeSupportImpl.cpp: In function 'bool OpenDDS::DCPS::vread(OpenDDS::DCPS::ValueReader&, Dynamic::outer_union_mutable&)':
[Details] dynamicTypeSupportImpl.cpp:11420: warning: 'd' may be used uninitialized in this function
[Details] dynamicTypeSupportImpl.cpp: In function 'bool OpenDDS::DCPS::vread(OpenDDS::DCPS::ValueReader&, Dynamic::outer_union_appendable&)':
[Details] dynamicTypeSupportImpl.cpp:6312: warning: 'd' may be used uninitialized in this function
[Details] dynamicTypeSupportImpl.cpp: In function 'bool OpenDDS::DCPS::vread(OpenDDS::DCPS::ValueReader&, Dynamic::outer_union_final&)':
[Details] dynamicTypeSupportImpl.cpp:2120: warning: 'd' may be used uninitialized in this function

/tao_builds/jenkins/workspace/dds_oci_tao-2_2_0_mealworm_linux_gcc_d0o1/OpenDDS/tests/DCPS/TimeBasedFilter/GNUmakefile.TimeBasedFilter

[Details] /tao_builds/jenkins/workspace/dds_oci_tao-2_2_0_mealworm_linux_gcc_d0o1/../notests_oci_tao-2_2_0_mealworm_linux_gcc_d0o1/TAO/tao/Objref_VarOut_T.inl: In constructor 'Publisher::Publisher(long int, size_t, bool, int)':
[Details] /tao_builds/jenkins/workspace/dds_oci_tao-2_2_0_mealworm_linux_gcc_d0o1/../notests_oci_tao-2_2_0_mealworm_linux_gcc_d0o1/TAO/tao/Objref_VarOut_T.inl:18: warning: 'topic.TAO_Objref_Var_T<DDS::Topic>::ptr_' may be used uninitialized in this function
[Details] Publisher.cpp:48: note: 'topic.TAO_Objref_Var_T<DDS::Topic>::ptr_' was declared here

/tao_builds/jenkins/workspace/dds_oci_tao-2_2_0_mealworm_linux_gcc_d0o1/OpenDDS/tests/DCPS/TopicReuse/GNUmakefile.DDS_TopicReuse_TopicReuse

[Details] /tao_builds/jenkins/workspace/dds_oci_tao-2_2_0_mealworm_linux_gcc_d0o1/../notests_oci_tao-2_2_0_mealworm_linux_gcc_d0o1/TAO/tao/Objref_VarOut_T.inl: In constructor 'Subscriber::Subscriber(DDS::DomainId_t, size_t, size_t, bool)':
[Details] /tao_builds/jenkins/workspace/dds_oci_tao-2_2_0_mealworm_linux_gcc_d0o1/../notests_oci_tao-2_2_0_mealworm_linux_gcc_d0o1/TAO/tao/Objref_VarOut_T.inl:18: warning: 'topic.TAO_Objref_Var_T<DDS::Topic>::ptr_' may be used uninitialized in this function
[Details] Subscriber.cpp:38: note: 'topic.TAO_Objref_Var_T<DDS::Topic>::ptr_' was declared here

/tao_builds/jenkins/workspace/dds_oci_tao-2_2_0_mealworm_linux_gcc_d0o1/OpenDDS/tests/DCPS/UnregisterType/GNUmakefile.UnregisterTypeTest

[Details] UnionTopicTypeSupportImpl.cpp: In function 'bool OpenDDS::DCPS::vread(OpenDDS::DCPS::ValueReader&, UnionTopic::ElectionNews_t&)':
[Details] UnionTopicTypeSupportImpl.cpp:1053: warning: 'd' may be used uninitialized in this function

/tao_builds/jenkins/workspace/dds_oci_tao-2_2_0_mealworm_linux_gcc_d0o1/OpenDDS/tests/DCPS/WaitForAck/GNUmakefile.WaitForAck_Publisher

[Details] /tao_builds/jenkins/workspace/dds_oci_tao-2_2_0_mealworm_linux_gcc_d0o1/../notests_oci_tao-2_2_0_mealworm_linux_gcc_d0o1/TAO/tao/Objref_VarOut_T.inl: In constructor 'Test::Publisher::Publisher(const Test::Options&)':
[Details] /tao_builds/jenkins/workspace/dds_oci_tao-2_2_0_mealworm_linux_gcc_d0o1/../notests_oci_tao-2_2_0_mealworm_linux_gcc_d0o1/TAO/tao/Objref_VarOut_T.inl:18: warning: 'topic.TAO_Objref_Var_T<DDS::Topic>::ptr_' may be used uninitialized in this function
[Details] Publisher.cpp:102: note: 'topic.TAO_Objref_Var_T<DDS::Topic>::ptr_' was declared here

/tao_builds/jenkins/workspace/dds_oci_tao-2_2_0_mealworm_linux_gcc_d0o1/OpenDDS/DevGuideExamples/DCPS/Messenger.minimal/GNUmakefile.MessengerMinimal_Publisher

[Details] CompleteToDynamicTypeTypeSupportImpl.cpp: In function 'bool OpenDDS::DCPS::vread(OpenDDS::DCPS::ValueReader&, MyModCompleteToDynamic::MyUnion&)':
[Details] CompleteToDynamicTypeTypeSupportImpl.cpp:1918: warning: 'd' may be used uninitialized in this function

/tao_builds/jenkins/workspace/dds_oci_tao-2_2_0_mealworm_linux_gcc_d0o1/OpenDDS/dds/InfoRepo/GNUmakefile.DCPSInfoRepo_Federator

[Details] CompleteToMinimalTypeObjectTypeSupportImpl.cpp: In function 'bool OpenDDS::DCPS::vread(OpenDDS::DCPS::ValueReader&, MyModCompleteToMinimal::MyUnion&)':
[Details] CompleteToMinimalTypeObjectTypeSupportImpl.cpp:2930: warning: 'd' may be used uninitialized in this function

/tao_builds/jenkins/workspace/dds_oci_tao-2_2_0_mealworm_linux_gcc_d0o1/OpenDDS/performance-tests/DCPS/InfoRepo_population/GNUmakefile.InfoRepo_Population_Publisher

[Details] ../../tests/googletest/build/install/include/gmock/gmock-spec-builders.h: In member function 'testing::internal::UntypedActionResultHolderBase* testing::internal::FunctionMockerBase<F>::UntypedPerformDefaultAction(void*, const std::string&) const [with F = int()]':
[Details] ../../tests/googletest/build/install/include/gmock/gmock-spec-builders.h:1517: warning: '<anonymous>' may be used uninitialized in this function
[Details] ../../tests/googletest/build/install/include/gmock/gmock-spec-builders.h:1517: note: '<anonymous>' was declared here
[Details] ../../tests/googletest/build/install/include/gmock/gmock-spec-builders.h: In member function 'testing::internal::UntypedActionResultHolderBase* testing::internal::FunctionMockerBase<F>::UntypedPerformDefaultAction(void*, const std::string&) const [with F = OpenDDS::DCPS::MonotonicTimePoint()]':
[Details] ../../tests/googletest/build/install/include/gmock/gmock-spec-builders.h:1517: warning: '<anonymous>' may be used uninitialized in this function
[Details] ../../tests/googletest/build/install/include/gmock/gmock-spec-builders.h:1517: note: '<anonymous>' was declared here
[Details] ../../tests/googletest/build/install/include/gmock/gmock-spec-builders.h: In member function 'testing::internal::UntypedActionResultHolderBase* testing::internal::FunctionMockerBase<F>::UntypedPerformAction(const void*, void*) const [with F = OpenDDS::DCPS::MonotonicTimePoint()]':
[Details] ../../tests/googletest/build/install/include/gmock/gmock-spec-builders.h:1416: warning: '<anonymous>' may be used uninitialized in this function
[Details] ../../tests/googletest/build/install/include/gmock/gmock-spec-builders.h:1416: note: '<anonymous>' was declared here
[Details] ../../tests/googletest/build/install/include/gmock/gmock-spec-builders.h: In member function 'testing::internal::UntypedActionResultHolderBase* testing::internal::FunctionMockerBase<F>::UntypedPerformAction(const void*, void*) const [with F = int()]':
[Details] ../../tests/googletest/build/install/include/gmock/gmock-spec-builders.h:1416: warning: '<anonymous>' may be used uninitialized in this function
[Details] ../../tests/googletest/build/install/include/gmock/gmock-spec-builders.h:1416: note: '<anonymous>' was declared here

/tao_builds/jenkins/workspace/dds_oci_tao-2_2_0_mealworm_linux_gcc_d0o1/OpenDDS/tests/DCPS/MultiRepoTest/GNUmakefile.MultiRepoTest_System

[Details] /tao_builds/jenkins/workspace/dds_oci_tao-2_2_0_mealworm_linux_gcc_d0o1/../notests_oci_tao-2_2_0_mealworm_linux_gcc_d0o1/TAO/tao/Objref_VarOut_T.inl: In constructor 'TestSystem::TestSystem(int, ACE_TCHAR**, char**)':
[Details] /tao_builds/jenkins/workspace/dds_oci_tao-2_2_0_mealworm_linux_gcc_d0o1/../notests_oci_tao-2_2_0_mealworm_linux_gcc_d0o1/TAO/tao/Objref_VarOut_T.inl:18: warning: 'listener.TAO_Objref_Var_T<DDS::DataWriterListener>::ptr_' may be used uninitialized in this function
[Details] TestSystem.cpp:265: note: 'listener.TAO_Objref_Var_T<DDS::DataWriterListener>::ptr_' was declared here

/tao_builds/jenkins/workspace/dds_oci_tao-2_2_0_mealworm_linux_gcc_d0o1/OpenDDS/tests/DCPS/WaitForAck/GNUmakefile.WaitForAck_Subscriber

[Details] /tao_builds/jenkins/workspace/dds_oci_tao-2_2_0_mealworm_linux_gcc_d0o1/../notests_oci_tao-2_2_0_mealworm_linux_gcc_d0o1/TAO/tao/Objref_VarOut_T.inl: In constructor 'Test::Subscriber::Subscriber(const Test::Options&)':
[Details] /tao_builds/jenkins/workspace/dds_oci_tao-2_2_0_mealworm_linux_gcc_d0o1/../notests_oci_tao-2_2_0_mealworm_linux_gcc_d0o1/TAO/tao/Objref_VarOut_T.inl:18: warning: 'topic.TAO_Objref_Var_T<DDS::Topic>::ptr_' may be used uninitialized in this function
[Details] Subscriber.cpp:87: note: 'topic.TAO_Objref_Var_T<DDS::Topic>::ptr_' was declared here

Test


tests/DCPS/ConfigTransports/run_test.pl

[Details] (13750|13765) ERROR: No negotiated protocols?!.
[Details] (13750|13765) TEST_ASSERT(assert_negotiated(configopt_, reader)) FAILED at DataReaderListener.cpp:94
[Details] terminate called after throwing an instance of 'char const*'
[Details] ERROR: <subscriber> exited with coredump from signal 6 : ABRT
[Details] 2022-11-21 19:48:31: ERROR: subscriber terminated with a signal
[Details] test FAILED.
[Details] Test FAILED (hasbuiltins=true){
[Details] FAILED: 1 of 29
[Details] auto_run_tests.pl: ERROR: "tests/DCPS/ConfigTransports/run_test.pl" returned with status 1