Daily Build Log (Brief)


Test


tests/DCPS/DpShutdown/run_test.pl tcp

[Details] 2021-11-27 23:56:03.012@LM_ERROR@(17757|4470996416) RtpsUdpSendStrategy::send_single_i() - destination 239.255.0.1:10152 failed send: Network is down
[Details] test FAILED.
[Details] ERROR: client returned -1
[Details] auto_run_tests.pl: Error: "tests/DCPS/DpShutdown/run_test.pl tcp" returned with status 1

tests/DCPS/ReaderDataLifecycle/run_test.pl rtps

[Details] 2021-11-28 00:06:03.001@LM_ERROR@(17987|4671790528) RtpsUdpSendStrategy::send_single_i() - destination 239.255.0.2:7401 failed send: Network is down

tests/DCPS/TimeBasedFilter/run_test.pl -reliable

[Details] main.cpp:366 verify_reliable() ERROR: The time between the 4th and 5th sample should be about 5 seconds, but it was 8 seconds!
[Details] main.cpp:380 verify_reliable() ERROR: The time between the 5th and 6th sample should be about 5 seconds, but it was 1 seconds!
[Details] main.cpp:352 verify_reliable() ERROR: The time between the 3rd and 4th sample should be about 10 seconds, but it was 15 seconds!
[Details] ERROR: <test> failed: No such file or directory
[Details] 2021-11-28 00:11:18: ERROR: test returned 255 (started at 2021-11-28 00:10:30)
[Details] test FAILED.
[Details] auto_run_tests.pl: Error: "tests/DCPS/TimeBasedFilter/run_test.pl -reliable" returned with status 1

tests/DCPS/LivelinessKeepAliveTest/run_test.pl

[Details] (18347|4638039488) ERROR: subscriber - test failed expected liveliness change count check.
[Details] 2021-11-28 00:21:21: ERROR: sub returned 1 (started at 2021-11-28 00:21:16)
[Details] test FAILED.
[Details] auto_run_tests.pl: Error: "tests/DCPS/LivelinessKeepAliveTest/run_test.pl" returned with status 1

tests/DCPS/Deadline/run_test.pl rtps_disc

[Details] 2021-11-28 00:33:08: ERROR: subscriber returned 1 (started at 2021-11-28 00:32:52)
[Details] ERROR: <publisher> exited with signal 11 : SEGV
[Details] 2021-11-28 00:33:08: ERROR: publisher returned 255 (started at 2021-11-28 00:33:08)
[Details] 2021-11-28 00:33:08.169@LM_ERROR@(18501|4434070976) ERROR: missed requested deadline (4 or 4) != (2)
[Details] 2021-11-28 00:33:05.149@LM_ERROR@(18500|4736228800) ERROR: offered_deadline_missed (6) != (4)
[Details] test FAILED.
[Details] ERROR: test returned 1
[Details] auto_run_tests.pl: Error: "tests/DCPS/Deadline/run_test.pl rtps_disc" returned with status 1

tests/DCPS/ManualAssertLiveliness/run_test.pl rtps

[Details] ERROR: publisher timedout
[Details] 2021-11-28 00:45:52: ERROR: pub returned -1 (started at 2021-11-28 00:44:42)
[Details] (18752|123145415892992) ERROR: DCPS_IR_Domain::remove_dead_participants () Removing dead participant 0xf450dcd0 id 01030000.57948407.00000004.000001c1(f9f420fd)
[Details] (18752|123145415892992) ERROR: WriteDataContainer::dispose, The instance(handle=4) is not registered yet.
[Details] (18752|123145415892992) ERROR: DataWriterImpl::dispose: dispose failed.
[Details] (18752|123145415892992) ERROR: DCPS_IR_Domain::dispose_participant_bit Unable to dispose for participant 01030000.57948407.00000004.000001c1(f9f420fd) handle 4.
[Details] (18752|123145415892992) ERROR: DCPS_IR_Domain::remove_dead_participants () Removing dead participant 0xf7015690 id 01030000.57948407.00000002.000001c1(76b4d55d)
[Details] (18752|123145415892992) ERROR: WriteDataContainer::dispose, The instance(handle=2) is not registered yet.
[Details] (18752|123145415892992) ERROR: DataWriterImpl::dispose: dispose failed.
[Details] (18752|123145415892992) ERROR: DCPS_IR_Domain::dispose_participant_bit Unable to dispose for participant 01030000.57948407.00000002.000001c1(76b4d55d) handle 2.
[Details] (18752|123145415892992) ERROR: DCPS_IR_Domain::remove_dead_participants () Removing dead participant 0xf70171d0 id 01030000.57948407.00000003.000001c1(4bd4fced)
[Details] (18752|123145415892992) ERROR: WriteDataContainer::dispose, The instance(handle=3) is not registered yet.
[Details] (18752|123145415892992) ERROR: DataWriterImpl::dispose: dispose failed.
[Details] (18752|123145415892992) ERROR: DCPS_IR_Domain::dispose_participant_bit Unable to dispose for participant 01030000.57948407.00000003.000001c1(4bd4fced) handle 3.
[Details] test FAILED.
[Details] auto_run_tests.pl: Error: "tests/DCPS/ManualAssertLiveliness/run_test.pl rtps" returned with status 1

tests/DCPS/StaticDiscoveryReconnect/run_test.pl

[Details] ERROR: <StaticDiscoveryTest> failed: No such file or directory
[Details] 2021-11-28 01:05:29: ERROR: reader2 returned 255 (started at 2021-11-28 01:05:29)
[Details] test FAILED.
[Details] ERROR: test returned 1
[Details] auto_run_tests.pl: Error: "tests/DCPS/StaticDiscoveryReconnect/run_test.pl" returned with status 1

tests/transport/spdp/run_test.pl

[Details] ERROR: in TestParticipant::send() send: Network is down
[Details] ERROR: test failed
[Details] ERROR: spdp_transport timedout
[Details] 2021-11-28 01:07:08: ERROR: spdp_transport returned -1 (started at 2021-11-28 01:05:53)
[Details] test FAILED.
[Details] ERROR: test returned 1
[Details] auto_run_tests.pl: Error: "tests/transport/spdp/run_test.pl" returned with status 1

performance-tests/bench/run_test.pl fan show-logs

[Details] ERROR: Only received 10 out of 11 valid reports!
[Details] 2021-11-28 01:25:32: ERROR: test_controller returned 1 (started at 2021-11-28 01:23:17)
[Details] test FAILED.
[Details] auto_run_tests.pl: Error: "performance-tests/bench/run_test.pl fan show-logs" returned with status 1

performance-tests/bench/run_test.pl fan_frag show-logs

[Details] ERROR: Only received 10 out of 11 valid reports!
[Details] 2021-11-28 01:27:47: ERROR: test_controller returned 1 (started at 2021-11-28 01:25:32)
[Details] test FAILED.
[Details] auto_run_tests.pl: Error: "performance-tests/bench/run_test.pl fan_frag show-logs" returned with status 1

performance-tests/bench/run_test.pl sm10

[Details] ERROR: Only received 0 out of 21 valid reports!
[Details] 2021-11-28 01:35:26: ERROR: test_controller returned 1 (started at 2021-11-28 01:31:08)
[Details] test FAILED.
[Details] auto_run_tests.pl: Error: "performance-tests/bench/run_test.pl sm10" returned with status 1

java/tests/messenger/subscriber/run_test.pl udp

[Details] ERROR: Missing 1 messages

java/tests/messenger/subscriber/run_test.pl rtps

[Details] ERROR: /Volumes/builds/tao_builds/jenkins/workspace/dds_oci_tao-2_2_0_maggot_macosx_clang_d1o0/OpenDDS/tests/DCPS/Messenger/publisher timedout
[Details] ERROR: publisher returned -1
[Details] ERROR: /Library/Java/JavaVirtualMachines/jdk1.8.0_152.jdk/Contents/Home/bin/java timedout
[Details] ERROR: subscriber returned -1
[Details] test FAILED.
[Details] auto_run_tests.pl: Error: "java/tests/messenger/subscriber/run_test.pl rtps" returned with status 1