Failed Test Brief Log By Build


OCI_Ubuntu_22_04_Clang23

tests/DCPS/Compiler/vread_vwrite/run_test.pl

[Details] [ FAILED ] VreadVwriteTest.DynamicSerializeTest (2 ms)
[Details] [ FAILED ] VreadVwriteTest.DynamicWithOptionalTest (0 ms)
[Details] [ FAILED ] 2 tests, listed below:
[Details] [ FAILED ] VreadVwriteTest.DynamicSerializeTest
[Details] [ FAILED ] VreadVwriteTest.DynamicWithOptionalTest
[Details] 2 FAILED TESTS
[Details] ERROR: VreadVwriteTest returned 1
[Details] test FAILED
[Details] auto_run_tests.pl: ERROR: "tests/DCPS/Compiler/vread_vwrite/run_test.pl" returned with status 1

tests/unit-tests/run_test.pl

[Details] [ FAILED ] dds_DCPS_XTypes_DynamicDataImpl.Mutable_WriteRecursiveStruct (0 ms)
[Details] [ FAILED ] dds_DCPS_XTypes_DynamicDataImpl.Mutable_WriteKeyOnly (1 ms)
[Details] [ FAILED ] dds_DCPS_XTypes_DynamicDataImpl.Nested_WriteKeyOnly (0 ms)
[Details] [ FAILED ] dds_DCPS_XTypes_DynamicDataImpl.String_As_Enum (1 ms)
[Details] (1623300|1623300) ERROR: dynamic_data_json: unknown member id in XmlTypeProviderTest::Sample at $
[Details] (1623300|1623300) ERROR: dynamic_data_json: failed to populate DynamicData for XmlTypeProviderTest::Sample
[Details] ERROR: <UnitTests> exited with coredump from signal 11 : SEGV
[Details] 2026-10-28 03:56:16: ERROR: UnitTests terminated with a signal
[Details] test FAILED (success).
[Details] auto_run_tests.pl: ERROR: "tests/unit-tests/run_test.pl" returned with status 1

tests/DCPS/FilterExpression/run_test.pl

[Details] ERROR: <FilterExpressionTest> exited with coredump from signal 11 : SEGV
[Details] ERROR: test returned 255
[Details] auto_run_tests.pl: ERROR: "tests/DCPS/FilterExpression/run_test.pl" returned with status 1

tests/DCPS/QueryCondition/run_test.pl rtps_disc dynamic

[Details] ERROR: <QueryConditionTest> exited with coredump from signal 11 : SEGV
[Details] ERROR: test returned 255
[Details] auto_run_tests.pl: ERROR: "tests/DCPS/QueryCondition/run_test.pl rtps_disc dynamic" returned with status 1

tests/DCPS/ContentFilteredTopic/run_test.pl rtps_disc dynamic

[Details] ERROR: ContentFilteredTopicTest timedout
[Details] 57 ./nptl/futex-internal.c: No such file or directory.
[Details] ERROR: test returned -1
[Details] auto_run_tests.pl: ERROR: "tests/DCPS/ContentFilteredTopic/run_test.pl rtps_disc dynamic" returned with status 1

tests/DCPS/ContentFilteredTopic/run_test.pl rtps_disc nopub dynamic

[Details] ERROR: ContentFilteredTopicTest timedout
[Details] 57 ./nptl/futex-internal.c: No such file or directory.
[Details] ERROR: test returned -1
[Details] auto_run_tests.pl: ERROR: "tests/DCPS/ContentFilteredTopic/run_test.pl rtps_disc nopub dynamic" returned with status 1

tests/DCPS/XTypes/run_test.pl --dynamic-writers

[Details] 2026-10-28 04:40:00: ERROR: reader_ExtendedMutableStructMatch finished and returned 1
[Details] 2026-10-28 04:40:00: ERROR: writer_ExtendedMutableStructMatch finished and returned 1
[Details] ERROR: read_i: wait failed: Timeout
[Details] ERROR: read_single MutableStruct failed
[Details] ERROR: wait on control_dw condition returned Timeout
[Details] ERROR: set_int32: resolve_string_path: Error
[Details] ERROR: read_i: wait failed: Timeout
[Details] ERROR: control read failed
[Details] test FAILED (process_error).
[Details] 2026-10-28 04:40:17: ERROR: reader_IgnoreMemberNames_MutableStructMatch finished and returned 1
[Details] 2026-10-28 04:40:17: ERROR: writer_IgnoreMemberNames_MutableStructMatch finished and returned 1
[Details] ERROR: read_i: wait failed: Timeout
[Details] ERROR: read_single MutableStruct failed
[Details] ERROR: wait on control_dw condition returned Timeout
[Details] ERROR: set_int32: resolve_string_path: Error
[Details] ERROR: set_int32: resolve_string_path: Error
[Details] ERROR: read_i: wait failed: Timeout
[Details] ERROR: control read failed
[Details] test FAILED (process_error).
[Details] 2026-10-28 04:40:34: ERROR: reader_AppendableMatch finished and returned 1
[Details] 2026-10-28 04:40:34: ERROR: writer_AppendableMatch finished and returned 1
[Details] ERROR: read_i: wait failed: Timeout
[Details] ERROR: read_single AppendableStruct failed
[Details] ERROR: wait on control_dw condition returned Timeout
[Details] ERROR: set_int32: resolve_string_path: Error
[Details] ERROR: set_int32: resolve_string_path: Error
[Details] ERROR: read_i: wait failed: Timeout
[Details] ERROR: control read failed
[Details] test FAILED (process_error).
[Details] 2026-10-28 04:40:50: ERROR: reader_Match_no_xtypes_yn finished and returned 1
[Details] 2026-10-28 04:40:50: ERROR: writer_Match_no_xtypes_yn finished and returned 1
[Details] ERROR: read_i: wait failed: Timeout
[Details] ERROR: read_single AppendableStructNoXTypes failed
[Details] ERROR: wait on control_dw condition returned Timeout
[Details] ERROR: set_int32: resolve_string_path: Error
[Details] ERROR: read_i: wait failed: Timeout
[Details] ERROR: control read failed
[Details] test FAILED (process_error).
[Details] 2026-10-28 04:41:08: ERROR: reader_NoXTypesMatchTypeNames finished and returned 1
[Details] 2026-10-28 04:41:08: ERROR: writer_NoXTypesMatchTypeNames finished and returned 1
[Details] ERROR: read_i: wait failed: Timeout
[Details] ERROR: read_single AppendableStructNoXTypes failed
[Details] ERROR: wait on control_dw condition returned Timeout
[Details] ERROR: set_int32: resolve_string_path: Error
[Details] ERROR: read_i: wait failed: Timeout
[Details] ERROR: control read failed
[Details] test FAILED (process_error).
[Details] 2026-10-28 04:41:26: ERROR: reader_PlainCdr finished and returned 1
[Details] 2026-10-28 04:41:26: ERROR: writer_PlainCdr finished and returned 1
[Details] ERROR: read_i: wait failed: Timeout
[Details] ERROR: read_single PlainCdrStruct failed
[Details] ERROR: wait on control_dw condition returned Timeout
[Details] ERROR: set_int32: resolve_string_path: Error
[Details] ERROR: set_int32: resolve_string_path: Error
[Details] ERROR: read_i: wait failed: Timeout
[Details] ERROR: control read failed
[Details] test FAILED (process_error).
[Details] 2026-10-28 04:41:42: ERROR: reader_Match_no_xtypes_nn finished and returned 1
[Details] 2026-10-28 04:41:42: ERROR: writer_Match_no_xtypes_nn finished and returned 1
[Details] ERROR: read_i: wait failed: Timeout
[Details] ERROR: read_single AppendableStructNoXTypes failed
[Details] ERROR: wait on control_dw condition returned Timeout
[Details] ERROR: set_int32: resolve_string_path: Error
[Details] ERROR: read_i: wait failed: Timeout
[Details] ERROR: control read failed
[Details] test FAILED (process_error).
[Details] 2026-10-28 04:42:00: ERROR: reader_Tryconstruct finished and returned 1
[Details] 2026-10-28 04:42:00: ERROR: writer_Tryconstruct finished and returned 1
[Details] ERROR: read_i: wait failed: Timeout
[Details] ERROR: read_single Trim20Struct failed
[Details] ERROR: wait on control_dw condition returned Timeout
[Details] ERROR: set_string: resolve_string_path: Error
[Details] ERROR: read_i: wait failed: Timeout
[Details] ERROR: control read failed
[Details] test FAILED (process_error).
[Details] 2026-10-28 04:42:17: ERROR: reader_ExtendedAppendableMatch finished and returned 1
[Details] 2026-10-28 04:42:17: ERROR: writer_ExtendedAppendableMatch finished and returned 1
[Details] ERROR: read_i: wait failed: Timeout
[Details] ERROR: read_single ExtendedAppendableStruct failed
[Details] ERROR: wait on control_dw condition returned Timeout
[Details] ERROR: set_int32: resolve_string_path: Error
[Details] ERROR: read_i: wait failed: Timeout
[Details] ERROR: control read failed
[Details] test FAILED (process_error).
[Details] ERROR: <./subscriber> exited with coredump from signal 6 : ABRT
[Details] 2026-10-28 04:42:29: ERROR: reader_MutableUnion terminated with a signal
[Details] 2026-10-28 04:42:29: ERROR: writer_MutableUnion finished and returned 1
[Details] ERROR: read_i: wait failed: Timeout
[Details] ERROR: read_single MutableUnion failed
[Details] ERROR: set_int32: resolve_string_path: Error
[Details] ERROR: read_i: wait failed: Timeout
[Details] ERROR: control read failed
[Details] test FAILED (process_error).
[Details] 2026-10-28 04:42:44: ERROR: reader_MutableStruct finished and returned 1
[Details] 2026-10-28 04:42:44: ERROR: writer_MutableStruct finished and returned 1
[Details] ERROR: read_i: wait failed: Timeout
[Details] ERROR: read_single MutableStruct failed
[Details] ERROR: wait on control_dw condition returned Timeout
[Details] ERROR: set_int32: resolve_string_path: Error
[Details] ERROR: set_int32: resolve_string_path: Error
[Details] ERROR: read_i: wait failed: Timeout
[Details] ERROR: control read failed
[Details] test FAILED (process_error).
[Details] 2026-10-28 04:43:00: ERROR: reader_Dependency finished and returned 1
[Details] 2026-10-28 04:43:00: ERROR: writer_Dependency finished and returned 1
[Details] ERROR: read_i: wait failed: Timeout
[Details] ERROR: read_single AppendableStruct failed
[Details] ERROR: wait on control_dw condition returned Timeout
[Details] ERROR: set_int32: resolve_string_path: Error
[Details] ERROR: set_int32: resolve_string_path: Error
[Details] ERROR: read_i: wait failed: Timeout
[Details] ERROR: control read failed
[Details] test FAILED (process_error).
[Details] 2026-10-28 04:43:15: ERROR: reader_Match_no_xtypes_ny finished and returned 1
[Details] 2026-10-28 04:43:15: ERROR: writer_Match_no_xtypes_ny finished and returned 1
[Details] ERROR: read_i: wait failed: Timeout
[Details] ERROR: read_single AppendableStructNoXTypes failed
[Details] ERROR: wait on control_dw condition returned Timeout
[Details] ERROR: set_int32: resolve_string_path: Error
[Details] ERROR: read_i: wait failed: Timeout
[Details] ERROR: control read failed
[Details] test FAILED (process_error).
[Details] ERROR: <./subscriber> exited with coredump from signal 6 : ABRT
[Details] 2026-10-28 04:43:28: ERROR: reader_IgnoreMemberNames_MutableUnionMatch terminated with a signal
[Details] 2026-10-28 04:43:28: ERROR: writer_IgnoreMemberNames_MutableUnionMatch finished and returned 1
[Details] ERROR: read_i: wait failed: Timeout
[Details] ERROR: read_single MutableUnion failed
[Details] ERROR: set_int32: resolve_string_path: Error
[Details] ERROR: read_i: wait failed: Timeout
[Details] ERROR: control read failed
[Details] test FAILED (process_error).
[Details] 2026-10-28 04:43:44: ERROR: reader_FinalStructMatch finished and returned 1
[Details] 2026-10-28 04:43:44: ERROR: writer_FinalStructMatch finished and returned 1
[Details] ERROR: read_i: wait failed: Timeout
[Details] ERROR: read_single FinalStructSub failed
[Details] ERROR: wait on control_dw condition returned Timeout
[Details] ERROR: set_int32: resolve_string_path: Error
[Details] ERROR: read_i: wait failed: Timeout
[Details] ERROR: control read failed
[Details] test FAILED (process_error).
[Details] 2026-10-28 04:43:59: ERROR: reader_DisallowTypeCoercion_FinalStructMatch finished and returned 1
[Details] 2026-10-28 04:43:59: ERROR: writer_DisallowTypeCoercion_FinalStructMatch finished and returned 1
[Details] ERROR: read_i: wait failed: Timeout
[Details] ERROR: read_single FinalStructSub failed
[Details] ERROR: wait on control_dw condition returned Timeout
[Details] ERROR: set_int32: resolve_string_path: Error
[Details] ERROR: read_i: wait failed: Timeout
[Details] ERROR: control read failed
[Details] test FAILED (process_error).
[Details] auto_run_tests.pl: ERROR: "tests/DCPS/XTypes/run_test.pl --dynamic-writers" returned with status 1

tests/DCPS/XTypes/run_test.pl --dynamic-readers

[Details] 2026-10-28 04:44:02: ERROR: reader_NoXTypesMatchTypeNames finished and returned 1
[Details] 2026-10-28 04:44:11: ERROR: writer_NoXTypesMatchTypeNames finished and returned 1
[Details] ERROR: check_int32: resolve_string_path: Error
[Details] ERROR: check_int32 for AppendableStructNoXTypes.key_field failed
[Details] ERROR: read_i: wait failed: Timeout
[Details] ERROR: control read failed
[Details] test FAILED (process_error).
[Details] 2026-10-28 04:44:20: ERROR: reader_IgnoreMemberNames_MutableStructMatch finished and returned 1
[Details] 2026-10-28 04:44:30: ERROR: writer_IgnoreMemberNames_MutableStructMatch finished and returned 1
[Details] ERROR: check_int32: resolve_string_path: Error
[Details] ERROR: check_int32 for MutableStruct.key_field failed
[Details] ERROR: check_int32: resolve_string_path: Error
[Details] ERROR: check_int32 for MutableStruct.additional_field failed
[Details] ERROR: read_i: wait failed: Timeout
[Details] ERROR: control read failed
[Details] test FAILED (process_error).
[Details] 2026-10-28 04:44:31: ERROR: reader_Dependency finished and returned 1
[Details] 2026-10-28 04:44:41: ERROR: writer_Dependency finished and returned 1
[Details] ERROR: check_int32: resolve_string_path: Error
[Details] ERROR: check_int32 for AppendableStruct.key_field failed
[Details] ERROR: read_i: wait failed: Timeout
[Details] ERROR: control read failed
[Details] test FAILED (process_error).
[Details] 2026-10-28 04:44:42: ERROR: reader_AppendableMatch finished and returned 1
[Details] 2026-10-28 04:44:51: ERROR: writer_AppendableMatch finished and returned 1
[Details] ERROR: check_int32: resolve_string_path: Error
[Details] ERROR: check_int32 for AppendableStruct.key_field failed
[Details] ERROR: read_i: wait failed: Timeout
[Details] ERROR: control read failed
[Details] test FAILED (process_error).
[Details] 2026-10-28 04:44:52: ERROR: reader_IgnoreMemberNames_MutableUnionMatch finished and returned 1
[Details] 2026-10-28 04:45:02: ERROR: writer_IgnoreMemberNames_MutableUnionMatch finished and returned 1
[Details] ERROR: check_int32: resolve_string_path: Error
[Details] ERROR: check_int32 for MutableUnion.discriminator failed
[Details] ERROR: read_i: wait failed: Timeout
[Details] ERROR: control read failed
[Details] test FAILED (process_error).
[Details] 2026-10-28 04:45:05: ERROR: reader_MutableStruct finished and returned 1
[Details] 2026-10-28 04:45:14: ERROR: writer_MutableStruct finished and returned 1
[Details] ERROR: check_int32: resolve_string_path: Error
[Details] ERROR: check_int32 for MutableStruct.key_field failed
[Details] ERROR: check_int32: resolve_string_path: Error
[Details] ERROR: check_int32 for MutableStruct.additional_field failed
[Details] ERROR: read_i: wait failed: Timeout
[Details] ERROR: control read failed
[Details] test FAILED (process_error).
[Details] 2026-10-28 04:45:19: ERROR: reader_Match_no_xtypes_yn finished and returned 1
[Details] 2026-10-28 04:45:28: ERROR: writer_Match_no_xtypes_yn finished and returned 1
[Details] ERROR: check_int32: resolve_string_path: Error
[Details] ERROR: check_int32 for AppendableStructNoXTypes.key_field failed
[Details] ERROR: read_i: wait failed: Timeout
[Details] ERROR: control read failed
[Details] test FAILED (process_error).
[Details] 2026-10-28 04:45:29: ERROR: reader_PlainCdr finished and returned 1
[Details] 2026-10-28 04:45:39: ERROR: writer_PlainCdr finished and returned 1
[Details] ERROR: check_int32: resolve_string_path: Error
[Details] ERROR: check_int32 for PlainCdrStruct.key_field failed
[Details] ERROR: read_i: wait failed: Timeout
[Details] ERROR: control read failed
[Details] test FAILED (process_error).
[Details] 2026-10-28 04:45:39: ERROR: reader_DisallowTypeCoercion_FinalStructMatch finished and returned 1
[Details] 2026-10-28 04:45:49: ERROR: writer_DisallowTypeCoercion_FinalStructMatch finished and returned 1
[Details] ERROR: check_int32: resolve_string_path: Error
[Details] ERROR: check_int32 for FinalStructSub.key_field failed
[Details] ERROR: read_i: wait failed: Timeout
[Details] ERROR: control read failed
[Details] test FAILED (process_error).
[Details] 2026-10-28 04:45:51: ERROR: reader_MutableUnion finished and returned 1
[Details] 2026-10-28 04:46:01: ERROR: writer_MutableUnion finished and returned 1
[Details] ERROR: check_int32: resolve_string_path: Error
[Details] ERROR: check_int32 for MutableUnion.discriminator failed
[Details] ERROR: read_i: wait failed: Timeout
[Details] ERROR: control read failed
[Details] test FAILED (process_error).
[Details] 2026-10-28 04:46:01: ERROR: reader_Match_no_xtypes_nn finished and returned 1
[Details] 2026-10-28 04:46:11: ERROR: writer_Match_no_xtypes_nn finished and returned 1
[Details] ERROR: check_int32: resolve_string_path: Error
[Details] ERROR: check_int32 for AppendableStructNoXTypes.key_field failed
[Details] ERROR: read_i: wait failed: Timeout
[Details] ERROR: control read failed
[Details] test FAILED (process_error).
[Details] 2026-10-28 04:46:15: ERROR: reader_Match_no_xtypes_ny finished and returned 1
[Details] 2026-10-28 04:46:25: ERROR: writer_Match_no_xtypes_ny finished and returned 1
[Details] ERROR: check_int32: resolve_string_path: Error
[Details] ERROR: check_int32 for AppendableStructNoXTypes.key_field failed
[Details] ERROR: read_i: wait failed: Timeout
[Details] ERROR: control read failed
[Details] test FAILED (process_error).
[Details] 2026-10-28 04:46:28: ERROR: reader_FinalStructMatch finished and returned 1
[Details] 2026-10-28 04:46:38: ERROR: writer_FinalStructMatch finished and returned 1
[Details] ERROR: check_int32: resolve_string_path: Error
[Details] ERROR: check_int32 for FinalStructSub.key_field failed
[Details] ERROR: read_i: wait failed: Timeout
[Details] ERROR: control read failed
[Details] test FAILED (process_error).
[Details] auto_run_tests.pl: ERROR: "tests/DCPS/XTypes/run_test.pl --dynamic-readers" returned with status 1

tests/DCPS/XTypes/run_test.pl --dynamic-writers --dynamic-readers

[Details] 2026-10-28 04:46:48: ERROR: reader_MutableUnion finished and returned 1
[Details] 2026-10-28 04:46:48: ERROR: writer_MutableUnion finished and returned 1
[Details] ERROR: read_i: wait failed: Timeout
[Details] ERROR: read_single MutableUnion failed
[Details] ERROR: check_int32 for MutableUnion.key_field failed
[Details] ERROR: set_int32: resolve_string_path: Error
[Details] ERROR: read_i: wait failed: Timeout
[Details] ERROR: control read failed
[Details] test FAILED (process_error).
[Details] 2026-10-28 04:47:05: ERROR: reader_IgnoreMemberNames_MutableStructMatch finished and returned 1
[Details] 2026-10-28 04:47:05: ERROR: writer_IgnoreMemberNames_MutableStructMatch finished and returned 1
[Details] ERROR: read_i: wait failed: Timeout
[Details] ERROR: read_single MutableStruct failed
[Details] ERROR: wait on control_dw condition returned Timeout
[Details] ERROR: set_int32: resolve_string_path: Error
[Details] ERROR: set_int32: resolve_string_path: Error
[Details] ERROR: read_i: wait failed: Timeout
[Details] ERROR: control read failed
[Details] test FAILED (process_error).
[Details] ERROR: set_int32: resolve_string_path: Error
[Details] test FAILED (success).
[Details] ERROR: set_int32: resolve_string_path: Error
[Details] test FAILED (success).
[Details] 2026-10-28 04:47:26: ERROR: reader_NoXTypesMatchTypeNames finished and returned 1
[Details] 2026-10-28 04:47:26: ERROR: writer_NoXTypesMatchTypeNames finished and returned 1
[Details] ERROR: read_i: wait failed: Timeout
[Details] ERROR: read_single AppendableStructNoXTypes failed
[Details] ERROR: wait on control_dw condition returned Timeout
[Details] ERROR: set_int32: resolve_string_path: Error
[Details] ERROR: read_i: wait failed: Timeout
[Details] ERROR: control read failed
[Details] test FAILED (process_error).
[Details] 2026-10-28 04:47:44: ERROR: reader_DisallowTypeCoercion_FinalStructMatch finished and returned 1
[Details] 2026-10-28 04:47:44: ERROR: writer_DisallowTypeCoercion_FinalStructMatch finished and returned 1
[Details] ERROR: read_i: wait failed: Timeout
[Details] ERROR: read_single FinalStructSub failed
[Details] ERROR: wait on control_dw condition returned Timeout
[Details] ERROR: set_int32: resolve_string_path: Error
[Details] ERROR: read_i: wait failed: Timeout
[Details] ERROR: control read failed
[Details] test FAILED (process_error).
[Details] 2026-10-28 04:48:00: ERROR: reader_Dependency finished and returned 1
[Details] 2026-10-28 04:48:00: ERROR: writer_Dependency finished and returned 1
[Details] ERROR: read_i: wait failed: Timeout
[Details] ERROR: read_single AppendableStruct failed
[Details] ERROR: wait on control_dw condition returned Timeout
[Details] ERROR: set_int32: resolve_string_path: Error
[Details] ERROR: set_int32: resolve_string_path: Error
[Details] ERROR: read_i: wait failed: Timeout
[Details] ERROR: control read failed
[Details] test FAILED (process_error).
[Details] 2026-10-28 04:48:14: ERROR: reader_IgnoreMemberNames_MutableUnionMatch finished and returned 1
[Details] 2026-10-28 04:48:14: ERROR: writer_IgnoreMemberNames_MutableUnionMatch finished and returned 1
[Details] ERROR: read_i: wait failed: Timeout
[Details] ERROR: read_single MutableUnion failed
[Details] ERROR: check_int32 for MutableUnion.key_field failed
[Details] ERROR: set_int32: resolve_string_path: Error
[Details] ERROR: read_i: wait failed: Timeout
[Details] ERROR: control read failed
[Details] test FAILED (process_error).
[Details] ERROR: set_string: resolve_string_path: Error
[Details] test FAILED (success).
[Details] 2026-10-28 04:48:33: ERROR: reader_FinalStructMatch finished and returned 1
[Details] 2026-10-28 04:48:33: ERROR: writer_FinalStructMatch finished and returned 1
[Details] ERROR: read_i: wait failed: Timeout
[Details] ERROR: read_single FinalStructSub failed
[Details] ERROR: wait on control_dw condition returned Timeout
[Details] ERROR: set_int32: resolve_string_path: Error
[Details] ERROR: read_i: wait failed: Timeout
[Details] ERROR: control read failed
[Details] test FAILED (process_error).
[Details] 2026-10-28 04:48:49: ERROR: reader_Match_no_xtypes_nn finished and returned 1
[Details] 2026-10-28 04:48:49: ERROR: writer_Match_no_xtypes_nn finished and returned 1
[Details] ERROR: read_i: wait failed: Timeout
[Details] ERROR: read_single AppendableStructNoXTypes failed
[Details] ERROR: wait on control_dw condition returned Timeout
[Details] ERROR: set_int32: resolve_string_path: Error
[Details] ERROR: read_i: wait failed: Timeout
[Details] ERROR: control read failed
[Details] test FAILED (process_error).
[Details] 2026-10-28 04:49:04: ERROR: reader_Match_no_xtypes_ny finished and returned 1
[Details] 2026-10-28 04:49:04: ERROR: writer_Match_no_xtypes_ny finished and returned 1
[Details] ERROR: read_i: wait failed: Timeout
[Details] ERROR: read_single AppendableStructNoXTypes failed
[Details] ERROR: wait on control_dw condition returned Timeout
[Details] ERROR: set_int32: resolve_string_path: Error
[Details] ERROR: read_i: wait failed: Timeout
[Details] ERROR: control read failed
[Details] test FAILED (process_error).
[Details] 2026-10-28 04:49:21: ERROR: reader_AppendableMatch finished and returned 1
[Details] 2026-10-28 04:49:21: ERROR: writer_AppendableMatch finished and returned 1
[Details] ERROR: read_i: wait failed: Timeout
[Details] ERROR: read_single AppendableStruct failed
[Details] ERROR: wait on control_dw condition returned Timeout
[Details] ERROR: set_int32: resolve_string_path: Error
[Details] ERROR: set_int32: resolve_string_path: Error
[Details] ERROR: read_i: wait failed: Timeout
[Details] ERROR: control read failed
[Details] test FAILED (process_error).
[Details] 2026-10-28 04:49:37: ERROR: reader_PlainCdr finished and returned 1
[Details] 2026-10-28 04:49:37: ERROR: writer_PlainCdr finished and returned 1
[Details] ERROR: read_i: wait failed: Timeout
[Details] ERROR: read_single PlainCdrStruct failed
[Details] ERROR: wait on control_dw condition returned Timeout
[Details] ERROR: set_int32: resolve_string_path: Error
[Details] ERROR: set_int32: resolve_string_path: Error
[Details] ERROR: read_i: wait failed: Timeout
[Details] ERROR: control read failed
[Details] test FAILED (process_error).
[Details] 2026-10-28 04:49:54: ERROR: reader_MutableStruct finished and returned 1
[Details] 2026-10-28 04:49:54: ERROR: writer_MutableStruct finished and returned 1
[Details] ERROR: read_i: wait failed: Timeout
[Details] ERROR: read_single MutableStruct failed
[Details] ERROR: wait on control_dw condition returned Timeout
[Details] ERROR: set_int32: resolve_string_path: Error
[Details] ERROR: set_int32: resolve_string_path: Error
[Details] ERROR: read_i: wait failed: Timeout
[Details] ERROR: control read failed
[Details] test FAILED (process_error).
[Details] 2026-10-28 04:50:09: ERROR: reader_Match_no_xtypes_yn finished and returned 1
[Details] 2026-10-28 04:50:09: ERROR: writer_Match_no_xtypes_yn finished and returned 1
[Details] ERROR: read_i: wait failed: Timeout
[Details] ERROR: read_single AppendableStructNoXTypes failed
[Details] ERROR: wait on control_dw condition returned Timeout
[Details] ERROR: set_int32: resolve_string_path: Error
[Details] ERROR: read_i: wait failed: Timeout
[Details] ERROR: control read failed
[Details] test FAILED (process_error).
[Details] auto_run_tests.pl: ERROR: "tests/DCPS/XTypes/run_test.pl --dynamic-writers --dynamic-readers" returned with status 1

tests/DCPS/ZeroEnum/run_test.pl

[Details] ERROR: <subscriber> exited with coredump from signal 6 : ABRT
[Details] 2026-10-28 05:00:15: ERROR: subscriber terminated with a signal
[Details] ERROR: publisher timedout
[Details] 78 ../sysdeps/unix/sysv/linux/clock_nanosleep.c: No such file or directory.
[Details] 2026-10-28 05:00:45: ERROR: publisher timedout
[Details] ERROR: TEST could get dynamic type member for my_enum
[Details] test FAILED (success).
[Details] auto_run_tests.pl: ERROR: "tests/DCPS/ZeroEnum/run_test.pl" returned with status 4

tests/security/CheckInstance/run_test.pl

[Details] ERROR: <CheckInstance> exited with coredump from signal 11 : SEGV
[Details] 2026-10-28 05:09:22: ERROR: CheckInstance terminated with a signal
[Details] 2026-10-28 05:09:22.606@LM_ERROR@ERROR: check_local_datawriter_register_instance did not allow an instance to be registered when expected
[Details] test FAILED (success).
[Details] ERROR: test returned 4
[Details] auto_run_tests.pl: ERROR: "tests/security/CheckInstance/run_test.pl" returned with status 1

OCI_Ubuntu_22_04_GCC16

CMakeLists.txt

[Details] The following tests FAILED:
[Details] Errors while running CTest
[Details] auto_run_tests.pl: ERROR: "CMakeLists.txt" returned with status 8

DevGuideExamples/DCPS/Messenger/CMakeLists.txt run_test.pl

[Details] ERROR: waiting for /var/lib/jenkins/workspace/OpenDDS_ACE8_Ubuntu_22_04_GCC16_x64_Debug/bin/DCPSInfoRepo IOR file
[Details] test FAILED (init_error finish_error).
[Details] ERROR: </var/lib/jenkins/workspace/OpenDDS_ACE8_Ubuntu_22_04_GCC16_x64_Debug/bin/DCPSInfoRepo> still running upon object destruction

DevGuideExamples/DCPS/Messenger/CMakeLists.txt run_test.pl --rtps

[Details] 2026-10-28 06:44:16: ERROR: publisher finished and returned 1
[Details] 2026-10-28 06:44:16: ERROR: subscriber finished and returned 1
[Details] test FAILED (success).

tests/cmake/Messenger/Messenger_1/CMakeLists.txt run_test.pl

[Details] ERROR: waiting for /var/lib/jenkins/workspace/OpenDDS_ACE8_Ubuntu_22_04_GCC16_x64_Debug/bin/DCPSInfoRepo IOR file
[Details] test FAILED (init_error finish_error).
[Details] ERROR: </var/lib/jenkins/workspace/OpenDDS_ACE8_Ubuntu_22_04_GCC16_x64_Debug/bin/DCPSInfoRepo> still running upon object destruction

tests/cmake/Nested_IDL/CMakeLists.txt run_test.pl

[Details] 2026-10-28 06:44:46: ERROR: main finished and returned 1
[Details] test FAILED (success).

tests/cmake/ace_tao_only/CMakeLists.txt run_test.pl

[Details] ERROR: cannot find file </var/lib/jenkins/workspace/OpenDDS_ACE8_Ubuntu_22_04_GCC16_x64_Debug/build/tests/cmake/ace_tao_only/Messenger.ior>

tests/cmake/install/CMakeLists.txt run_test.pl

[Details] 2026-10-28 06:45:02: ERROR: user finished and returned 1
[Details] test FAILED (success).

tests/DCPS/Compiler/char_literals/CMakeLists.txt run_test.pl cpp11

[Details] 2026-10-28 06:45:02: ERROR: test finished and returned 1
[Details] test FAILED (success).

tests/DCPS/Compiler/xcdr/CMakeLists.txt run_test.pl

[Details] 2026-10-28 06:45:02: ERROR: test finished and returned 1
[Details] test FAILED (success).

tests/DCPS/Compiler/xcdr/CMakeLists.txt run_test.pl --dynamic

[Details] 2026-10-28 06:45:02: ERROR: test finished and returned 1
[Details] test FAILED (success).

tests/DCPS/Compiler/maps/CMakeLists.txt run_test.pl

[Details] 2026-10-28 06:45:03: ERROR: maps finished and returned 1
[Details] test FAILED (success).

tests/DCPS/HelloWorld/CMakeLists.txt run_test.pl

[Details] ERROR: waiting for /var/lib/jenkins/workspace/OpenDDS_ACE8_Ubuntu_22_04_GCC16_x64_Debug/bin/DCPSInfoRepo IOR file
[Details] test FAILED (init_error finish_error).
[Details] ERROR: </var/lib/jenkins/workspace/OpenDDS_ACE8_Ubuntu_22_04_GCC16_x64_Debug/bin/DCPSInfoRepo> still running upon object destruction

tests/DCPS/HelloWorld/CMakeLists.txt run_test.pl ini=rtps.ini

[Details] 2026-10-28 06:45:33: ERROR: subscriber finished and returned 1
[Details] 2026-10-28 06:45:33: ERROR: publisher finished and returned 1
[Details] test FAILED (success).

tests/DCPS/Messenger/CMakeLists.txt run_test.pl

[Details] ERROR: waiting for /var/lib/jenkins/workspace/OpenDDS_ACE8_Ubuntu_22_04_GCC16_x64_Debug/bin/DCPSInfoRepo IOR file
[Details] test FAILED (init_error finish_error).
[Details] ERROR: </var/lib/jenkins/workspace/OpenDDS_ACE8_Ubuntu_22_04_GCC16_x64_Debug/bin/DCPSInfoRepo> still running upon object destruction

tests/DCPS/Messenger/CMakeLists.txt run_test.pl default_tcp

[Details] ERROR: waiting for /var/lib/jenkins/workspace/OpenDDS_ACE8_Ubuntu_22_04_GCC16_x64_Debug/bin/DCPSInfoRepo IOR file
[Details] test FAILED (init_error finish_error).
[Details] ERROR: </var/lib/jenkins/workspace/OpenDDS_ACE8_Ubuntu_22_04_GCC16_x64_Debug/bin/DCPSInfoRepo> still running upon object destruction

tests/DCPS/Messenger/CMakeLists.txt run_test.pl thread_per

[Details] ERROR: waiting for /var/lib/jenkins/workspace/OpenDDS_ACE8_Ubuntu_22_04_GCC16_x64_Debug/bin/DCPSInfoRepo IOR file
[Details] test FAILED (init_error finish_error).
[Details] ERROR: </var/lib/jenkins/workspace/OpenDDS_ACE8_Ubuntu_22_04_GCC16_x64_Debug/bin/DCPSInfoRepo> still running upon object destruction

tests/DCPS/Messenger/CMakeLists.txt run_test.pl shmem

[Details] ERROR: waiting for /var/lib/jenkins/workspace/OpenDDS_ACE8_Ubuntu_22_04_GCC16_x64_Debug/bin/DCPSInfoRepo IOR file
[Details] test FAILED (init_error finish_error).
[Details] ERROR: </var/lib/jenkins/workspace/OpenDDS_ACE8_Ubuntu_22_04_GCC16_x64_Debug/bin/DCPSInfoRepo> still running upon object destruction

tests/DCPS/Messenger/CMakeLists.txt run_test.pl nobits

[Details] ERROR: waiting for /var/lib/jenkins/workspace/OpenDDS_ACE8_Ubuntu_22_04_GCC16_x64_Debug/bin/DCPSInfoRepo IOR file
[Details] test FAILED (init_error finish_error).
[Details] ERROR: </var/lib/jenkins/workspace/OpenDDS_ACE8_Ubuntu_22_04_GCC16_x64_Debug/bin/DCPSInfoRepo> still running upon object destruction

tests/DCPS/Messenger/CMakeLists.txt run_test.pl stack

[Details] ERROR: waiting for /var/lib/jenkins/workspace/OpenDDS_ACE8_Ubuntu_22_04_GCC16_x64_Debug/bin/DCPSInfoRepo IOR file
[Details] test FAILED (init_error finish_error).
[Details] ERROR: </var/lib/jenkins/workspace/OpenDDS_ACE8_Ubuntu_22_04_GCC16_x64_Debug/bin/DCPSInfoRepo> still running upon object destruction

tests/DCPS/Messenger/CMakeLists.txt run_test.pl rtps

[Details] ERROR: waiting for /var/lib/jenkins/workspace/OpenDDS_ACE8_Ubuntu_22_04_GCC16_x64_Debug/bin/DCPSInfoRepo IOR file
[Details] test FAILED (init_error finish_error).
[Details] ERROR: </var/lib/jenkins/workspace/OpenDDS_ACE8_Ubuntu_22_04_GCC16_x64_Debug/bin/DCPSInfoRepo> still running upon object destruction

tests/DCPS/Messenger/CMakeLists.txt run_test.pl rtps_unicast

[Details] ERROR: waiting for /var/lib/jenkins/workspace/OpenDDS_ACE8_Ubuntu_22_04_GCC16_x64_Debug/bin/DCPSInfoRepo IOR file
[Details] test FAILED (init_error finish_error).
[Details] ERROR: </var/lib/jenkins/workspace/OpenDDS_ACE8_Ubuntu_22_04_GCC16_x64_Debug/bin/DCPSInfoRepo> still running upon object destruction

tests/DCPS/Messenger/CMakeLists.txt run_test.pl rtps_disc

[Details] 2026-10-28 06:49:34: ERROR: publisher finished and returned 1
[Details] 2026-10-28 06:49:34: ERROR: subscriber finished and returned 1
[Details] test FAILED (success).

tests/DCPS/Messenger/CMakeLists.txt run_test.pl rtps_disc_tcp

[Details] 2026-10-28 06:49:34: ERROR: publisher finished and returned 1
[Details] 2026-10-28 06:49:34: ERROR: subscriber finished and returned 1
[Details] test FAILED (success).

tests/DCPS/Messenger/CMakeLists.txt run_test.pl rtps_disc_tcp thread_per

[Details] 2026-10-28 06:49:34: ERROR: publisher finished and returned 1
[Details] 2026-10-28 06:49:34: ERROR: subscriber finished and returned 1
[Details] test FAILED (success).

tests/DCPS/Messenger/CMakeLists.txt run_test.pl rtps_disc_tcp_udp

[Details] 2026-10-28 06:49:34: ERROR: publisher finished and returned 1
[Details] 2026-10-28 06:49:34: ERROR: subscriber finished and returned 1
[Details] test FAILED (success).

tests/DCPS/Messenger/CMakeLists.txt run_test.pl rtps_disc_half_sec_pub

[Details] 2026-10-28 06:49:34: ERROR: publisher finished and returned 1
[Details] 2026-10-28 06:49:34: ERROR: subscriber finished and returned 1
[Details] test FAILED (success).

tests/DCPS/Messenger/CMakeLists.txt run_test.pl rtps_disc_half_sec_sub

[Details] 2026-10-28 06:49:34: ERROR: publisher finished and returned 1
[Details] 2026-10-28 06:49:34: ERROR: subscriber finished and returned 1
[Details] test FAILED (success).

tests/DCPS/Messenger/CMakeLists.txt run_test.pl rtps_disc_sec

[Details] 2026-10-28 06:49:34: ERROR: publisher finished and returned 1
[Details] 2026-10-28 06:49:34: ERROR: subscriber finished and returned 1
[Details] test FAILED (success).

tests/DCPS/C++11/Messenger/CMakeLists.txt run_test.pl

[Details] ERROR: waiting for /var/lib/jenkins/workspace/OpenDDS_ACE8_Ubuntu_22_04_GCC16_x64_Debug/bin/DCPSInfoRepo IOR file
[Details] test FAILED (init_error finish_error).
[Details] ERROR: </var/lib/jenkins/workspace/OpenDDS_ACE8_Ubuntu_22_04_GCC16_x64_Debug/bin/DCPSInfoRepo> still running upon object destruction