Daily Build Log (Brief)
Compile
/var/lib/jenkins/workspace/OpenDDS_ACE8_Ubuntu_22_04_GCC16_x64_Debug/performance-tests/DCPS/Sync/GNUmakefile.Sync_Server
[Details] /var/lib/jenkins/workspace/ACE_TAO_Ubuntu_22_04_GCC16_x64_Debug/ACE/ace/Netlink_Addr.inl: In constructor 'ACE_Netlink_Addr::ACE_Netlink_Addr()':
[Details] /var/lib/jenkins/workspace/ACE_TAO_Ubuntu_22_04_GCC16_x64_Debug/ACE/ace/Netlink_Addr.inl:7:58: warning: '<unknown>' may be used uninitialized [-Wmaybe-uninitialized]
[Details] /var/lib/jenkins/workspace/ACE_TAO_Ubuntu_22_04_GCC16_x64_Debug/ACE/ace/Netlink_Addr.inl:24:16: note: by argument 1 of type 'const ACE_Netlink_Addr*' to 'int ACE_Netlink_Addr::determine_type() const' declared here
/var/lib/jenkins/workspace/OpenDDS_ACE8_Ubuntu_22_04_GCC16_x64_Debug/tests/DCPS/ParticipantLocationTopic/GNUmakefile.ParticipantLocationTopic
[Details] /var/lib/jenkins/workspace/OpenDDS_ACE8_Ubuntu_22_04_GCC16_x64_Debug/tests/DCPS/ParticipantLocationTopic/BitListener.cpp: In member function 'void BitListener::on_data_available_i(OpenDDS::DCPS::ParticipantLocationBuiltinTopicDataDataReader_var)':
[Details] /var/lib/jenkins/workspace/OpenDDS_ACE8_Ubuntu_22_04_GCC16_x64_Debug/tests/DCPS/ParticipantLocationTopic/BitListener.cpp:64:16: warning: 'void* memcpy(void*, const void*, size_t)' copying an object of non-trivial type 'struct OpenDDS::DCPS::GUID_t' from an array of 'DDS::OctetArray16' {aka 'unsigned char [16]'} [-Wclass-memaccess]
[Details] /var/lib/jenkins/workspace/OpenDDS_ACE8_Ubuntu_22_04_GCC16_x64_Debug/dds/DdsDcpsGuidC.h:332:32: note: 'struct OpenDDS::DCPS::GUID_t' declared here
[Details] /var/lib/jenkins/workspace/OpenDDS_ACE8_Ubuntu_22_04_GCC16_x64_Debug/tests/DCPS/ParticipantLocationTopic/BitListener.cpp: In member function 'void BitListener::on_data_available_i(DDS::ParticipantBuiltinTopicDataDataReader_var)':
[Details] /var/lib/jenkins/workspace/OpenDDS_ACE8_Ubuntu_22_04_GCC16_x64_Debug/tests/DCPS/ParticipantLocationTopic/BitListener.cpp:125:18: warning: 'void* memcpy(void*, const void*, size_t)' copying an object of non-trivial type 'struct OpenDDS::DCPS::GUID_t' from an array of 'struct DDS::BuiltinTopicKey_t' [-Wclass-memaccess]
[Details] /var/lib/jenkins/workspace/OpenDDS_ACE8_Ubuntu_22_04_GCC16_x64_Debug/dds/DdsDcpsGuidC.h:332:32: note: 'struct OpenDDS::DCPS::GUID_t' declared here
/var/lib/jenkins/workspace/OpenDDS_ACE8_Ubuntu_22_04_GCC16_x64_Debug/tests/DCPS/RtpsRelay/Smoke/GNUmakefile.RtpsRelayPublisher
[Details] ../../../../tools/dds/rtpsrelaylib/Utility.h: In function 'OpenDDS::DCPS::GUID_t RtpsRelay::relay_guid_to_rtps_guid(const GUID_t&)':
[Details] ../../../../tools/dds/rtpsrelaylib/Utility.h:156:14: warning: 'void* memcpy(void*, const void*, size_t)' copying an object of non-trivial type 'struct OpenDDS::DCPS::GUID_t' from an array of 'const class RtpsRelay::GUID_t' [-Wclass-memaccess]
[Details] /var/lib/jenkins/workspace/OpenDDS_ACE8_Ubuntu_22_04_GCC16_x64_Debug/dds/DdsDcpsGuidC.h:332:32: note: 'struct OpenDDS::DCPS::GUID_t' declared here
/var/lib/jenkins/workspace/OpenDDS_ACE8_Ubuntu_22_04_GCC16_x64_Debug/tools/rtpsrelay/GNUmakefile.RtpsRelay
[Details] ../../tools/dds/rtpsrelaylib/Utility.h: In function 'OpenDDS::DCPS::GUID_t RtpsRelay::relay_guid_to_rtps_guid(const GUID_t&)':
[Details] ../../tools/dds/rtpsrelaylib/Utility.h:156:14: warning: 'void* memcpy(void*, const void*, size_t)' copying an object of non-trivial type 'struct OpenDDS::DCPS::GUID_t' from an array of 'const class RtpsRelay::GUID_t' [-Wclass-memaccess]
[Details] /var/lib/jenkins/workspace/OpenDDS_ACE8_Ubuntu_22_04_GCC16_x64_Debug/dds/DdsDcpsGuidC.h:332:32: note: 'struct OpenDDS::DCPS::GUID_t' declared here
[Details] ../../tools/dds/rtpsrelaylib/Utility.h: In function 'OpenDDS::DCPS::GUID_t RtpsRelay::relay_guid_to_rtps_guid(const GUID_t&)':
[Details] ../../tools/dds/rtpsrelaylib/Utility.h:156:14: warning: 'void* memcpy(void*, const void*, size_t)' copying an object of non-trivial type 'struct OpenDDS::DCPS::GUID_t' from an array of 'const class RtpsRelay::GUID_t' [-Wclass-memaccess]
[Details] /var/lib/jenkins/workspace/OpenDDS_ACE8_Ubuntu_22_04_GCC16_x64_Debug/dds/DdsDcpsGuidC.h:332:32: note: 'struct OpenDDS::DCPS::GUID_t' declared here
[Details] ../../tools/dds/rtpsrelaylib/Utility.h: In function 'OpenDDS::DCPS::GUID_t RtpsRelay::relay_guid_to_rtps_guid(const GUID_t&)':
[Details] ../../tools/dds/rtpsrelaylib/Utility.h:156:14: warning: 'void* memcpy(void*, const void*, size_t)' copying an object of non-trivial type 'struct OpenDDS::DCPS::GUID_t' from an array of 'const class RtpsRelay::GUID_t' [-Wclass-memaccess]
[Details] /var/lib/jenkins/workspace/OpenDDS_ACE8_Ubuntu_22_04_GCC16_x64_Debug/dds/DdsDcpsGuidC.h:332:32: note: 'struct OpenDDS::DCPS::GUID_t' declared here
[Details] ../../tools/dds/rtpsrelaylib/Utility.h: In function 'OpenDDS::DCPS::GUID_t RtpsRelay::relay_guid_to_rtps_guid(const GUID_t&)':
[Details] ../../tools/dds/rtpsrelaylib/Utility.h:156:14: warning: 'void* memcpy(void*, const void*, size_t)' copying an object of non-trivial type 'struct OpenDDS::DCPS::GUID_t' from an array of 'const class RtpsRelay::GUID_t' [-Wclass-memaccess]
[Details] /var/lib/jenkins/workspace/OpenDDS_ACE8_Ubuntu_22_04_GCC16_x64_Debug/dds/DdsDcpsGuidC.h:332:32: note: 'struct OpenDDS::DCPS::GUID_t' declared here
[Details] ../../tools/dds/rtpsrelaylib/Utility.h: In function 'OpenDDS::DCPS::GUID_t RtpsRelay::relay_guid_to_rtps_guid(const GUID_t&)':
[Details] ../../tools/dds/rtpsrelaylib/Utility.h:156:14: warning: 'void* memcpy(void*, const void*, size_t)' copying an object of non-trivial type 'struct OpenDDS::DCPS::GUID_t' from an array of 'const class RtpsRelay::GUID_t' [-Wclass-memaccess]
[Details] /var/lib/jenkins/workspace/OpenDDS_ACE8_Ubuntu_22_04_GCC16_x64_Debug/dds/DdsDcpsGuidC.h:332:32: note: 'struct OpenDDS::DCPS::GUID_t' declared here
[Details] ../../tools/dds/rtpsrelaylib/Utility.h: In function 'OpenDDS::DCPS::GUID_t RtpsRelay::relay_guid_to_rtps_guid(const GUID_t&)':
[Details] ../../tools/dds/rtpsrelaylib/Utility.h:156:14: warning: 'void* memcpy(void*, const void*, size_t)' copying an object of non-trivial type 'struct OpenDDS::DCPS::GUID_t' from an array of 'const class RtpsRelay::GUID_t' [-Wclass-memaccess]
[Details] /var/lib/jenkins/workspace/OpenDDS_ACE8_Ubuntu_22_04_GCC16_x64_Debug/dds/DdsDcpsGuidC.h:332:32: note: 'struct OpenDDS::DCPS::GUID_t' declared here
[Details] ../../tools/dds/rtpsrelaylib/Utility.h: In function 'OpenDDS::DCPS::GUID_t RtpsRelay::relay_guid_to_rtps_guid(const GUID_t&)':
[Details] ../../tools/dds/rtpsrelaylib/Utility.h:156:14: warning: 'void* memcpy(void*, const void*, size_t)' copying an object of non-trivial type 'struct OpenDDS::DCPS::GUID_t' from an array of 'const class RtpsRelay::GUID_t' [-Wclass-memaccess]
[Details] /var/lib/jenkins/workspace/OpenDDS_ACE8_Ubuntu_22_04_GCC16_x64_Debug/dds/DdsDcpsGuidC.h:332:32: note: 'struct OpenDDS::DCPS::GUID_t' declared here
[Details] ../../tools/dds/rtpsrelaylib/Utility.h: In function 'OpenDDS::DCPS::GUID_t RtpsRelay::relay_guid_to_rtps_guid(const GUID_t&)':
[Details] ../../tools/dds/rtpsrelaylib/Utility.h:156:14: warning: 'void* memcpy(void*, const void*, size_t)' copying an object of non-trivial type 'struct OpenDDS::DCPS::GUID_t' from an array of 'const class RtpsRelay::GUID_t' [-Wclass-memaccess]
[Details] /var/lib/jenkins/workspace/OpenDDS_ACE8_Ubuntu_22_04_GCC16_x64_Debug/dds/DdsDcpsGuidC.h:332:32: note: 'struct OpenDDS::DCPS::GUID_t' declared here
[Details] ../../tools/dds/rtpsrelaylib/Utility.h: In function 'OpenDDS::DCPS::GUID_t RtpsRelay::relay_guid_to_rtps_guid(const GUID_t&)':
[Details] ../../tools/dds/rtpsrelaylib/Utility.h:156:14: warning: 'void* memcpy(void*, const void*, size_t)' copying an object of non-trivial type 'struct OpenDDS::DCPS::GUID_t' from an array of 'const class RtpsRelay::GUID_t' [-Wclass-memaccess]
[Details] /var/lib/jenkins/workspace/OpenDDS_ACE8_Ubuntu_22_04_GCC16_x64_Debug/dds/DdsDcpsGuidC.h:332:32: note: 'struct OpenDDS::DCPS::GUID_t' declared here
[Details] ../../tools/dds/rtpsrelaylib/Utility.h: In function 'OpenDDS::DCPS::GUID_t RtpsRelay::relay_guid_to_rtps_guid(const GUID_t&)':
[Details] ../../tools/dds/rtpsrelaylib/Utility.h:156:14: warning: 'void* memcpy(void*, const void*, size_t)' copying an object of non-trivial type 'struct OpenDDS::DCPS::GUID_t' from an array of 'const class RtpsRelay::GUID_t' [-Wclass-memaccess]
[Details] /var/lib/jenkins/workspace/OpenDDS_ACE8_Ubuntu_22_04_GCC16_x64_Debug/dds/DdsDcpsGuidC.h:332:32: note: 'struct OpenDDS::DCPS::GUID_t' declared here
[Details] ../../tools/dds/rtpsrelaylib/Utility.h: In function 'OpenDDS::DCPS::GUID_t RtpsRelay::relay_guid_to_rtps_guid(const GUID_t&)':
[Details] ../../tools/dds/rtpsrelaylib/Utility.h:156:14: warning: 'void* memcpy(void*, const void*, size_t)' copying an object of non-trivial type 'struct OpenDDS::DCPS::GUID_t' from an array of 'const class RtpsRelay::GUID_t' [-Wclass-memaccess]
[Details] /var/lib/jenkins/workspace/OpenDDS_ACE8_Ubuntu_22_04_GCC16_x64_Debug/dds/DdsDcpsGuidC.h:332:32: note: 'struct OpenDDS::DCPS::GUID_t' declared here
[Details] ../../tools/dds/rtpsrelaylib/Utility.h: In function 'OpenDDS::DCPS::GUID_t RtpsRelay::relay_guid_to_rtps_guid(const GUID_t&)':
[Details] ../../tools/dds/rtpsrelaylib/Utility.h:156:14: warning: 'void* memcpy(void*, const void*, size_t)' copying an object of non-trivial type 'struct OpenDDS::DCPS::GUID_t' from an array of 'const class RtpsRelay::GUID_t' [-Wclass-memaccess]
[Details] /var/lib/jenkins/workspace/OpenDDS_ACE8_Ubuntu_22_04_GCC16_x64_Debug/dds/DdsDcpsGuidC.h:332:32: note: 'struct OpenDDS::DCPS::GUID_t' declared here
[Details] ../../tools/dds/rtpsrelaylib/Utility.h: In function 'OpenDDS::DCPS::GUID_t RtpsRelay::relay_guid_to_rtps_guid(const GUID_t&)':
[Details] ../../tools/dds/rtpsrelaylib/Utility.h:156:14: warning: 'void* memcpy(void*, const void*, size_t)' copying an object of non-trivial type 'struct OpenDDS::DCPS::GUID_t' from an array of 'const class RtpsRelay::GUID_t' [-Wclass-memaccess]
[Details] /var/lib/jenkins/workspace/OpenDDS_ACE8_Ubuntu_22_04_GCC16_x64_Debug/dds/DdsDcpsGuidC.h:332:32: note: 'struct OpenDDS::DCPS::GUID_t' declared here
[Details] ../../tools/dds/rtpsrelaylib/Utility.h: In function 'OpenDDS::DCPS::GUID_t RtpsRelay::relay_guid_to_rtps_guid(const GUID_t&)':
[Details] ../../tools/dds/rtpsrelaylib/Utility.h:156:14: warning: 'void* memcpy(void*, const void*, size_t)' copying an object of non-trivial type 'struct OpenDDS::DCPS::GUID_t' from an array of 'const class RtpsRelay::GUID_t' [-Wclass-memaccess]
[Details] /var/lib/jenkins/workspace/OpenDDS_ACE8_Ubuntu_22_04_GCC16_x64_Debug/dds/DdsDcpsGuidC.h:332:32: note: 'struct OpenDDS::DCPS::GUID_t' declared here
[Details] ../../tools/dds/rtpsrelaylib/Utility.h: In function 'OpenDDS::DCPS::GUID_t RtpsRelay::relay_guid_to_rtps_guid(const GUID_t&)':
[Details] ../../tools/dds/rtpsrelaylib/Utility.h:156:14: warning: 'void* memcpy(void*, const void*, size_t)' copying an object of non-trivial type 'struct OpenDDS::DCPS::GUID_t' from an array of 'const class RtpsRelay::GUID_t' [-Wclass-memaccess]
[Details] /var/lib/jenkins/workspace/OpenDDS_ACE8_Ubuntu_22_04_GCC16_x64_Debug/dds/DdsDcpsGuidC.h:332:32: note: 'struct OpenDDS::DCPS::GUID_t' declared here
[Details] ../../tools/dds/rtpsrelaylib/Utility.h: In function 'OpenDDS::DCPS::GUID_t RtpsRelay::relay_guid_to_rtps_guid(const GUID_t&)':
[Details] ../../tools/dds/rtpsrelaylib/Utility.h:156:14: warning: 'void* memcpy(void*, const void*, size_t)' copying an object of non-trivial type 'struct OpenDDS::DCPS::GUID_t' from an array of 'const class RtpsRelay::GUID_t' [-Wclass-memaccess]
[Details] /var/lib/jenkins/workspace/OpenDDS_ACE8_Ubuntu_22_04_GCC16_x64_Debug/dds/DdsDcpsGuidC.h:332:32: note: 'struct OpenDDS::DCPS::GUID_t' declared here
[Details] ../../tools/dds/rtpsrelaylib/Utility.h: In function 'OpenDDS::DCPS::GUID_t RtpsRelay::relay_guid_to_rtps_guid(const GUID_t&)':
[Details] ../../tools/dds/rtpsrelaylib/Utility.h:156:14: warning: 'void* memcpy(void*, const void*, size_t)' copying an object of non-trivial type 'struct OpenDDS::DCPS::GUID_t' from an array of 'const class RtpsRelay::GUID_t' [-Wclass-memaccess]
[Details] /var/lib/jenkins/workspace/OpenDDS_ACE8_Ubuntu_22_04_GCC16_x64_Debug/dds/DdsDcpsGuidC.h:332:32: note: 'struct OpenDDS::DCPS::GUID_t' declared here
/var/lib/jenkins/workspace/OpenDDS_ACE8_Ubuntu_22_04_GCC16_x64_Debug/DevGuideExamples/DCPS/Messenger/GNUmakefile.Messenger_Publisher
[Details] /var/lib/jenkins/workspace/OpenDDS_ACE8_Ubuntu_22_04_GCC16_x64_Debug/tests/unit-tests/dds/DCPS/DomainParticipantImpl.cpp: In member function 'virtual void dds_DCPS_DomainParticipantImpl_maintest_Test::TestBody()':
[Details] /var/lib/jenkins/workspace/OpenDDS_ACE8_Ubuntu_22_04_GCC16_x64_Debug/tests/unit-tests/dds/DCPS/DomainParticipantImpl.cpp:37:11: warning: 'void* memset(void*, int, size_t)' clearing an object of non-trivial type 'GUID_t' {aka 'struct OpenDDS::DCPS::GUID_t'}; use assignment or value-initialization instead [-Wclass-memaccess]
[Details] /var/lib/jenkins/workspace/OpenDDS_ACE8_Ubuntu_22_04_GCC16_x64_Debug/dds/DdsDcpsGuidC.h:332:32: note: 'GUID_t' {aka 'struct OpenDDS::DCPS::GUID_t'} declared here
[Details] /var/lib/jenkins/workspace/OpenDDS_ACE8_Ubuntu_22_04_GCC16_x64_Debug/tests/unit-tests/dds/DCPS/GuidConverter.cpp: In function 'OpenDDS::DCPS::GUID_t InitGUID(int)':
[Details] /var/lib/jenkins/workspace/OpenDDS_ACE8_Ubuntu_22_04_GCC16_x64_Debug/tests/unit-tests/dds/DCPS/GuidConverter.cpp:19:9: warning: 'void* memset(void*, int, size_t)' clearing an object of non-trivial type 'struct OpenDDS::DCPS::GUID_t'; use assignment or value-initialization instead [-Wclass-memaccess]
[Details] /var/lib/jenkins/workspace/OpenDDS_ACE8_Ubuntu_22_04_GCC16_x64_Debug/dds/DdsDcpsGuidC.h:332:32: note: 'struct OpenDDS::DCPS::GUID_t' declared here
/var/lib/jenkins/workspace/OpenDDS_ACE8_Ubuntu_22_04_GCC16_x64_Debug/performance-tests/DCPS/InfoRepo_population/GNUmakefile.InfoRepo_Population_Publisher
[Details] /var/lib/jenkins/workspace/OpenDDS_ACE8_Ubuntu_22_04_GCC16_x64_Debug/tests/unit-tests/dds/DCPS/RTPS/ParameterListConverter.cpp: In function 'OpenDDS::DCPS::DiscoveredWriterData {anonymous}::Factory::default_writer_data()':
[Details] /var/lib/jenkins/workspace/OpenDDS_ACE8_Ubuntu_22_04_GCC16_x64_Debug/tests/unit-tests/dds/DCPS/RTPS/ParameterListConverter.cpp:204:14: warning: 'void* memset(void*, int, size_t)' clearing an object of non-trivial type 'struct OpenDDS::DCPS::GUID_t'; use assignment or value-initialization instead [-Wclass-memaccess]
[Details] /var/lib/jenkins/workspace/OpenDDS_ACE8_Ubuntu_22_04_GCC16_x64_Debug/dds/DdsDcpsGuidC.h:332:32: note: 'struct OpenDDS::DCPS::GUID_t' declared here
/var/lib/jenkins/workspace/OpenDDS_ACE8_Ubuntu_22_04_GCC16_x64_Debug/performance-tests/DCPS/Priority/GNUmakefile.Perf_Priority_Subscriber
[Details] /var/lib/jenkins/workspace/OpenDDS_ACE8_Ubuntu_22_04_GCC16_x64_Debug/performance-tests/DCPS/Priority/Subscriber.cpp: In member function 'std::ostream& Test::Subscriber::rawData(std::ostream&) const':
[Details] /var/lib/jenkins/workspace/OpenDDS_ACE8_Ubuntu_22_04_GCC16_x64_Debug/performance-tests/DCPS/Priority/Subscriber.cpp:388:7: warning: variable 'index' set but not used [-Wunused-but-set-variable=]
/var/lib/jenkins/workspace/OpenDDS_ACE8_Ubuntu_22_04_GCC16_x64_Debug/performance-tests/bench/common/GNUmakefile.Bench_Common
[Details] /var/lib/jenkins/workspace/OpenDDS_ACE8_Ubuntu_22_04_GCC16_x64_Debug/performance-tests/bench/common/PropertyStatBlock.cpp: In function 'Bench::SimpleStatBlock Bench::consolidate(const SimpleStatBlock&, const SimpleStatBlock&)':
[Details] /var/lib/jenkins/workspace/OpenDDS_ACE8_Ubuntu_22_04_GCC16_x64_Debug/performance-tests/bench/common/PropertyStatBlock.cpp:119:11: warning: 'void* memset(void*, int, size_t)' clearing an object of non-trivial type '__gnu_cxx::__alloc_traits<std::allocator<Builder::TimeStamp>, Builder::TimeStamp>::value_type' {aka 'struct Builder::TimeStamp'}; use assignment or value-initialization instead [-Wclass-memaccess]
[Details] ../../../performance-tests/bench/builder_idl/BuilderC.h:97:35: note: '__gnu_cxx::__alloc_traits<std::allocator<Builder::TimeStamp>, Builder::TimeStamp>::value_type' {aka 'struct Builder::TimeStamp'} declared here
[Details] /var/lib/jenkins/workspace/OpenDDS_ACE8_Ubuntu_22_04_GCC16_x64_Debug/performance-tests/bench/common/PropertyStatBlock.cpp:124:11: warning: 'void* memset(void*, int, size_t)' clearing an object of non-trivial type '__gnu_cxx::__alloc_traits<std::allocator<Builder::TimeStamp>, Builder::TimeStamp>::value_type' {aka 'struct Builder::TimeStamp'}; use assignment or value-initialization instead [-Wclass-memaccess]
[Details] ../../../performance-tests/bench/builder_idl/BuilderC.h:97:35: note: '__gnu_cxx::__alloc_traits<std::allocator<Builder::TimeStamp>, Builder::TimeStamp>::value_type' {aka 'struct Builder::TimeStamp'} declared here
[Details] /var/lib/jenkins/workspace/OpenDDS_ACE8_Ubuntu_22_04_GCC16_x64_Debug/performance-tests/bench/common/PropertyStatBlock.cpp: In function 'Bench::SimpleStatBlock Bench::consolidate(const std::vector<SimpleStatBlock>&)':
[Details] /var/lib/jenkins/workspace/OpenDDS_ACE8_Ubuntu_22_04_GCC16_x64_Debug/performance-tests/bench/common/PropertyStatBlock.cpp:209:17: warning: 'void* memset(void*, int, size_t)' clearing an object of non-trivial type '__gnu_cxx::__alloc_traits<std::allocator<Builder::TimeStamp>, Builder::TimeStamp>::value_type' {aka 'struct Builder::TimeStamp'}; use assignment or value-initialization instead [-Wclass-memaccess]
[Details] ../../../performance-tests/bench/builder_idl/BuilderC.h:97:35: note: '__gnu_cxx::__alloc_traits<std::allocator<Builder::TimeStamp>, Builder::TimeStamp>::value_type' {aka 'struct Builder::TimeStamp'} declared here
/var/lib/jenkins/workspace/OpenDDS_ACE8_Ubuntu_22_04_GCC16_x64_Debug/tests/DCPS/XTypes/GNUmakefile.XTypes_Publisher
[Details] ../../tools/dds/rtpsrelaylib/Utility.h: In function 'OpenDDS::DCPS::GUID_t RtpsRelay::relay_guid_to_rtps_guid(const GUID_t&)':
[Details] ../../tools/dds/rtpsrelaylib/Utility.h:156:14: warning: 'void* memcpy(void*, const void*, size_t)' copying an object of non-trivial type 'struct OpenDDS::DCPS::GUID_t' from an array of 'const class RtpsRelay::GUID_t' [-Wclass-memaccess]
[Details] /var/lib/jenkins/workspace/OpenDDS_ACE8_Ubuntu_22_04_GCC16_x64_Debug/dds/DdsDcpsGuidC.h:332:32: note: 'struct OpenDDS::DCPS::GUID_t' declared here
[Details] ../../tools/dds/rtpsrelaylib/Utility.h: In function 'OpenDDS::DCPS::GUID_t RtpsRelay::relay_guid_to_rtps_guid(const GUID_t&)':
[Details] ../../tools/dds/rtpsrelaylib/Utility.h:156:14: warning: 'void* memcpy(void*, const void*, size_t)' copying an object of non-trivial type 'struct OpenDDS::DCPS::GUID_t' from an array of 'const class RtpsRelay::GUID_t' [-Wclass-memaccess]
[Details] /var/lib/jenkins/workspace/OpenDDS_ACE8_Ubuntu_22_04_GCC16_x64_Debug/dds/DdsDcpsGuidC.h:332:32: note: 'struct OpenDDS::DCPS::GUID_t' declared here
/var/lib/jenkins/workspace/OpenDDS_ACE8_Ubuntu_22_04_GCC16_x64_Debug/performance-tests/bench/test_controller/GNUmakefile.Bench_test_controller
[Details] /var/lib/jenkins/workspace/OpenDDS_ACE8_Ubuntu_22_04_GCC16_x64_Debug/performance-tests/bench/test_controller/ScenarioManager.cpp: In member function 'void ScenarioManager::execute(const Bench::TestController::AllocatedScenario&, Bench::TestController::Report&)':
[Details] /var/lib/jenkins/workspace/OpenDDS_ACE8_Ubuntu_22_04_GCC16_x64_Debug/performance-tests/bench/test_controller/ScenarioManager.cpp:304:10: warning: variable 'parsed_worker_report_count' set but not used [-Wunused-but-set-variable=]
Test
CMakeLists.txt
[Details] The following tests FAILED:
[Details] Errors while running CTest
[Details] auto_run_tests.pl: ERROR: "CMakeLists.txt" returned with status 8
DevGuideExamples/DCPS/Messenger/CMakeLists.txt run_test.pl
[Details] ERROR: waiting for /var/lib/jenkins/workspace/OpenDDS_ACE8_Ubuntu_22_04_GCC16_x64_Debug/bin/DCPSInfoRepo IOR file
[Details] test FAILED (init_error finish_error).
[Details] ERROR: </var/lib/jenkins/workspace/OpenDDS_ACE8_Ubuntu_22_04_GCC16_x64_Debug/bin/DCPSInfoRepo> still running upon object destruction
DevGuideExamples/DCPS/Messenger/CMakeLists.txt run_test.pl --rtps
[Details] 2026-10-08 22:57:17: ERROR: publisher finished and returned 1
[Details] 2026-10-08 22:57:17: ERROR: subscriber finished and returned 1
[Details] test FAILED (success).
tests/cmake/Messenger/Messenger_1/CMakeLists.txt run_test.pl
[Details] ERROR: waiting for /var/lib/jenkins/workspace/OpenDDS_ACE8_Ubuntu_22_04_GCC16_x64_Debug/bin/DCPSInfoRepo IOR file
[Details] test FAILED (init_error finish_error).
[Details] ERROR: </var/lib/jenkins/workspace/OpenDDS_ACE8_Ubuntu_22_04_GCC16_x64_Debug/bin/DCPSInfoRepo> still running upon object destruction
tests/cmake/Nested_IDL/CMakeLists.txt run_test.pl
[Details] 2026-10-08 22:57:47: ERROR: main finished and returned 1
[Details] test FAILED (success).
tests/cmake/ace_tao_only/CMakeLists.txt run_test.pl
[Details] ERROR: cannot find file </var/lib/jenkins/workspace/OpenDDS_ACE8_Ubuntu_22_04_GCC16_x64_Debug/build/tests/cmake/ace_tao_only/Messenger.ior>
tests/cmake/install/CMakeLists.txt run_test.pl
[Details] 2026-10-08 22:58:04: ERROR: user finished and returned 1
[Details] test FAILED (success).
tests/DCPS/Compiler/char_literals/CMakeLists.txt run_test.pl cpp11
[Details] 2026-10-08 22:58:04: ERROR: test finished and returned 1
[Details] test FAILED (success).
tests/DCPS/Compiler/xcdr/CMakeLists.txt run_test.pl
[Details] 2026-10-08 22:58:04: ERROR: test finished and returned 1
[Details] test FAILED (success).
tests/DCPS/Compiler/xcdr/CMakeLists.txt run_test.pl --dynamic
[Details] 2026-10-08 22:58:04: ERROR: test finished and returned 1
[Details] test FAILED (success).
tests/DCPS/Compiler/maps/CMakeLists.txt run_test.pl
[Details] 2026-10-08 22:58:04: ERROR: maps finished and returned 1
[Details] test FAILED (success).
tests/DCPS/HelloWorld/CMakeLists.txt run_test.pl
[Details] ERROR: waiting for /var/lib/jenkins/workspace/OpenDDS_ACE8_Ubuntu_22_04_GCC16_x64_Debug/bin/DCPSInfoRepo IOR file
[Details] test FAILED (init_error finish_error).
[Details] ERROR: </var/lib/jenkins/workspace/OpenDDS_ACE8_Ubuntu_22_04_GCC16_x64_Debug/bin/DCPSInfoRepo> still running upon object destruction
tests/DCPS/HelloWorld/CMakeLists.txt run_test.pl ini=rtps.ini
[Details] 2026-10-08 22:58:34: ERROR: subscriber finished and returned 1
[Details] 2026-10-08 22:58:34: ERROR: publisher finished and returned 1
[Details] test FAILED (success).
tests/DCPS/Messenger/CMakeLists.txt run_test.pl
[Details] ERROR: waiting for /var/lib/jenkins/workspace/OpenDDS_ACE8_Ubuntu_22_04_GCC16_x64_Debug/bin/DCPSInfoRepo IOR file
[Details] test FAILED (init_error finish_error).
[Details] ERROR: </var/lib/jenkins/workspace/OpenDDS_ACE8_Ubuntu_22_04_GCC16_x64_Debug/bin/DCPSInfoRepo> still running upon object destruction
tests/DCPS/Messenger/CMakeLists.txt run_test.pl default_tcp
[Details] ERROR: waiting for /var/lib/jenkins/workspace/OpenDDS_ACE8_Ubuntu_22_04_GCC16_x64_Debug/bin/DCPSInfoRepo IOR file
[Details] test FAILED (init_error finish_error).
[Details] ERROR: </var/lib/jenkins/workspace/OpenDDS_ACE8_Ubuntu_22_04_GCC16_x64_Debug/bin/DCPSInfoRepo> still running upon object destruction
tests/DCPS/Messenger/CMakeLists.txt run_test.pl thread_per
[Details] ERROR: waiting for /var/lib/jenkins/workspace/OpenDDS_ACE8_Ubuntu_22_04_GCC16_x64_Debug/bin/DCPSInfoRepo IOR file
[Details] test FAILED (init_error finish_error).
[Details] ERROR: </var/lib/jenkins/workspace/OpenDDS_ACE8_Ubuntu_22_04_GCC16_x64_Debug/bin/DCPSInfoRepo> still running upon object destruction
tests/DCPS/Messenger/CMakeLists.txt run_test.pl shmem
[Details] ERROR: waiting for /var/lib/jenkins/workspace/OpenDDS_ACE8_Ubuntu_22_04_GCC16_x64_Debug/bin/DCPSInfoRepo IOR file
[Details] test FAILED (init_error finish_error).
[Details] ERROR: </var/lib/jenkins/workspace/OpenDDS_ACE8_Ubuntu_22_04_GCC16_x64_Debug/bin/DCPSInfoRepo> still running upon object destruction
tests/DCPS/Messenger/CMakeLists.txt run_test.pl nobits
[Details] ERROR: waiting for /var/lib/jenkins/workspace/OpenDDS_ACE8_Ubuntu_22_04_GCC16_x64_Debug/bin/DCPSInfoRepo IOR file
[Details] test FAILED (init_error finish_error).
[Details] ERROR: </var/lib/jenkins/workspace/OpenDDS_ACE8_Ubuntu_22_04_GCC16_x64_Debug/bin/DCPSInfoRepo> still running upon object destruction
tests/DCPS/Messenger/CMakeLists.txt run_test.pl stack
[Details] ERROR: waiting for /var/lib/jenkins/workspace/OpenDDS_ACE8_Ubuntu_22_04_GCC16_x64_Debug/bin/DCPSInfoRepo IOR file
[Details] test FAILED (init_error finish_error).
[Details] ERROR: </var/lib/jenkins/workspace/OpenDDS_ACE8_Ubuntu_22_04_GCC16_x64_Debug/bin/DCPSInfoRepo> still running upon object destruction
tests/DCPS/Messenger/CMakeLists.txt run_test.pl rtps
[Details] ERROR: waiting for /var/lib/jenkins/workspace/OpenDDS_ACE8_Ubuntu_22_04_GCC16_x64_Debug/bin/DCPSInfoRepo IOR file
[Details] test FAILED (init_error finish_error).
[Details] ERROR: </var/lib/jenkins/workspace/OpenDDS_ACE8_Ubuntu_22_04_GCC16_x64_Debug/bin/DCPSInfoRepo> still running upon object destruction
tests/DCPS/Messenger/CMakeLists.txt run_test.pl rtps_unicast
[Details] ERROR: waiting for /var/lib/jenkins/workspace/OpenDDS_ACE8_Ubuntu_22_04_GCC16_x64_Debug/bin/DCPSInfoRepo IOR file
[Details] test FAILED (init_error finish_error).
[Details] ERROR: </var/lib/jenkins/workspace/OpenDDS_ACE8_Ubuntu_22_04_GCC16_x64_Debug/bin/DCPSInfoRepo> still running upon object destruction
tests/DCPS/Messenger/CMakeLists.txt run_test.pl rtps_disc
[Details] 2026-10-08 23:02:35: ERROR: publisher finished and returned 1
[Details] 2026-10-08 23:02:35: ERROR: subscriber finished and returned 1
[Details] test FAILED (success).
tests/DCPS/Messenger/CMakeLists.txt run_test.pl rtps_disc_tcp
[Details] 2026-10-08 23:02:36: ERROR: publisher finished and returned 1
[Details] 2026-10-08 23:02:36: ERROR: subscriber finished and returned 1
[Details] test FAILED (success).
tests/DCPS/Messenger/CMakeLists.txt run_test.pl rtps_disc_tcp thread_per
[Details] 2026-10-08 23:02:36: ERROR: publisher finished and returned 1
[Details] 2026-10-08 23:02:36: ERROR: subscriber finished and returned 1
[Details] test FAILED (success).
tests/DCPS/Messenger/CMakeLists.txt run_test.pl rtps_disc_tcp_udp
[Details] 2026-10-08 23:02:36: ERROR: publisher finished and returned 1
[Details] 2026-10-08 23:02:36: ERROR: subscriber finished and returned 1
[Details] test FAILED (success).
tests/DCPS/Messenger/CMakeLists.txt run_test.pl rtps_disc_half_sec_pub
[Details] 2026-10-08 23:02:36: ERROR: publisher finished and returned 1
[Details] 2026-10-08 23:02:36: ERROR: subscriber finished and returned 1
[Details] test FAILED (success).
tests/DCPS/Messenger/CMakeLists.txt run_test.pl rtps_disc_half_sec_sub
[Details] 2026-10-08 23:02:36: ERROR: publisher finished and returned 1
[Details] 2026-10-08 23:02:36: ERROR: subscriber finished and returned 1
[Details] test FAILED (success).
tests/DCPS/Messenger/CMakeLists.txt run_test.pl rtps_disc_sec
[Details] 2026-10-08 23:02:36: ERROR: publisher finished and returned 1
[Details] 2026-10-08 23:02:36: ERROR: subscriber finished and returned 1
[Details] test FAILED (success).
tests/DCPS/C++11/Messenger/CMakeLists.txt run_test.pl
[Details] ERROR: waiting for /var/lib/jenkins/workspace/OpenDDS_ACE8_Ubuntu_22_04_GCC16_x64_Debug/bin/DCPSInfoRepo IOR file
[Details] test FAILED (init_error finish_error).
[Details] ERROR: </var/lib/jenkins/workspace/OpenDDS_ACE8_Ubuntu_22_04_GCC16_x64_Debug/bin/DCPSInfoRepo> still running upon object destruction