Daily Build Log (Brief)


Compile


/var/lib/jenkins/workspace/OpenDDS_ACE8_Ubuntu_22_04_Clang23_x64_Debug/tests/FACE/Compiler/idl_test2_lib/GNUmakefile.FACE_idl_test2_lib

[Details] /var/lib/jenkins/workspace/OpenDDS_ACE8_Ubuntu_22_04_Clang23_x64_Debug/tests/FACE/Compiler/idl_test1_lib/FooDefTypeSupportImpl.cpp:903:39: warning: first argument in call to 'memset' is a pointer to non-trivially copyable type 'enumunion::UnionType' [-Wnontrivial-memcall]
[Details] /var/lib/jenkins/workspace/OpenDDS_ACE8_Ubuntu_22_04_Clang23_x64_Debug/tests/FACE/Compiler/idl_test1_lib/FooDefTypeSupportImpl.cpp:903:39: note: explicitly cast the pointer to silence this warning
[Details] /var/lib/jenkins/workspace/OpenDDS_ACE8_Ubuntu_22_04_Clang23_x64_Debug/tests/FACE/Compiler/idl_test1_lib/FooDefTypeSupportImpl.cpp:9728:33: warning: first argument in call to 'memset' is a pointer to non-trivially copyable type 'Xyz::AUnion' [-Wnontrivial-memcall]
[Details] /var/lib/jenkins/workspace/OpenDDS_ACE8_Ubuntu_22_04_Clang23_x64_Debug/tests/FACE/Compiler/idl_test1_lib/FooDefTypeSupportImpl.cpp:9728:33: note: explicitly cast the pointer to silence this warning
[Details] /var/lib/jenkins/workspace/OpenDDS_ACE8_Ubuntu_22_04_Clang23_x64_Debug/tests/FACE/Compiler/idl_test1_lib/FooDefTypeSupportImpl.cpp:19764:39: warning: first argument in call to 'memset' is a pointer to non-trivially copyable type 'Xyz::TestUnion' [-Wnontrivial-memcall]
[Details] /var/lib/jenkins/workspace/OpenDDS_ACE8_Ubuntu_22_04_Clang23_x64_Debug/tests/FACE/Compiler/idl_test1_lib/FooDefTypeSupportImpl.cpp:19764:39: note: explicitly cast the pointer to silence this warning
[Details] /var/lib/jenkins/workspace/OpenDDS_ACE8_Ubuntu_22_04_Clang23_x64_Debug/tests/FACE/Compiler/idl_test1_lib/FooDefTypeSupportImpl.cpp:20373:41: warning: first argument in call to 'memset' is a pointer to non-trivially copyable type 'Xyz::TestUnion2' [-Wnontrivial-memcall]
[Details] /var/lib/jenkins/workspace/OpenDDS_ACE8_Ubuntu_22_04_Clang23_x64_Debug/tests/FACE/Compiler/idl_test1_lib/FooDefTypeSupportImpl.cpp:20373:41: note: explicitly cast the pointer to silence this warning
[Details] /var/lib/jenkins/workspace/OpenDDS_ACE8_Ubuntu_22_04_Clang23_x64_Debug/tests/FACE/Compiler/idl_test1_lib/FooDefTypeSupportImpl.cpp:20974:41: warning: first argument in call to 'memset' is a pointer to non-trivially copyable type 'Xyz::TestUnion3' [-Wnontrivial-memcall]
[Details] /var/lib/jenkins/workspace/OpenDDS_ACE8_Ubuntu_22_04_Clang23_x64_Debug/tests/FACE/Compiler/idl_test1_lib/FooDefTypeSupportImpl.cpp:20974:41: note: explicitly cast the pointer to silence this warning
[Details] /var/lib/jenkins/workspace/OpenDDS_ACE8_Ubuntu_22_04_Clang23_x64_Debug/tests/FACE/Compiler/idl_test1_lib/FooDefTypeSupportImpl.cpp:21562:41: warning: first argument in call to 'memset' is a pointer to non-trivially copyable type 'Xyz::TestUnion4' [-Wnontrivial-memcall]
[Details] /var/lib/jenkins/workspace/OpenDDS_ACE8_Ubuntu_22_04_Clang23_x64_Debug/tests/FACE/Compiler/idl_test1_lib/FooDefTypeSupportImpl.cpp:21562:41: note: explicitly cast the pointer to silence this warning
[Details] /var/lib/jenkins/workspace/OpenDDS_ACE8_Ubuntu_22_04_Clang23_x64_Debug/tests/FACE/Compiler/idl_test1_lib/FooDefTypeSupportImpl.cpp:22202:41: warning: first argument in call to 'memset' is a pointer to non-trivially copyable type 'Xyz::TestUnion5' [-Wnontrivial-memcall]
[Details] /var/lib/jenkins/workspace/OpenDDS_ACE8_Ubuntu_22_04_Clang23_x64_Debug/tests/FACE/Compiler/idl_test1_lib/FooDefTypeSupportImpl.cpp:22202:41: note: explicitly cast the pointer to silence this warning
[Details] /var/lib/jenkins/workspace/OpenDDS_ACE8_Ubuntu_22_04_Clang23_x64_Debug/tests/FACE/Compiler/idl_test1_lib/FooDefTypeSupportImpl.cpp:22852:41: warning: first argument in call to 'memset' is a pointer to non-trivially copyable type 'Xyz::TestUnion6' [-Wnontrivial-memcall]
[Details] /var/lib/jenkins/workspace/OpenDDS_ACE8_Ubuntu_22_04_Clang23_x64_Debug/tests/FACE/Compiler/idl_test1_lib/FooDefTypeSupportImpl.cpp:22852:41: note: explicitly cast the pointer to silence this warning
[Details] /var/lib/jenkins/workspace/OpenDDS_ACE8_Ubuntu_22_04_Clang23_x64_Debug/tests/FACE/Compiler/idl_test1_lib/FooDefTypeSupportImpl.cpp:28781:27: warning: first argument in call to 'memset' is a pointer to non-trivially copyable type 'B85' [-Wnontrivial-memcall]
[Details] /var/lib/jenkins/workspace/OpenDDS_ACE8_Ubuntu_22_04_Clang23_x64_Debug/tests/FACE/Compiler/idl_test1_lib/FooDefTypeSupportImpl.cpp:28781:27: note: explicitly cast the pointer to silence this warning
[Details] /var/lib/jenkins/workspace/OpenDDS_ACE8_Ubuntu_22_04_Clang23_x64_Debug/tests/FACE/Compiler/idl_test1_lib/FooDefTypeSupportImpl.cpp:29679:27: warning: first argument in call to 'memset' is a pointer to non-trivially copyable type 'B86' [-Wnontrivial-memcall]
[Details] /var/lib/jenkins/workspace/OpenDDS_ACE8_Ubuntu_22_04_Clang23_x64_Debug/tests/FACE/Compiler/idl_test1_lib/FooDefTypeSupportImpl.cpp:29679:27: note: explicitly cast the pointer to silence this warning
[Details] /var/lib/jenkins/workspace/OpenDDS_ACE8_Ubuntu_22_04_Clang23_x64_Debug/tests/FACE/Compiler/idl_test1_lib/FooDefTypeSupportImpl.cpp:30573:27: warning: first argument in call to 'memset' is a pointer to non-trivially copyable type 'B87' [-Wnontrivial-memcall]
[Details] /var/lib/jenkins/workspace/OpenDDS_ACE8_Ubuntu_22_04_Clang23_x64_Debug/tests/FACE/Compiler/idl_test1_lib/FooDefTypeSupportImpl.cpp:30573:27: note: explicitly cast the pointer to silence this warning
[Details] /var/lib/jenkins/workspace/OpenDDS_ACE8_Ubuntu_22_04_Clang23_x64_Debug/tests/FACE/Compiler/idl_test1_lib/FooDefTypeSupportImpl.cpp:31467:27: warning: first argument in call to 'memset' is a pointer to non-trivially copyable type 'B88' [-Wnontrivial-memcall]
[Details] /var/lib/jenkins/workspace/OpenDDS_ACE8_Ubuntu_22_04_Clang23_x64_Debug/tests/FACE/Compiler/idl_test1_lib/FooDefTypeSupportImpl.cpp:31467:27: note: explicitly cast the pointer to silence this warning
[Details] 12 warnings generated.

/var/lib/jenkins/workspace/OpenDDS_ACE8_Ubuntu_22_04_Clang23_x64_Debug/tests/FACE/Conformance/GNUmakefile.FaceConformanceIdl

[Details] /var/lib/jenkins/workspace/OpenDDS_ACE8_Ubuntu_22_04_Clang23_x64_Debug/tests/FACE/Compiler/idl_test3_lib/FooDefTypeSupportImpl.cpp:18389:71: warning: first argument in call to 'memset' is a pointer to non-trivially copyable type 'Xyz::UnionOfTypedefsOfTypedefs' [-Wnontrivial-memcall]
[Details] /var/lib/jenkins/workspace/OpenDDS_ACE8_Ubuntu_22_04_Clang23_x64_Debug/tests/FACE/Compiler/idl_test3_lib/FooDefTypeSupportImpl.cpp:18389:71: note: explicitly cast the pointer to silence this warning
[Details] /var/lib/jenkins/workspace/OpenDDS_ACE8_Ubuntu_22_04_Clang23_x64_Debug/tests/FACE/Compiler/idl_test3_lib/FooDefTypeSupportImpl.cpp:28142:33: warning: first argument in call to 'memset' is a pointer to non-trivially copyable type 'Xyz::AUnion' [-Wnontrivial-memcall]
[Details] /var/lib/jenkins/workspace/OpenDDS_ACE8_Ubuntu_22_04_Clang23_x64_Debug/tests/FACE/Compiler/idl_test3_lib/FooDefTypeSupportImpl.cpp:28142:33: note: explicitly cast the pointer to silence this warning
[Details] /var/lib/jenkins/workspace/OpenDDS_ACE8_Ubuntu_22_04_Clang23_x64_Debug/tests/FACE/Compiler/idl_test3_lib/FooDefTypeSupportImpl.cpp:33410:37: warning: first argument in call to 'memset' is a pointer to non-trivially copyable type 'Xyz::BigUnion' [-Wnontrivial-memcall]
[Details] /var/lib/jenkins/workspace/OpenDDS_ACE8_Ubuntu_22_04_Clang23_x64_Debug/tests/FACE/Compiler/idl_test3_lib/FooDefTypeSupportImpl.cpp:33410:37: note: explicitly cast the pointer to silence this warning

/var/lib/jenkins/workspace/OpenDDS_ACE8_Ubuntu_22_04_Clang23_x64_Debug/tests/FACE/Header/Idl/GNUmakefile.FaceHeaderTestIdl

[Details] 3 warnings generated.

Test


tests/DCPS/Compiler/vread_vwrite/run_test.pl

[Details] [ FAILED ] VreadVwriteTest.DynamicSerializeTest (1 ms)
[Details] [ FAILED ] VreadVwriteTest.DynamicWithOptionalTest (0 ms)
[Details] [ FAILED ] 2 tests, listed below:
[Details] [ FAILED ] VreadVwriteTest.DynamicSerializeTest
[Details] [ FAILED ] VreadVwriteTest.DynamicWithOptionalTest
[Details] 2 FAILED TESTS
[Details] ERROR: VreadVwriteTest returned 1
[Details] test FAILED
[Details] auto_run_tests.pl: ERROR: "tests/DCPS/Compiler/vread_vwrite/run_test.pl" returned with status 1

tests/unit-tests/run_test.pl

[Details] [ FAILED ] dds_DCPS_XTypes_DynamicDataImpl.Mutable_WriteRecursiveStruct (1 ms)
[Details] [ FAILED ] dds_DCPS_XTypes_DynamicDataImpl.Mutable_WriteKeyOnly (1 ms)
[Details] [ FAILED ] dds_DCPS_XTypes_DynamicDataImpl.Nested_WriteKeyOnly (1 ms)
[Details] [ FAILED ] dds_DCPS_XTypes_DynamicDataImpl.String_As_Enum (0 ms)
[Details] (770891|770891) ERROR: dynamic_data_json: unknown member id in XmlTypeProviderTest::Sample at $
[Details] (770891|770891) ERROR: dynamic_data_json: failed to populate DynamicData for XmlTypeProviderTest::Sample
[Details] ERROR: <UnitTests> exited with coredump from signal 11 : SEGV
[Details] 2026-10-08 18:43:15: ERROR: UnitTests terminated with a signal
[Details] test FAILED (success).
[Details] auto_run_tests.pl: ERROR: "tests/unit-tests/run_test.pl" returned with status 1

tests/DCPS/FilterExpression/run_test.pl

[Details] ERROR: <FilterExpressionTest> exited with coredump from signal 11 : SEGV
[Details] ERROR: test returned 255
[Details] auto_run_tests.pl: ERROR: "tests/DCPS/FilterExpression/run_test.pl" returned with status 1

tests/DCPS/QueryCondition/run_test.pl rtps_disc dynamic

[Details] ERROR: <QueryConditionTest> exited with coredump from signal 11 : SEGV
[Details] ERROR: test returned 255
[Details] auto_run_tests.pl: ERROR: "tests/DCPS/QueryCondition/run_test.pl rtps_disc dynamic" returned with status 1

tests/DCPS/ContentFilteredTopic/run_test.pl rtps_disc dynamic

[Details] ERROR: ContentFilteredTopicTest timedout
======= Begin stuck stacks =======
[New LWP 773846]
[New LWP 773847]
[New LWP 773848]
[New LWP 773849]
[New LWP 773850]
[New LWP 773851]
[New LWP 773852]
[New LWP 773853]
[New LWP 773854]
[New LWP 773855]
[New LWP 773856]
[New LWP 773857]
[Thread debugging using libthread_db enabled]
Using host libthread_db library "/lib/x86_64-linux-gnu/libthread_db.so.1".
__futex_abstimed_wait_common64 (private=0, cancel=true, abstime=0x0, op=393, expected=0, futex_word=0x5e2b22662130) at ./nptl/futex-internal.c:57
57 ./nptl/futex-internal.c: No such file or directory.

Thread 13 (Thread 0x7a5427fff640 (LWP 773857) "ContentFiltered"):
#0 0x00007a545a71b78d in __GI___select (nfds=24, readfds=0x5e2b22785468, writefds=0x0, exceptfds=0x0, timeout=0x0) at ../sysdeps/unix/sysv/linux/select.c:69
#1 0x00007a545c4fa19d in ACE_OS::select (width=24, rfds=0x5e2b22785468, wfds=0x0, efds=0x0, timeout=0x0) at /var/lib/jenkins/workspace/ACE_TAO_Ubuntu_22_04_Clang23_x64_Debug/ACE/ace/OS_NS_sys_select.inl:41
#2 0x00007a545c4f4d94 in ACE_Select_Reactor_T<ACE_Reactor_Token_T<ACE_Token> >::wait_for_multiple_events (this=0x5e2b22785420, dispatch_set=..., max_wait_time=0x0) at /var/lib/jenkins/workspace/ACE_TAO_Ubuntu_22_04_Clang23_x64_Debug/ACE/ace/Select_Reactor_T.cpp:1104
#3 0x00007a545c4fa4d8 in ACE_Select_Reactor_T<ACE_Reactor_Token_T<ACE_Token> >::handle_events_i (this=0x5e2b22785420, max_wait_time=0x0) at /var/lib/jenkins/workspace/ACE_TAO_Ubuntu_22_04_Clang23_x64_Debug/ACE/ace/Select_Reactor_T.cpp:1453
#4 0x00007a545c4f24fa in ACE_Select_Reactor_T<ACE_Reactor_Token_T<ACE_Token> >::handle_events (this=0x5e2b22785420, max_wait_time=0x0) at /var/lib/jenkins/workspace/ACE_TAO_Ubuntu_22_04_Clang23_x64_Debug/ACE/ace/Select_Reactor_T.cpp:1433
#5 0x00007a545abf121f in ACE_Reactor::run_reactor_event_loop (this=0x5e2b22783de0, eh=0x0) at /var/lib/jenkins/workspace/ACE_TAO_Ubuntu_22_04_Clang23_x64_Debug/ACE/ace/Reactor.cpp:192
#6 0x00007a545c4ebc22 in OpenDDS::DCPS::ReactorTask::svc (this=0x5e2b22784900) at DCPS/ReactorTask.cpp:234
#7 0x00007a545ac1a161 in ACE_Task_Base::svc_run (args=0x5e2b22784b08) at /var/lib/jenkins/workspace/ACE_TAO_Ubuntu_22_04_Clang23_x64_Debug/ACE/ace/Task.cpp:269
#8 0x00007a545ac1a8fc in ACE_Thread_Adapter::invoke_i (this=0x5e2b22773700) at /var/lib/jenkins/workspace/ACE_TAO_Ubuntu_22_04_Clang23_x64_Debug/ACE/ace/Thread_Adapter.cpp:143
#9 0x00007a545ac1a7f4 in ACE_Thread_Adapter::invoke (this=0x5e2b22773700) at /var/lib/jenkins/workspace/ACE_TAO_Ubuntu_22_04_Clang23_x64_Debug/ACE/ace/Thread_Adapter.cpp:94
#10 0x00007a545ab5d93e in ace_thread_adapter (args=0x5e2b22773700) at /var/lib/jenkins/workspace/ACE_TAO_Ubuntu_22_04_Clang23_x64_Debug/ACE/ace/Base_Thread_Adapter.cpp:116
#11 0x00007a545a694a83 in start_thread (arg=<optimized out>) at ./nptl/pthread_create.c:442
#12 0x00007a545a7268e0 in clone3 () at ../sysdeps/unix/sysv/linux/x86_64/clone3.S:81

Thread 12 (Thread 0x7a5448ff9640 (LWP 773856) "ContentFiltered"):
#0 __futex_abstimed_wait_common64 (private=0, cancel=true, abstime=0x0, op=393, expected=0, futex_word=0x5e2b227827b4) at ./nptl/futex-internal.c:57
#1 __futex_abstimed_wait_common (cancel=true, private=0, abstime=0x0, clockid=0, expected=0, futex_word=0x5e2b227827b4) at ./nptl/futex-internal.c:87
#2 __GI___futex_abstimed_wait_cancelable64 (futex_word=futex_word@entry=0x5e2b227827b4, expected=expected@entry=0, clockid=clockid@entry=0, abstime=abstime@entry=0x0, private=private@entry=0) at ./nptl/futex-internal.c:139
#3 0x00007a545a693a01 in __pthread_cond_wait_common (abstime=0x0, clockid=0, mutex=0x5e2b22782758, cond=0x5e2b22782788) at ./nptl/pthread_cond_wait.c:503
#4 ___pthread_cond_wait (cond=0x5e2b22782788, mutex=0x5e2b22782758) at ./nptl/pthread_cond_wait.c:627
#5 0x00007a545ab6f73d in ACE_OS::cond_wait (cv=0x5e2b22782788, external_mutex=0x5e2b22782758) at ../ace/OS_NS_Thread.inl:370
#6 0x00007a545ab6fb89 in ACE_Condition<ACE_Thread_Mutex>::wait (this=0x5e2b22782788) at /var/lib/jenkins/workspace/ACE_TAO_Ubuntu_22_04_Clang23_x64_Debug/ACE/ace/Condition_Thread_Mutex.cpp:84
#7 0x00007a545d710e6e in OpenDDS::DCPS::ConditionVariable<ACE_Thread_Mutex>::wait (this=0x5e2b22782788, thread_status_manager=...) at /var/lib/jenkins/workspace/OpenDDS_ACE8_Ubuntu_22_04_Clang23_x64_Debug/dds/DCPS/ConditionVariable.h:56
#8 0x00007a545c42120b in OpenDDS::DCPS::DispatchService::run_event_loop (this=0x5e2b22782740) at DCPS/DispatchService.cpp:201
#9 0x00007a545c42016d in OpenDDS::DCPS::DispatchService::run (arg=0x5e2b22782740) at DCPS/DispatchService.cpp:161
#10 0x00007a545c5791d8 in OpenDDS::DCPS::ThreadPool::run (arg=0x5e2b22782840) at DCPS/ThreadPool.cpp:64
#11 0x00007a545abca1e5 in ACE_OS_Thread_Adapter::invoke (this=0x5e2b22775430) at /var/lib/jenkins/workspace/ACE_TAO_Ubuntu_22_04_Clang23_x64_Debug/ACE/ace/OS_Thread_Adapter.cpp:90
#12 0x00007a545ab5d93e in ace_thread_adapter (args=0x5e2b22775430) at /var/lib/jenkins/workspace/ACE_TAO_Ubuntu_22_04_Clang23_x64_Debug/ACE/ace/Base_Thread_Adapter.cpp:116
#13 0x00007a545a694a83 in start_thread (arg=<optimized out>) at ./nptl/pthread_create.c:442
#14 0x00007a545a7268e0 in clone3 () at ../sysdeps/unix/sysv/linux/x86_64/clone3.S:81

Thread 11 (Thread 0x7a54497fa640 (LWP 773855) "ContentFiltered"):
#0 0x00007a545a71b78d in __GI___select (nfds=21, readfds=0x5e2b22764268, writefds=0x0, exceptfds=0x0, timeout=0x0) at ../sysdeps/unix/sysv/linux/select.c:69
#1 0x00007a545c4fa19d in ACE_OS::select (width=21, rfds=0x5e2b22764268, wfds=0x0, efds=0x0, timeout=0x0) at /var/lib/jenkins/workspace/ACE_TAO_Ubuntu_22_04_Clang23_x64_Debug/ACE/ace/OS_NS_sys_select.inl:41
#2 0x00007a545c4f4d94 in ACE_Select_Reactor_T<ACE_Reactor_Token_T<ACE_Token> >::wait_for_multiple_events (this=0x5e2b22764220, dispatch_set=..., max_wait_time=0x0) at /var/lib/jenkins/workspace/ACE_TAO_Ubuntu_22_04_Clang23_x64_Debug/ACE/ace/Select_Reactor_T.cpp:1104
#3 0x00007a545c4fa4d8 in ACE_Select_Reactor_T<ACE_Reactor_Token_T<ACE_Token> >::handle_events_i (this=0x5e2b22764220, max_wait_time=0x0) at /var/lib/jenkins/workspace/ACE_TAO_Ubuntu_22_04_Clang23_x64_Debug/ACE/ace/Select_Reactor_T.cpp:1453
#4 0x00007a545c4f24fa in ACE_Select_Reactor_T<ACE_Reactor_Token_T<ACE_Token> >::handle_events (this=0x5e2b22764220, max_wait_time=0x0) at /var/lib/jenkins/workspace/ACE_TAO_Ubuntu_22_04_Clang23_x64_Debug/ACE/ace/Select_Reactor_T.cpp:1433
#5 0x00007a545abf121f in ACE_Reactor::run_reactor_event_loop (this=0x5e2b22762c20, eh=0x0) at /var/lib/jenkins/workspace/ACE_TAO_Ubuntu_22_04_Clang23_x64_Debug/ACE/ace/Reactor.cpp:192
#6 0x00007a545c4ebc22 in OpenDDS::DCPS::ReactorTask::svc (this=0x5e2b22763700) at DCPS/ReactorTask.cpp:234
#7 0x00007a545ac1a161 in ACE_Task_Base::svc_run (args=0x5e2b22763908) at /var/lib/jenkins/workspace/ACE_TAO_Ubuntu_22_04_Clang23_x64_Debug/ACE/ace/Task.cpp:269
#8 0x00007a545ac1a8fc in ACE_Thread_Adapter::invoke_i (this=0x5e2b22746bf0) at /var/lib/jenkins/workspace/ACE_TAO_Ubuntu_22_04_Clang23_x64_Debug/ACE/ace/Thread_Adapter.cpp:143
#9 0x00007a545ac1a7f4 in ACE_Thread_Adapter::invoke (this=0x5e2b22746bf0) at /var/lib/jenkins/workspace/ACE_TAO_Ubuntu_22_04_Clang23_x64_Debug/ACE/ace/Thread_Adapter.cpp:94
#10 0x00007a545ab5d93e in ace_thread_adapter (args=0x5e2b22746bf0) at /var/lib/jenkins/workspace/ACE_TAO_Ubuntu_22_04_Clang23_x64_Debug/ACE/ace/Base_Thread_Adapter.cpp:116
#11 0x00007a545a694a83 in start_thread (arg=<optimized out>) at ./nptl/pthread_create.c:442
#12 0x00007a545a7268e0 in clone3 () at ../sysdeps/unix/sysv/linux/x86_64/clone3.S:81

Thread 10 (Thread 0x7a5449ffb640 (LWP 773854) "ContentFiltered"):
#0 __futex_abstimed_wait_common64 (private=0, cancel=true, abstime=0x0, op=393, expected=0, futex_word=0x5e2b22761784) at ./nptl/futex-internal.c:57
#1 __futex_abstimed_wait_common (cancel=true, private=0, abstime=0x0, clockid=0, expected=0, futex_word=0x5e2b22761784) at ./nptl/futex-internal.c:87
#2 __GI___futex_abstimed_wait_cancelable64 (futex_word=futex_word@entry=0x5e2b22761784, expected=expected@entry=0, clockid=clockid@entry=0, abstime=abstime@entry=0x0, private=private@entry=0) at ./nptl/futex-internal.c:139
#3 0x00007a545a693a01 in __pthread_cond_wait_common (abstime=0x0, clockid=0, mutex=0x5e2b22761728, cond=0x5e2b22761758) at ./nptl/pthread_cond_wait.c:503
#4 ___pthread_cond_wait (cond=0x5e2b22761758, mutex=0x5e2b22761728) at ./nptl/pthread_cond_wait.c:627
#5 0x00007a545ab6f73d in ACE_OS::cond_wait (cv=0x5e2b22761758, external_mutex=0x5e2b22761728) at ../ace/OS_NS_Thread.inl:370
#6 0x00007a545ab6fb89 in ACE_Condition<ACE_Thread_Mutex>::wait (this=0x5e2b22761758) at /var/lib/jenkins/workspace/ACE_TAO_Ubuntu_22_04_Clang23_x64_Debug/ACE/ace/Condition_Thread_Mutex.cpp:84
#7 0x00007a545d710e6e in OpenDDS::DCPS::ConditionVariable<ACE_Thread_Mutex>::wait (this=0x5e2b22761758, thread_status_manager=...) at /var/lib/jenkins/workspace/OpenDDS_ACE8_Ubuntu_22_04_Clang23_x64_Debug/dds/DCPS/ConditionVariable.h:56
#8 0x00007a545c42120b in OpenDDS::DCPS::DispatchService::run_event_loop (this=0x5e2b22761710) at DCPS/DispatchService.cpp:201
#9 0x00007a545c42016d in OpenDDS::DCPS::DispatchService::run (arg=0x5e2b22761710) at DCPS/DispatchService.cpp:161
#10 0x00007a545c5791d8 in OpenDDS::DCPS::ThreadPool::run (arg=0x5e2b22761810) at DCPS/ThreadPool.cpp:64
#11 0x00007a545abca1e5 in ACE_OS_Thread_Adapter::invoke (this=0x5e2b227470e0) at /var/lib/jenkins/workspace/ACE_TAO_Ubuntu_22_04_Clang23_x64_Debug/ACE/ace/OS_Thread_Adapter.cpp:90
#12 0x00007a545ab5d93e in ace_thread_adapter (args=0x5e2b227470e0) at /var/lib/jenkins/workspace/ACE_TAO_Ubuntu_22_04_Clang23_x64_Debug/ACE/ace/Base_Thread_Adapter.cpp:116
#13 0x00007a545a694a83 in start_thread (arg=<optimized out>) at ./nptl/pthread_create.c:442
#14 0x00007a545a7268e0 in clone3 () at ../sysdeps/unix/sysv/linux/x86_64/clone3.S:81

Thread 9 (Thread 0x7a544a7fc640 (LWP 773853) "ContentFiltered"):
#0 0x00007a545a71b78d in __GI___select (nfds=18, readfds=0x5e2b22737388, writefds=0x0, exceptfds=0x0, timeout=0x0) at ../sysdeps/unix/sysv/linux/select.c:69
#1 0x00007a545c4fa19d in ACE_OS::select (width=18, rfds=0x5e2b22737388, wfds=0x0, efds=0x0, timeout=0x0) at /var/lib/jenkins/workspace/ACE_TAO_Ubuntu_22_04_Clang23_x64_Debug/ACE/ace/OS_NS_sys_select.inl:41
#2 0x00007a545c4f4d94 in ACE_Select_Reactor_T<ACE_Reactor_Token_T<ACE_Token> >::wait_for_multiple_events (this=0x5e2b22737340, dispatch_set=..., max_wait_time=0x0) at /var/lib/jenkins/workspace/ACE_TAO_Ubuntu_22_04_Clang23_x64_Debug/ACE/ace/Select_Reactor_T.cpp:1104
#3 0x00007a545c4fa4d8 in ACE_Select_Reactor_T<ACE_Reactor_Token_T<ACE_Token> >::handle_events_i (this=0x5e2b22737340, max_wait_time=0x0) at /var/lib/jenkins/workspace/ACE_TAO_Ubuntu_22_04_Clang23_x64_Debug/ACE/ace/Select_Reactor_T.cpp:1453
#4 0x00007a545c4f24fa in ACE_Select_Reactor_T<ACE_Reactor_Token_T<ACE_Token> >::handle_events (this=0x5e2b22737340, max_wait_time=0x0) at /var/lib/jenkins/workspace/ACE_TAO_Ubuntu_22_04_Clang23_x64_Debug/ACE/ace/Select_Reactor_T.cpp:1433
#5 0x00007a545abf121f in ACE_Reactor::run_reactor_event_loop (this=0x5e2b227236a0, eh=0x0) at /var/lib/jenkins/workspace/ACE_TAO_Ubuntu_22_04_Clang23_x64_Debug/ACE/ace/Reactor.cpp:192
#6 0x00007a545c4ebc22 in OpenDDS::DCPS::ReactorTask::svc (this=0x5e2b22736820) at DCPS/ReactorTask.cpp:234
#7 0x00007a545ac1a161 in ACE_Task_Base::svc_run (args=0x5e2b22736a28) at /var/lib/jenkins/workspace/ACE_TAO_Ubuntu_22_04_Clang23_x64_Debug/ACE/ace/Task.cpp:269
#8 0x00007a545ac1a8fc in ACE_Thread_Adapter::invoke_i (this=0x5e2b22735700) at /var/lib/jenkins/workspace/ACE_TAO_Ubuntu_22_04_Clang23_x64_Debug/ACE/ace/Thread_Adapter.cpp:143
#9 0x00007a545ac1a7f4 in ACE_Thread_Adapter::invoke (this=0x5e2b22735700) at /var/lib/jenkins/workspace/ACE_TAO_Ubuntu_22_04_Clang23_x64_Debug/ACE/ace/Thread_Adapter.cpp:94
#10 0x00007a545ab5d93e in ace_thread_adapter (args=0x5e2b22735700) at /var/lib/jenkins/workspace/ACE_TAO_Ubuntu_22_04_Clang23_x64_Debug/ACE/ace/Base_Thread_Adapter.cpp:116
#11 0x00007a545a694a83 in start_thread (arg=<optimized out>) at ./nptl/pthread_create.c:442
#12 0x00007a545a7268e0 in clone3 () at ../sysdeps/unix/sysv/linux/x86_64/clone3.S:81

Thread 8 (Thread 0x7a544affd640 (LWP 773852) "ContentFiltered"):
#0 __futex_abstimed_wait_common64 (private=0, cancel=true, abstime=0x0, op=393, expected=0, futex_word=0x5e2b22734ad4) at ./nptl/futex-internal.c:57
#1 __futex_abstimed_wait_common (cancel=true, private=0, abstime=0x0, clockid=0, expected=0, futex_word=0x5e2b22734ad4) at ./nptl/futex-internal.c:87
#2 __GI___futex_abstimed_wait_cancelable64 (futex_word=futex_word@entry=0x5e2b22734ad4, expected=expected@entry=0, clockid=clockid@entry=0, abstime=abstime@entry=0x0, private=private@entry=0) at ./nptl/futex-internal.c:139
#3 0x00007a545a693a01 in __pthread_cond_wait_common (abstime=0x0, clockid=0, mutex=0x5e2b22734a78, cond=0x5e2b22734aa8) at ./nptl/pthread_cond_wait.c:503
#4 ___pthread_cond_wait (cond=0x5e2b22734aa8, mutex=0x5e2b22734a78) at ./nptl/pthread_cond_wait.c:627
#5 0x00007a545ab6f73d in ACE_OS::cond_wait (cv=0x5e2b22734aa8, external_mutex=0x5e2b22734a78) at ../ace/OS_NS_Thread.inl:370
#6 0x00007a545ab6fb89 in ACE_Condition<ACE_Thread_Mutex>::wait (this=0x5e2b22734aa8) at /var/lib/jenkins/workspace/ACE_TAO_Ubuntu_22_04_Clang23_x64_Debug/ACE/ace/Condition_Thread_Mutex.cpp:84
#7 0x00007a545d710e6e in OpenDDS::DCPS::ConditionVariable<ACE_Thread_Mutex>::wait (this=0x5e2b22734aa8, thread_status_manager=...) at /var/lib/jenkins/workspace/OpenDDS_ACE8_Ubuntu_22_04_Clang23_x64_Debug/dds/DCPS/ConditionVariable.h:56
#8 0x00007a545c42120b in OpenDDS::DCPS::DispatchService::run_event_loop (this=0x5e2b22734a60) at DCPS/DispatchService.cpp:201
#9 0x00007a545c42016d in OpenDDS::DCPS::DispatchService::run (arg=0x5e2b22734a60) at DCPS/DispatchService.cpp:161
#10 0x00007a545c5791d8 in OpenDDS::DCPS::ThreadPool::run (arg=0x5e2b22734b60) at DCPS/ThreadPool.cpp:64
#11 0x00007a545abca1e5 in ACE_OS_Thread_Adapter::invoke (this=0x5e2b22734920) at /var/lib/jenkins/workspace/ACE_TAO_Ubuntu_22_04_Clang23_x64_Debug/ACE/ace/OS_Thread_Adapter.cpp:90
#12 0x00007a545ab5d93e in ace_thread_adapter (args=0x5e2b22734920) at /var/lib/jenkins/workspace/ACE_TAO_Ubuntu_22_04_Clang23_x64_Debug/ACE/ace/Base_Thread_Adapter.cpp:116
#13 0x00007a545a694a83 in start_thread (arg=<optimized out>) at ./nptl/pthread_create.c:442
#14 0x00007a545a7268e0 in clone3 () at ../sysdeps/unix/sysv/linux/x86_64/clone3.S:81

Thread 7 (Thread 0x7a544b7fe640 (LWP 773851) "ContentFiltered"):
#0 0x00007a545a71b78d in __GI___select (nfds=16, readfds=0x5e2b226ef168, writefds=0x0, exceptfds=0x0, timeout=0x0) at ../sysdeps/unix/sysv/linux/select.c:69
#1 0x00007a545c4fa19d in ACE_OS::select (width=16, rfds=0x5e2b226ef168, wfds=0x0, efds=0x0, timeout=0x0) at /var/lib/jenkins/workspace/ACE_TAO_Ubuntu_22_04_Clang23_x64_Debug/ACE/ace/OS_NS_sys_select.inl:41
#2 0x00007a545c4f4d94 in ACE_Select_Reactor_T<ACE_Reactor_Token_T<ACE_Token> >::wait_for_multiple_events (this=0x5e2b226ef120, dispatch_set=..., max_wait_time=0x0) at /var/lib/jenkins/workspace/ACE_TAO_Ubuntu_22_04_Clang23_x64_Debug/ACE/ace/Select_Reactor_T.cpp:1104
#3 0x00007a545c4fa4d8 in ACE_Select_Reactor_T<ACE_Reactor_Token_T<ACE_Token> >::handle_events_i (this=0x5e2b226ef120, max_wait_time=0x0) at /var/lib/jenkins/workspace/ACE_TAO_Ubuntu_22_04_Clang23_x64_Debug/ACE/ace/Select_Reactor_T.cpp:1453
#4 0x00007a545c4f24fa in ACE_Select_Reactor_T<ACE_Reactor_Token_T<ACE_Token> >::handle_events (this=0x5e2b226ef120, max_wait_time=0x0) at /var/lib/jenkins/workspace/ACE_TAO_Ubuntu_22_04_Clang23_x64_Debug/ACE/ace/Select_Reactor_T.cpp:1433
#5 0x00007a545abf121f in ACE_Reactor::run_reactor_event_loop (this=0x5e2b226ed520, eh=0x0) at /var/lib/jenkins/workspace/ACE_TAO_Ubuntu_22_04_Clang23_x64_Debug/ACE/ace/Reactor.cpp:192
#6 0x00007a545c4ebc22 in OpenDDS::DCPS::ReactorTask::svc (this=0x5e2b226ee600) at DCPS/ReactorTask.cpp:234
#7 0x00007a545ac1a161 in ACE_Task_Base::svc_run (args=0x5e2b226ee808) at /var/lib/jenkins/workspace/ACE_TAO_Ubuntu_22_04_Clang23_x64_Debug/ACE/ace/Task.cpp:269
#8 0x00007a545ac1a8fc in ACE_Thread_Adapter::invoke_i (this=0x5e2b226edff0) at /var/lib/jenkins/workspace/ACE_TAO_Ubuntu_22_04_Clang23_x64_Debug/ACE/ace/Thread_Adapter.cpp:143
#9 0x00007a545ac1a7f4 in ACE_Thread_Adapter::invoke (this=0x5e2b226edff0) at /var/lib/jenkins/workspace/ACE_TAO_Ubuntu_22_04_Clang23_x64_Debug/ACE/ace/Thread_Adapter.cpp:94
#10 0x00007a545ab5d93e in ace_thread_adapter (args=0x5e2b226edff0) at /var/lib/jenkins/workspace/ACE_TAO_Ubuntu_22_04_Clang23_x64_Debug/ACE/ace/Base_Thread_Adapter.cpp:116
#11 0x00007a545a694a83 in start_thread (arg=<optimized out>) at ./nptl/pthread_create.c:442
#12 0x00007a545a7268e0 in clone3 () at ../sysdeps/unix/sysv/linux/x86_64/clone3.S:81

Thread 6 (Thread 0x7a544bfff640 (LWP 773850) "ContentFiltered"):
#0 __futex_abstimed_wait_common64 (private=1275062696, cancel=true, abstime=0x7a544bffead0, op=137, expected=0, futex_word=0x5e2b226ebfa4) at ./nptl/futex-internal.c:57
#1 __futex_abstimed_wait_common (cancel=true, private=1275062696, abstime=0x7a544bffead0, clockid=1275062792, expected=0, futex_word=0x5e2b226ebfa4) at ./nptl/futex-internal.c:87
#2 __GI___futex_abstimed_wait_cancelable64 (futex_word=futex_word@entry=0x5e2b226ebfa4, expected=expected@entry=0, clockid=clockid@entry=1, abstime=abstime@entry=0x7a544bffead0, private=private@entry=0) at ./nptl/futex-internal.c:139
#3 0x00007a545a693e5b in __pthread_cond_wait_common (abstime=0x7a544bffead0, clockid=1, mutex=0x5e2b226ebf48, cond=0x5e2b226ebf78) at ./nptl/pthread_cond_wait.c:503
#4 ___pthread_cond_timedwait64 (cond=0x5e2b226ebf78, mutex=0x5e2b226ebf48, abstime=0x7a544bffead0) at ./nptl/pthread_cond_wait.c:652
#5 0x00007a545ab6f7ef in ACE_OS::cond_timedwait (cv=0x5e2b226ebf78, external_mutex=0x5e2b226ebf48, timeout=0x7a544bffec60) at ../ace/OS_NS_Thread.inl:401
#6 0x00007a545ab6fbc5 in ACE_Condition<ACE_Thread_Mutex>::wait (this=0x5e2b226ebf78, mutex=..., abstime=0x7a544bffec60) at /var/lib/jenkins/workspace/ACE_TAO_Ubuntu_22_04_Clang23_x64_Debug/ACE/ace/Condition_Thread_Mutex.cpp:92
#7 0x00007a545ab6fbf1 in ACE_Condition<ACE_Thread_Mutex>::wait (this=0x5e2b226ebf78, abstime=0x7a544bffec60) at /var/lib/jenkins/workspace/ACE_TAO_Ubuntu_22_04_Clang23_x64_Debug/ACE/ace/Condition_Thread_Mutex.cpp:101
#8 0x00007a545c4147c2 in OpenDDS::DCPS::ConditionVariable<ACE_Thread_Mutex>::wait_until (this=0x5e2b226ebf78, expire_at=..., thread_status_manager=...) at DCPS/ConditionVariable.h:72
#9 0x00007a545c4211ca in OpenDDS::DCPS::DispatchService::run_event_loop (this=0x5e2b226ebf30) at DCPS/DispatchService.cpp:199
#10 0x00007a545c42016d in OpenDDS::DCPS::DispatchService::run (arg=0x5e2b226ebf30) at DCPS/DispatchService.cpp:161
#11 0x00007a545c5791d8 in OpenDDS::DCPS::ThreadPool::run (arg=0x5e2b226ec030) at DCPS/ThreadPool.cpp:64
#12 0x00007a545abca1e5 in ACE_OS_Thread_Adapter::invoke (this=0x5e2b226e6060) at /var/lib/jenkins/workspace/ACE_TAO_Ubuntu_22_04_Clang23_x64_Debug/ACE/ace/OS_Thread_Adapter.cpp:90
#13 0x00007a545ab5d93e in ace_thread_adapter (args=0x5e2b226e6060) at /var/lib/jenkins/workspace/ACE_TAO_Ubuntu_22_04_Clang23_x64_Debug/ACE/ace/Base_Thread_Adapter.cpp:116
#14 0x00007a545a694a83 in start_thread (arg=<optimized out>) at ./nptl/pthread_create.c:442
#15 0x00007a545a7268e0 in clone3 () at ../sysdeps/unix/sysv/linux/x86_64/clone3.S:81

Thread 5 (Thread 0x7a5458dfc640 (LWP 773849) "ContentFiltered"):
#0 0x00007a545a71b78d in __GI___select (nfds=11, readfds=0x5e2b22632928, writefds=0x0, exceptfds=0x0, timeout=0x0) at ../sysdeps/unix/sysv/linux/select.c:69
#1 0x00007a545c4fa19d in ACE_OS::select (width=11, rfds=0x5e2b22632928, wfds=0x0, efds=0x0, timeout=0x0) at /var/lib/jenkins/workspace/ACE_TAO_Ubuntu_22_04_Clang23_x64_Debug/ACE/ace/OS_NS_sys_select.inl:41
#2 0x00007a545c4f4d94 in ACE_Select_Reactor_T<ACE_Reactor_Token_T<ACE_Token> >::wait_for_multiple_events (this=0x5e2b226328e0, dispatch_set=..., max_wait_time=0x0) at /var/lib/jenkins/workspace/ACE_TAO_Ubuntu_22_04_Clang23_x64_Debug/ACE/ace/Select_Reactor_T.cpp:1104
#3 0x00007a545c4fa4d8 in ACE_Select_Reactor_T<ACE_Reactor_Token_T<ACE_Token> >::handle_events_i (this=0x5e2b226328e0, max_wait_time=0x0) at /var/lib/jenkins/workspace/ACE_TAO_Ubuntu_22_04_Clang23_x64_Debug/ACE/ace/Select_Reactor_T.cpp:1453
#4 0x00007a545c4f24fa in ACE_Select_Reactor_T<ACE_Reactor_Token_T<ACE_Token> >::handle_events (this=0x5e2b226328e0, max_wait_time=0x0) at /var/lib/jenkins/workspace/ACE_TAO_Ubuntu_22_04_Clang23_x64_Debug/ACE/ace/Select_Reactor_T.cpp:1433
#5 0x00007a545abf121f in ACE_Reactor::run_reactor_event_loop (this=0x5e2b226312a0, eh=0x0) at /var/lib/jenkins/workspace/ACE_TAO_Ubuntu_22_04_Clang23_x64_Debug/ACE/ace/Reactor.cpp:192
#6 0x00007a545c4ebc22 in OpenDDS::DCPS::ReactorTask::svc (this=0x5e2b22631dc0) at DCPS/ReactorTask.cpp:234
#7 0x00007a545ac1a161 in ACE_Task_Base::svc_run (args=0x5e2b22631fc8) at /var/lib/jenkins/workspace/ACE_TAO_Ubuntu_22_04_Clang23_x64_Debug/ACE/ace/Task.cpp:269
#8 0x00007a545ac1a8fc in ACE_Thread_Adapter::invoke_i (this=0x5e2b22631a30) at /var/lib/jenkins/workspace/ACE_TAO_Ubuntu_22_04_Clang23_x64_Debug/ACE/ace/Thread_Adapter.cpp:143
#9 0x00007a545ac1a7f4 in ACE_Thread_Adapter::invoke (this=0x5e2b22631a30) at /var/lib/jenkins/workspace/ACE_TAO_Ubuntu_22_04_Clang23_x64_Debug/ACE/ace/Thread_Adapter.cpp:94
#10 0x00007a545ab5d93e in ace_thread_adapter (args=0x5e2b22631a30) at /var/lib/jenkins/workspace/ACE_TAO_Ubuntu_22_04_Clang23_x64_Debug/ACE/ace/Base_Thread_Adapter.cpp:116
#11 0x00007a545a694a83 in start_thread (arg=<optimized out>) at ./nptl/pthread_create.c:442
#12 0x00007a545a7268e0 in clone3 () at ../sysdeps/unix/sysv/linux/x86_64/clone3.S:81

Thread 4 (Thread 0x7a54595fd640 (LWP 773848) "ContentFiltered"):
#0 __futex_abstimed_wait_common64 (private=1499449768, cancel=true, abstime=0x7a54595fcad0, op=137, expected=0, futex_word=0x5e2b2262f860) at ./nptl/futex-internal.c:57
#1 __futex_abstimed_wait_common (cancel=true, private=1499449768, abstime=0x7a54595fcad0, clockid=1499449864, expected=0, futex_word=0x5e2b2262f860) at ./nptl/futex-internal.c:87
#2 __GI___futex_abstimed_wait_cancelable64 (futex_word=futex_word@entry=0x5e2b2262f860, expected=expected@entry=0, clockid=clockid@entry=1, abstime=abstime@entry=0x7a54595fcad0, private=private@entry=0) at ./nptl/futex-internal.c:139
#3 0x00007a545a693e5b in __pthread_cond_wait_common (abstime=0x7a54595fcad0, clockid=1, mutex=0x5e2b2262f808, cond=0x5e2b2262f838) at ./nptl/pthread_cond_wait.c:503
#4 ___pthread_cond_timedwait64 (cond=0x5e2b2262f838, mutex=0x5e2b2262f808, abstime=0x7a54595fcad0) at ./nptl/pthread_cond_wait.c:652
#5 0x00007a545ab6f7ef in ACE_OS::cond_timedwait (cv=0x5e2b2262f838, external_mutex=0x5e2b2262f808, timeout=0x7a54595fcc60) at ../ace/OS_NS_Thread.inl:401
#6 0x00007a545ab6fbc5 in ACE_Condition<ACE_Thread_Mutex>::wait (this=0x5e2b2262f838, mutex=..., abstime=0x7a54595fcc60) at /var/lib/jenkins/workspace/ACE_TAO_Ubuntu_22_04_Clang23_x64_Debug/ACE/ace/Condition_Thread_Mutex.cpp:92
#7 0x00007a545ab6fbf1 in ACE_Condition<ACE_Thread_Mutex>::wait (this=0x5e2b2262f838, abstime=0x7a54595fcc60) at /var/lib/jenkins/workspace/ACE_TAO_Ubuntu_22_04_Clang23_x64_Debug/ACE/ace/Condition_Thread_Mutex.cpp:101
#8 0x00007a545c4147c2 in OpenDDS::DCPS::ConditionVariable<ACE_Thread_Mutex>::wait_until (this=0x5e2b2262f838, expire_at=..., thread_status_manager=...) at DCPS/ConditionVariable.h:72
#9 0x00007a545c4211ca in OpenDDS::DCPS::DispatchService::run_event_loop (this=0x5e2b2262f7f0) at DCPS/DispatchService.cpp:199
#10 0x00007a545c42016d in OpenDDS::DCPS::DispatchService::run (arg=0x5e2b2262f7f0) at DCPS/DispatchService.cpp:161
#11 0x00007a545c5791d8 in OpenDDS::DCPS::ThreadPool::run (arg=0x5e2b2262f8f0) at DCPS/ThreadPool.cpp:64
#12 0x00007a545abca1e5 in ACE_OS_Thread_Adapter::invoke (this=0x5e2b2262d8c0) at /var/lib/jenkins/workspace/ACE_TAO_Ubuntu_22_04_Clang23_x64_Debug/ACE/ace/OS_Thread_Adapter.cpp:90
#13 0x00007a545ab5d93e in ace_thread_adapter (args=0x5e2b2262d8c0) at /var/lib/jenkins/workspace/ACE_TAO_Ubuntu_22_04_Clang23_x64_Debug/ACE/ace/Base_Thread_Adapter.cpp:116
#14 0x00007a545a694a83 in start_thread (arg=<optimized out>) at ./nptl/pthread_create.c:442
#15 0x00007a545a7268e0 in clone3 () at ../sysdeps/unix/sysv/linux/x86_64/clone3.S:81

Thread 3 (Thread 0x7a5459dfe640 (LWP 773847) "ContentFiltered"):
#0 0x00007a545a71b78d in __GI___select (nfds=6, readfds=0x5e2b225b1548, writefds=0x0, exceptfds=0x0, timeout=0x0) at ../sysdeps/unix/sysv/linux/select.c:69
#1 0x00007a545c4fa19d in ACE_OS::select (width=6, rfds=0x5e2b225b1548, wfds=0x0, efds=0x0, timeout=0x0) at /var/lib/jenkins/workspace/ACE_TAO_Ubuntu_22_04_Clang23_x64_Debug/ACE/ace/OS_NS_sys_select.inl:41
#2 0x00007a545c4f4d94 in ACE_Select_Reactor_T<ACE_Reactor_Token_T<ACE_Token> >::wait_for_multiple_events (this=0x5e2b225b1500, dispatch_set=..., max_wait_time=0x0) at /var/lib/jenkins/workspace/ACE_TAO_Ubuntu_22_04_Clang23_x64_Debug/ACE/ace/Select_Reactor_T.cpp:1104
#3 0x00007a545c4fa4d8 in ACE_Select_Reactor_T<ACE_Reactor_Token_T<ACE_Token> >::handle_events_i (this=0x5e2b225b1500, max_wait_time=0x0) at /var/lib/jenkins/workspace/ACE_TAO_Ubuntu_22_04_Clang23_x64_Debug/ACE/ace/Select_Reactor_T.cpp:1453
#4 0x00007a545c4f24fa in ACE_Select_Reactor_T<ACE_Reactor_Token_T<ACE_Token> >::handle_events (this=0x5e2b225b1500, max_wait_time=0x0) at /var/lib/jenkins/workspace/ACE_TAO_Ubuntu_22_04_Clang23_x64_Debug/ACE/ace/Select_Reactor_T.cpp:1433
#5 0x00007a545abf121f in ACE_Reactor::run_reactor_event_loop (this=0x5e2b225ac5f0, eh=0x0) at /var/lib/jenkins/workspace/ACE_TAO_Ubuntu_22_04_Clang23_x64_Debug/ACE/ace/Reactor.cpp:192
#6 0x00007a545c4ebc22 in OpenDDS::DCPS::ReactorTask::svc (this=0x5e2b225a7510) at DCPS/ReactorTask.cpp:234
#7 0x00007a545ac1a161 in ACE_Task_Base::svc_run (args=0x5e2b225a7718) at /var/lib/jenkins/workspace/ACE_TAO_Ubuntu_22_04_Clang23_x64_Debug/ACE/ace/Task.cpp:269
#8 0x00007a545ac1a8fc in ACE_Thread_Adapter::invoke_i (this=0x5e2b225b43e0) at /var/lib/jenkins/workspace/ACE_TAO_Ubuntu_22_04_Clang23_x64_Debug/ACE/ace/Thread_Adapter.cpp:143
#9 0x00007a545ac1a7f4 in ACE_Thread_Adapter::invoke (this=0x5e2b225b43e0) at /var/lib/jenkins/workspace/ACE_TAO_Ubuntu_22_04_Clang23_x64_Debug/ACE/ace/Thread_Adapter.cpp:94
#10 0x00007a545ab5d93e in ace_thread_adapter (args=0x5e2b225b43e0) at /var/lib/jenkins/workspace/ACE_TAO_Ubuntu_22_04_Clang23_x64_Debug/ACE/ace/Base_Thread_Adapter.cpp:116
#11 0x00007a545a694a83 in start_thread (arg=<optimized out>) at ./nptl/pthread_create.c:442
#12 0x00007a545a7268e0 in clone3 () at ../sysdeps/unix/sysv/linux/x86_64/clone3.S:81

Thread 2 (Thread 0x7a545a5ff640 (LWP 773846) "ContentFiltered"):
#0 __futex_abstimed_wait_common64 (private=0, cancel=true, abstime=0x0, op=393, expected=0, futex_word=0x5e2b225b0ac0) at ./nptl/futex-internal.c:57
#1 __futex_abstimed_wait_common (cancel=true, private=0, abstime=0x0, clockid=0, expected=0, futex_word=0x5e2b225b0ac0) at ./nptl/futex-internal.c:87
#2 __GI___futex_abstimed_wait_cancelable64 (futex_word=futex_word@entry=0x5e2b225b0ac0, expected=expected@entry=0, clockid=clockid@entry=0, abstime=abstime@entry=0x0, private=private@entry=0) at ./nptl/futex-internal.c:139
#3 0x00007a545a693a01 in __pthread_cond_wait_common (abstime=0x0, clockid=0, mutex=0x5e2b225b0a68, cond=0x5e2b225b0a98) at ./nptl/pthread_cond_wait.c:503
#4 ___pthread_cond_wait (cond=0x5e2b225b0a98, mutex=0x5e2b225b0a68) at ./nptl/pthread_cond_wait.c:627
#5 0x00007a545ab6f73d in ACE_OS::cond_wait (cv=0x5e2b225b0a98, external_mutex=0x5e2b225b0a68) at ../ace/OS_NS_Thread.inl:370
#6 0x00007a545ab6fb89 in ACE_Condition<ACE_Thread_Mutex>::wait (this=0x5e2b225b0a98) at /var/lib/jenkins/workspace/ACE_TAO_Ubuntu_22_04_Clang23_x64_Debug/ACE/ace/Condition_Thread_Mutex.cpp:84
#7 0x00007a545d710e6e in OpenDDS::DCPS::ConditionVariable<ACE_Thread_Mutex>::wait (this=0x5e2b225b0a98, thread_status_manager=...) at /var/lib/jenkins/workspace/OpenDDS_ACE8_Ubuntu_22_04_Clang23_x64_Debug/dds/DCPS/ConditionVariable.h:56
#8 0x00007a545c42120b in OpenDDS::DCPS::DispatchService::run_event_loop (this=0x5e2b225b0a50) at DCPS/DispatchService.cpp:201
#9 0x00007a545c42016d in OpenDDS::DCPS::DispatchService::run (arg=0x5e2b225b0a50) at DCPS/DispatchService.cpp:161
#10 0x00007a545c5791d8 in OpenDDS::DCPS::ThreadPool::run (arg=0x5e2b225b0b50) at DCPS/ThreadPool.cpp:64
#11 0x00007a545abca1e5 in ACE_OS_Thread_Adapter::invoke (this=0x5e2b225ad720) at /var/lib/jenkins/workspace/ACE_TAO_Ubuntu_22_04_Clang23_x64_Debug/ACE/ace/OS_Thread_Adapter.cpp:90
#12 0x00007a545ab5d93e in ace_thread_adapter (args=0x5e2b225ad720) at /var/lib/jenkins/workspace/ACE_TAO_Ubuntu_22_04_Clang23_x64_Debug/ACE/ace/Base_Thread_Adapter.cpp:116
#13 0x00007a545a694a83 in start_thread (arg=<optimized out>) at ./nptl/pthread_create.c:442
#14 0x00007a545a7268e0 in clone3 () at ../sysdeps/unix/sysv/linux/x86_64/clone3.S:81

Thread 1 (Thread 0x7a545d8a3740 (LWP 773845) "ContentFiltered"):
#0 __futex_abstimed_wait_common64 (private=0, cancel=true, abstime=0x0, op=393, expected=0, futex_word=0x5e2b22662130) at ./nptl/futex-internal.c:57
#1 __futex_abstimed_wait_common (cancel=true, private=0, abstime=0x0, clockid=0, expected=0, futex_word=0x5e2b22662130) at ./nptl/futex-internal.c:87
#2 __GI___futex_abstimed_wait_cancelable64 (futex_word=futex_word@entry=0x5e2b22662130, expected=expected@entry=0, clockid=clockid@entry=0, abstime=abstime@entry=0x0, private=private@entry=0) at ./nptl/futex-internal.c:139
#3 0x00007a545a693a01 in __pthread_cond_wait_common (abstime=0x0, clockid=0, mutex=0x5e2b226620d8, cond=0x5e2b22662108) at ./nptl/pthread_cond_wait.c:503
#4 ___pthread_cond_wait (cond=0x5e2b22662108, mutex=0x5e2b226620d8) at ./nptl/pthread_cond_wait.c:627
#5 0x00007a545ab6f73d in ACE_OS::cond_wait (cv=0x5e2b22662108, external_mutex=0x5e2b226620d8) at ../ace/OS_NS_Thread.inl:370
#6 0x00007a545ab6f533 in ACE_Condition<ACE_Recursive_Thread_Mutex>::wait (this=0x5e2b22662108, mutex=..., abstime=0x0) at /var/lib/jenkins/workspace/ACE_TAO_Ubuntu_22_04_Clang23_x64_Debug/ACE/ace/Condition_Recursive_Thread_Mutex.cpp:88
#7 0x00007a545ab6f4c1 in ACE_Condition<ACE_Recursive_Thread_Mutex>::wait (this=0x5e2b22662108, abstime=0x0) at /var/lib/jenkins/workspace/ACE_TAO_Ubuntu_22_04_Clang23_x64_Debug/ACE/ace/Condition_Recursive_Thread_Mutex.cpp:64
#8 0x00007a545c511412 in OpenDDS::DCPS::ConditionVariable<ACE_Recursive_Thread_Mutex>::wait (this=0x5e2b22662108, thread_status_manager=...) at DCPS/ConditionVariable.h:56
#9 0x00007a545c59782e in DDS::WaitSet::wait (this=0x5e2b226620d0, active_conditions=..., timeout=...) at DCPS/WaitSet.cpp:148
#10 0x00005e2b0ccf1d95 in Utils::waitForSample (dr=...) at /var/lib/jenkins/workspace/OpenDDS_ACE8_Ubuntu_22_04_Clang23_x64_Debug/tests/Utils/WaitForSample.h:22
#11 0x00005e2b0ccebb7d in run_filtering_test (ts=..., pub=..., sub=..., sub2=...) at /var/lib/jenkins/workspace/OpenDDS_ACE8_Ubuntu_22_04_Clang23_x64_Debug/tests/DCPS/ContentFilteredTopic/ContentFilteredTopicTest.cpp:272
#12 0x00005e2b0ccefcf6 in run_test (argc=2, argv=0x7ffcd6fe13b8) at /var/lib/jenkins/workspace/OpenDDS_ACE8_Ubuntu_22_04_Clang23_x64_Debug/tests/DCPS/ContentFilteredTopic/ContentFilteredTopicTest.cpp:678
#13 0x00005e2b0ccefff9 in main (argc=4, argv=0x7ffcd6fe13b8) at /var/lib/jenkins/workspace/OpenDDS_ACE8_Ubuntu_22_04_Clang23_x64_Debug/tests/DCPS/ContentFilteredTopic/ContentFilteredTopicTest.cpp:693
[Inferior 1 (process 773845) detached]
======= End stuck stacks =======
[Details] ERROR: test returned -1
[Details] auto_run_tests.pl: ERROR: "tests/DCPS/ContentFilteredTopic/run_test.pl rtps_disc dynamic" returned with status 1

tests/DCPS/ContentFilteredTopic/run_test.pl rtps_disc nopub dynamic

[Details] ERROR: ContentFilteredTopicTest timedout
======= Begin stuck stacks =======
[New LWP 773973]
[New LWP 773974]
[New LWP 773975]
[New LWP 773976]
[New LWP 773977]
[New LWP 773978]
[New LWP 773979]
[New LWP 773980]
[New LWP 773981]
[New LWP 773982]
[New LWP 773983]
[New LWP 773984]
[Thread debugging using libthread_db enabled]
Using host libthread_db library "/lib/x86_64-linux-gnu/libthread_db.so.1".
__futex_abstimed_wait_common64 (private=0, cancel=true, abstime=0x0, op=393, expected=0, futex_word=0x61283cf23c40) at ./nptl/futex-internal.c:57
57 ./nptl/futex-internal.c: No such file or directory.

Thread 13 (Thread 0x77caae7fc640 (LWP 773984) "ContentFiltered"):
#0 0x000077cad071b78d in __GI___select (nfds=24, readfds=0x61283d047598, writefds=0x0, exceptfds=0x0, timeout=0x0) at ../sysdeps/unix/sysv/linux/select.c:69
#1 0x000077cad24fa19d in ACE_OS::select (width=24, rfds=0x61283d047598, wfds=0x0, efds=0x0, timeout=0x0) at /var/lib/jenkins/workspace/ACE_TAO_Ubuntu_22_04_Clang23_x64_Debug/ACE/ace/OS_NS_sys_select.inl:41
#2 0x000077cad24f4d94 in ACE_Select_Reactor_T<ACE_Reactor_Token_T<ACE_Token> >::wait_for_multiple_events (this=0x61283d047550, dispatch_set=..., max_wait_time=0x0) at /var/lib/jenkins/workspace/ACE_TAO_Ubuntu_22_04_Clang23_x64_Debug/ACE/ace/Select_Reactor_T.cpp:1104
#3 0x000077cad24fa4d8 in ACE_Select_Reactor_T<ACE_Reactor_Token_T<ACE_Token> >::handle_events_i (this=0x61283d047550, max_wait_time=0x0) at /var/lib/jenkins/workspace/ACE_TAO_Ubuntu_22_04_Clang23_x64_Debug/ACE/ace/Select_Reactor_T.cpp:1453
#4 0x000077cad24f24fa in ACE_Select_Reactor_T<ACE_Reactor_Token_T<ACE_Token> >::handle_events (this=0x61283d047550, max_wait_time=0x0) at /var/lib/jenkins/workspace/ACE_TAO_Ubuntu_22_04_Clang23_x64_Debug/ACE/ace/Select_Reactor_T.cpp:1433
#5 0x000077cad0bf121f in ACE_Reactor::run_reactor_event_loop (this=0x61283d045f10, eh=0x0) at /var/lib/jenkins/workspace/ACE_TAO_Ubuntu_22_04_Clang23_x64_Debug/ACE/ace/Reactor.cpp:192
#6 0x000077cad24ebc22 in OpenDDS::DCPS::ReactorTask::svc (this=0x61283d046a30) at DCPS/ReactorTask.cpp:234
#7 0x000077cad0c1a161 in ACE_Task_Base::svc_run (args=0x61283d046c38) at /var/lib/jenkins/workspace/ACE_TAO_Ubuntu_22_04_Clang23_x64_Debug/ACE/ace/Task.cpp:269
#8 0x000077cad0c1a8fc in ACE_Thread_Adapter::invoke_i (this=0x61283d045470) at /var/lib/jenkins/workspace/ACE_TAO_Ubuntu_22_04_Clang23_x64_Debug/ACE/ace/Thread_Adapter.cpp:143
#9 0x000077cad0c1a7f4 in ACE_Thread_Adapter::invoke (this=0x61283d045470) at /var/lib/jenkins/workspace/ACE_TAO_Ubuntu_22_04_Clang23_x64_Debug/ACE/ace/Thread_Adapter.cpp:94
#10 0x000077cad0b5d93e in ace_thread_adapter (args=0x61283d045470) at /var/lib/jenkins/workspace/ACE_TAO_Ubuntu_22_04_Clang23_x64_Debug/ACE/ace/Base_Thread_Adapter.cpp:116
#11 0x000077cad0694a83 in start_thread (arg=<optimized out>) at ./nptl/pthread_create.c:442
#12 0x000077cad07268e0 in clone3 () at ../sysdeps/unix/sysv/linux/x86_64/clone3.S:81

Thread 12 (Thread 0x77caaeffd640 (LWP 773983) "ContentFiltered"):
#0 __futex_abstimed_wait_common64 (private=0, cancel=true, abstime=0x0, op=393, expected=0, futex_word=0x61283d044844) at ./nptl/futex-internal.c:57
#1 __futex_abstimed_wait_common (cancel=true, private=0, abstime=0x0, clockid=0, expected=0, futex_word=0x61283d044844) at ./nptl/futex-internal.c:87
#2 __GI___futex_abstimed_wait_cancelable64 (futex_word=futex_word@entry=0x61283d044844, expected=expected@entry=0, clockid=clockid@entry=0, abstime=abstime@entry=0x0, private=private@entry=0) at ./nptl/futex-internal.c:139
#3 0x000077cad0693a01 in __pthread_cond_wait_common (abstime=0x0, clockid=0, mutex=0x61283d0447e8, cond=0x61283d044818) at ./nptl/pthread_cond_wait.c:503
#4 ___pthread_cond_wait (cond=0x61283d044818, mutex=0x61283d0447e8) at ./nptl/pthread_cond_wait.c:627
#5 0x000077cad0b6f73d in ACE_OS::cond_wait (cv=0x61283d044818, external_mutex=0x61283d0447e8) at ../ace/OS_NS_Thread.inl:370
#6 0x000077cad0b6fb89 in ACE_Condition<ACE_Thread_Mutex>::wait (this=0x61283d044818) at /var/lib/jenkins/workspace/ACE_TAO_Ubuntu_22_04_Clang23_x64_Debug/ACE/ace/Condition_Thread_Mutex.cpp:84
#7 0x000077cad3710e6e in OpenDDS::DCPS::ConditionVariable<ACE_Thread_Mutex>::wait (this=0x61283d044818, thread_status_manager=...) at /var/lib/jenkins/workspace/OpenDDS_ACE8_Ubuntu_22_04_Clang23_x64_Debug/dds/DCPS/ConditionVariable.h:56
#8 0x000077cad242120b in OpenDDS::DCPS::DispatchService::run_event_loop (this=0x61283d0447d0) at DCPS/DispatchService.cpp:201
#9 0x000077cad242016d in OpenDDS::DCPS::DispatchService::run (arg=0x61283d0447d0) at DCPS/DispatchService.cpp:161
#10 0x000077cad25791d8 in OpenDDS::DCPS::ThreadPool::run (arg=0x61283d0448d0) at DCPS/ThreadPool.cpp:64
#11 0x000077cad0bca1e5 in ACE_OS_Thread_Adapter::invoke (this=0x61283d03a090) at /var/lib/jenkins/workspace/ACE_TAO_Ubuntu_22_04_Clang23_x64_Debug/ACE/ace/OS_Thread_Adapter.cpp:90
#12 0x000077cad0b5d93e in ace_thread_adapter (args=0x61283d03a090) at /var/lib/jenkins/workspace/ACE_TAO_Ubuntu_22_04_Clang23_x64_Debug/ACE/ace/Base_Thread_Adapter.cpp:116
#13 0x000077cad0694a83 in start_thread (arg=<optimized out>) at ./nptl/pthread_create.c:442
#14 0x000077cad07268e0 in clone3 () at ../sysdeps/unix/sysv/linux/x86_64/clone3.S:81

Thread 11 (Thread 0x77caaf7fe640 (LWP 773982) "ContentFiltered"):
#0 0x000077cad071b78d in __GI___select (nfds=21, readfds=0x61283d025fb8, writefds=0x0, exceptfds=0x0, timeout=0x0) at ../sysdeps/unix/sysv/linux/select.c:69
#1 0x000077cad24fa19d in ACE_OS::select (width=21, rfds=0x61283d025fb8, wfds=0x0, efds=0x0, timeout=0x0) at /var/lib/jenkins/workspace/ACE_TAO_Ubuntu_22_04_Clang23_x64_Debug/ACE/ace/OS_NS_sys_select.inl:41
#2 0x000077cad24f4d94 in ACE_Select_Reactor_T<ACE_Reactor_Token_T<ACE_Token> >::wait_for_multiple_events (this=0x61283d025f70, dispatch_set=..., max_wait_time=0x0) at /var/lib/jenkins/workspace/ACE_TAO_Ubuntu_22_04_Clang23_x64_Debug/ACE/ace/Select_Reactor_T.cpp:1104
#3 0x000077cad24fa4d8 in ACE_Select_Reactor_T<ACE_Reactor_Token_T<ACE_Token> >::handle_events_i (this=0x61283d025f70, max_wait_time=0x0) at /var/lib/jenkins/workspace/ACE_TAO_Ubuntu_22_04_Clang23_x64_Debug/ACE/ace/Select_Reactor_T.cpp:1453
#4 0x000077cad24f24fa in ACE_Select_Reactor_T<ACE_Reactor_Token_T<ACE_Token> >::handle_events (this=0x61283d025f70, max_wait_time=0x0) at /var/lib/jenkins/workspace/ACE_TAO_Ubuntu_22_04_Clang23_x64_Debug/ACE/ace/Select_Reactor_T.cpp:1433
#5 0x000077cad0bf121f in ACE_Reactor::run_reactor_event_loop (this=0x61283d024950, eh=0x0) at /var/lib/jenkins/workspace/ACE_TAO_Ubuntu_22_04_Clang23_x64_Debug/ACE/ace/Reactor.cpp:192
#6 0x000077cad24ebc22 in OpenDDS::DCPS::ReactorTask::svc (this=0x61283d025450) at DCPS/ReactorTask.cpp:234
#7 0x000077cad0c1a161 in ACE_Task_Base::svc_run (args=0x61283d025658) at /var/lib/jenkins/workspace/ACE_TAO_Ubuntu_22_04_Clang23_x64_Debug/ACE/ace/Task.cpp:269
#8 0x000077cad0c1a8fc in ACE_Thread_Adapter::invoke_i (this=0x61283d00a0c0) at /var/lib/jenkins/workspace/ACE_TAO_Ubuntu_22_04_Clang23_x64_Debug/ACE/ace/Thread_Adapter.cpp:143
#9 0x000077cad0c1a7f4 in ACE_Thread_Adapter::invoke (this=0x61283d00a0c0) at /var/lib/jenkins/workspace/ACE_TAO_Ubuntu_22_04_Clang23_x64_Debug/ACE/ace/Thread_Adapter.cpp:94
#10 0x000077cad0b5d93e in ace_thread_adapter (args=0x61283d00a0c0) at /var/lib/jenkins/workspace/ACE_TAO_Ubuntu_22_04_Clang23_x64_Debug/ACE/ace/Base_Thread_Adapter.cpp:116
#11 0x000077cad0694a83 in start_thread (arg=<optimized out>) at ./nptl/pthread_create.c:442
#12 0x000077cad07268e0 in clone3 () at ../sysdeps/unix/sysv/linux/x86_64/clone3.S:81

Thread 10 (Thread 0x77caaffff640 (LWP 773981) "ContentFiltered"):
#0 __futex_abstimed_wait_common64 (private=0, cancel=true, abstime=0x0, op=393, expected=0, futex_word=0x61283d023474) at ./nptl/futex-internal.c:57
#1 __futex_abstimed_wait_common (cancel=true, private=0, abstime=0x0, clockid=0, expected=0, futex_word=0x61283d023474) at ./nptl/futex-internal.c:87
#2 __GI___futex_abstimed_wait_cancelable64 (futex_word=futex_word@entry=0x61283d023474, expected=expected@entry=0, clockid=clockid@entry=0, abstime=abstime@entry=0x0, private=private@entry=0) at ./nptl/futex-internal.c:139
#3 0x000077cad0693a01 in __pthread_cond_wait_common (abstime=0x0, clockid=0, mutex=0x61283d023418, cond=0x61283d023448) at ./nptl/pthread_cond_wait.c:503
#4 ___pthread_cond_wait (cond=0x61283d023448, mutex=0x61283d023418) at ./nptl/pthread_cond_wait.c:627
#5 0x000077cad0b6f73d in ACE_OS::cond_wait (cv=0x61283d023448, external_mutex=0x61283d023418) at ../ace/OS_NS_Thread.inl:370
#6 0x000077cad0b6fb89 in ACE_Condition<ACE_Thread_Mutex>::wait (this=0x61283d023448) at /var/lib/jenkins/workspace/ACE_TAO_Ubuntu_22_04_Clang23_x64_Debug/ACE/ace/Condition_Thread_Mutex.cpp:84
#7 0x000077cad3710e6e in OpenDDS::DCPS::ConditionVariable<ACE_Thread_Mutex>::wait (this=0x61283d023448, thread_status_manager=...) at /var/lib/jenkins/workspace/OpenDDS_ACE8_Ubuntu_22_04_Clang23_x64_Debug/dds/DCPS/ConditionVariable.h:56
#8 0x000077cad242120b in OpenDDS::DCPS::DispatchService::run_event_loop (this=0x61283d023400) at DCPS/DispatchService.cpp:201
#9 0x000077cad242016d in OpenDDS::DCPS::DispatchService::run (arg=0x61283d023400) at DCPS/DispatchService.cpp:161
#10 0x000077cad25791d8 in OpenDDS::DCPS::ThreadPool::run (arg=0x61283d023500) at DCPS/ThreadPool.cpp:64
#11 0x000077cad0bca1e5 in ACE_OS_Thread_Adapter::invoke (this=0x61283d00bb90) at /var/lib/jenkins/workspace/ACE_TAO_Ubuntu_22_04_Clang23_x64_Debug/ACE/ace/OS_Thread_Adapter.cpp:90
#12 0x000077cad0b5d93e in ace_thread_adapter (args=0x61283d00bb90) at /var/lib/jenkins/workspace/ACE_TAO_Ubuntu_22_04_Clang23_x64_Debug/ACE/ace/Base_Thread_Adapter.cpp:116
#13 0x000077cad0694a83 in start_thread (arg=<optimized out>) at ./nptl/pthread_create.c:442
#14 0x000077cad07268e0 in clone3 () at ../sysdeps/unix/sysv/linux/x86_64/clone3.S:81

Thread 9 (Thread 0x77caccd58640 (LWP 773980) "ContentFiltered"):
#0 0x000077cad071b78d in __GI___select (nfds=18, readfds=0x61283cff91b8, writefds=0x0, exceptfds=0x0, timeout=0x0) at ../sysdeps/unix/sysv/linux/select.c:69
#1 0x000077cad24fa19d in ACE_OS::select (width=18, rfds=0x61283cff91b8, wfds=0x0, efds=0x0, timeout=0x0) at /var/lib/jenkins/workspace/ACE_TAO_Ubuntu_22_04_Clang23_x64_Debug/ACE/ace/OS_NS_sys_select.inl:41
#2 0x000077cad24f4d94 in ACE_Select_Reactor_T<ACE_Reactor_Token_T<ACE_Token> >::wait_for_multiple_events (this=0x61283cff9170, dispatch_set=..., max_wait_time=0x0) at /var/lib/jenkins/workspace/ACE_TAO_Ubuntu_22_04_Clang23_x64_Debug/ACE/ace/Select_Reactor_T.cpp:1104
#3 0x000077cad24fa4d8 in ACE_Select_Reactor_T<ACE_Reactor_Token_T<ACE_Token> >::handle_events_i (this=0x61283cff9170, max_wait_time=0x0) at /var/lib/jenkins/workspace/ACE_TAO_Ubuntu_22_04_Clang23_x64_Debug/ACE/ace/Select_Reactor_T.cpp:1453
#4 0x000077cad24f24fa in ACE_Select_Reactor_T<ACE_Reactor_Token_T<ACE_Token> >::handle_events (this=0x61283cff9170, max_wait_time=0x0) at /var/lib/jenkins/workspace/ACE_TAO_Ubuntu_22_04_Clang23_x64_Debug/ACE/ace/Select_Reactor_T.cpp:1433
#5 0x000077cad0bf121f in ACE_Reactor::run_reactor_event_loop (this=0x61283cff7b30, eh=0x0) at /var/lib/jenkins/workspace/ACE_TAO_Ubuntu_22_04_Clang23_x64_Debug/ACE/ace/Reactor.cpp:192
#6 0x000077cad24ebc22 in OpenDDS::DCPS::ReactorTask::svc (this=0x61283cff8650) at DCPS/ReactorTask.cpp:234
#7 0x000077cad0c1a161 in ACE_Task_Base::svc_run (args=0x61283cff8858) at /var/lib/jenkins/workspace/ACE_TAO_Ubuntu_22_04_Clang23_x64_Debug/ACE/ace/Task.cpp:269
#8 0x000077cad0c1a8fc in ACE_Thread_Adapter::invoke_i (this=0x61283cff7370) at /var/lib/jenkins/workspace/ACE_TAO_Ubuntu_22_04_Clang23_x64_Debug/ACE/ace/Thread_Adapter.cpp:143
#9 0x000077cad0c1a7f4 in ACE_Thread_Adapter::invoke (this=0x61283cff7370) at /var/lib/jenkins/workspace/ACE_TAO_Ubuntu_22_04_Clang23_x64_Debug/ACE/ace/Thread_Adapter.cpp:94
#10 0x000077cad0b5d93e in ace_thread_adapter (args=0x61283cff7370) at /var/lib/jenkins/workspace/ACE_TAO_Ubuntu_22_04_Clang23_x64_Debug/ACE/ace/Base_Thread_Adapter.cpp:116
#11 0x000077cad0694a83 in start_thread (arg=<optimized out>) at ./nptl/pthread_create.c:442
#12 0x000077cad07268e0 in clone3 () at ../sysdeps/unix/sysv/linux/x86_64/clone3.S:81

Thread 8 (Thread 0x77cacd559640 (LWP 773979) "ContentFiltered"):
#0 __futex_abstimed_wait_common64 (private=0, cancel=true, abstime=0x0, op=393, expected=0, futex_word=0x61283cff67b4) at ./nptl/futex-internal.c:57
#1 __futex_abstimed_wait_common (cancel=true, private=0, abstime=0x0, clockid=0, expected=0, futex_word=0x61283cff67b4) at ./nptl/futex-internal.c:87
#2 __GI___futex_abstimed_wait_cancelable64 (futex_word=futex_word@entry=0x61283cff67b4, expected=expected@entry=0, clockid=clockid@entry=0, abstime=abstime@entry=0x0, private=private@entry=0) at ./nptl/futex-internal.c:139
#3 0x000077cad0693a01 in __pthread_cond_wait_common (abstime=0x0, clockid=0, mutex=0x61283cff6758, cond=0x61283cff6788) at ./nptl/pthread_cond_wait.c:503
#4 ___pthread_cond_wait (cond=0x61283cff6788, mutex=0x61283cff6758) at ./nptl/pthread_cond_wait.c:627
#5 0x000077cad0b6f73d in ACE_OS::cond_wait (cv=0x61283cff6788, external_mutex=0x61283cff6758) at ../ace/OS_NS_Thread.inl:370
#6 0x000077cad0b6fb89 in ACE_Condition<ACE_Thread_Mutex>::wait (this=0x61283cff6788) at /var/lib/jenkins/workspace/ACE_TAO_Ubuntu_22_04_Clang23_x64_Debug/ACE/ace/Condition_Thread_Mutex.cpp:84
#7 0x000077cad3710e6e in OpenDDS::DCPS::ConditionVariable<ACE_Thread_Mutex>::wait (this=0x61283cff6788, thread_status_manager=...) at /var/lib/jenkins/workspace/OpenDDS_ACE8_Ubuntu_22_04_Clang23_x64_Debug/dds/DCPS/ConditionVariable.h:56
#8 0x000077cad242120b in OpenDDS::DCPS::DispatchService::run_event_loop (this=0x61283cff6740) at DCPS/DispatchService.cpp:201
#9 0x000077cad242016d in OpenDDS::DCPS::DispatchService::run (arg=0x61283cff6740) at DCPS/DispatchService.cpp:161
#10 0x000077cad25791d8 in OpenDDS::DCPS::ThreadPool::run (arg=0x61283cff6840) at DCPS/ThreadPool.cpp:64
#11 0x000077cad0bca1e5 in ACE_OS_Thread_Adapter::invoke (this=0x61283cfe1ac0) at /var/lib/jenkins/workspace/ACE_TAO_Ubuntu_22_04_Clang23_x64_Debug/ACE/ace/OS_Thread_Adapter.cpp:90
#12 0x000077cad0b5d93e in ace_thread_adapter (args=0x61283cfe1ac0) at /var/lib/jenkins/workspace/ACE_TAO_Ubuntu_22_04_Clang23_x64_Debug/ACE/ace/Base_Thread_Adapter.cpp:116
#13 0x000077cad0694a83 in start_thread (arg=<optimized out>) at ./nptl/pthread_create.c:442
#14 0x000077cad07268e0 in clone3 () at ../sysdeps/unix/sysv/linux/x86_64/clone3.S:81

Thread 7 (Thread 0x77cacddfa640 (LWP 773978) "ContentFiltered"):
#0 0x000077cad071b78d in __GI___select (nfds=16, readfds=0x61283cfa8108, writefds=0x0, exceptfds=0x0, timeout=0x0) at ../sysdeps/unix/sysv/linux/select.c:69
#1 0x000077cad24fa19d in ACE_OS::select (width=16, rfds=0x61283cfa8108, wfds=0x0, efds=0x0, timeout=0x0) at /var/lib/jenkins/workspace/ACE_TAO_Ubuntu_22_04_Clang23_x64_Debug/ACE/ace/OS_NS_sys_select.inl:41
#2 0x000077cad24f4d94 in ACE_Select_Reactor_T<ACE_Reactor_Token_T<ACE_Token> >::wait_for_multiple_events (this=0x61283cfa80c0, dispatch_set=..., max_wait_time=0x0) at /var/lib/jenkins/workspace/ACE_TAO_Ubuntu_22_04_Clang23_x64_Debug/ACE/ace/Select_Reactor_T.cpp:1104
#3 0x000077cad24fa4d8 in ACE_Select_Reactor_T<ACE_Reactor_Token_T<ACE_Token> >::handle_events_i (this=0x61283cfa80c0, max_wait_time=0x0) at /var/lib/jenkins/workspace/ACE_TAO_Ubuntu_22_04_Clang23_x64_Debug/ACE/ace/Select_Reactor_T.cpp:1453
#4 0x000077cad24f24fa in ACE_Select_Reactor_T<ACE_Reactor_Token_T<ACE_Token> >::handle_events (this=0x61283cfa80c0, max_wait_time=0x0) at /var/lib/jenkins/workspace/ACE_TAO_Ubuntu_22_04_Clang23_x64_Debug/ACE/ace/Select_Reactor_T.cpp:1433
#5 0x000077cad0bf121f in ACE_Reactor::run_reactor_event_loop (this=0x61283cfa6500, eh=0x0) at /var/lib/jenkins/workspace/ACE_TAO_Ubuntu_22_04_Clang23_x64_Debug/ACE/ace/Reactor.cpp:192
#6 0x000077cad24ebc22 in OpenDDS::DCPS::ReactorTask::svc (this=0x61283cfa75a0) at DCPS/ReactorTask.cpp:234
#7 0x000077cad0c1a161 in ACE_Task_Base::svc_run (args=0x61283cfa77a8) at /var/lib/jenkins/workspace/ACE_TAO_Ubuntu_22_04_Clang23_x64_Debug/ACE/ace/Task.cpp:269
#8 0x000077cad0c1a8fc in ACE_Thread_Adapter::invoke_i (this=0x61283cfa6fd0) at /var/lib/jenkins/workspace/ACE_TAO_Ubuntu_22_04_Clang23_x64_Debug/ACE/ace/Thread_Adapter.cpp:143
#9 0x000077cad0c1a7f4 in ACE_Thread_Adapter::invoke (this=0x61283cfa6fd0) at /var/lib/jenkins/workspace/ACE_TAO_Ubuntu_22_04_Clang23_x64_Debug/ACE/ace/Thread_Adapter.cpp:94
#10 0x000077cad0b5d93e in ace_thread_adapter (args=0x61283cfa6fd0) at /var/lib/jenkins/workspace/ACE_TAO_Ubuntu_22_04_Clang23_x64_Debug/ACE/ace/Base_Thread_Adapter.cpp:116
#11 0x000077cad0694a83 in start_thread (arg=<optimized out>) at ./nptl/pthread_create.c:442
#12 0x000077cad07268e0 in clone3 () at ../sysdeps/unix/sysv/linux/x86_64/clone3.S:81

Thread 6 (Thread 0x77cace5fb640 (LWP 773977) "ContentFiltered"):
#0 __futex_abstimed_wait_common64 (private=-832591448, cancel=true, abstime=0x77cace5faad0, op=137, expected=0, futex_word=0x61283cfa5140) at ./nptl/futex-internal.c:57
#1 __futex_abstimed_wait_common (cancel=true, private=-832591448, abstime=0x77cace5faad0, clockid=-832591352, expected=0, futex_word=0x61283cfa5140) at ./nptl/futex-internal.c:87
#2 __GI___futex_abstimed_wait_cancelable64 (futex_word=futex_word@entry=0x61283cfa5140, expected=expected@entry=0, clockid=clockid@entry=1, abstime=abstime@entry=0x77cace5faad0, private=private@entry=0) at ./nptl/futex-internal.c:139
#3 0x000077cad0693e5b in __pthread_cond_wait_common (abstime=0x77cace5faad0, clockid=1, mutex=0x61283cfa50e8, cond=0x61283cfa5118) at ./nptl/pthread_cond_wait.c:503
#4 ___pthread_cond_timedwait64 (cond=0x61283cfa5118, mutex=0x61283cfa50e8, abstime=0x77cace5faad0) at ./nptl/pthread_cond_wait.c:652
#5 0x000077cad0b6f7ef in ACE_OS::cond_timedwait (cv=0x61283cfa5118, external_mutex=0x61283cfa50e8, timeout=0x77cace5fac60) at ../ace/OS_NS_Thread.inl:401
#6 0x000077cad0b6fbc5 in ACE_Condition<ACE_Thread_Mutex>::wait (this=0x61283cfa5118, mutex=..., abstime=0x77cace5fac60) at /var/lib/jenkins/workspace/ACE_TAO_Ubuntu_22_04_Clang23_x64_Debug/ACE/ace/Condition_Thread_Mutex.cpp:92
#7 0x000077cad0b6fbf1 in ACE_Condition<ACE_Thread_Mutex>::wait (this=0x61283cfa5118, abstime=0x77cace5fac60) at /var/lib/jenkins/workspace/ACE_TAO_Ubuntu_22_04_Clang23_x64_Debug/ACE/ace/Condition_Thread_Mutex.cpp:101
#8 0x000077cad24147c2 in OpenDDS::DCPS::ConditionVariable<ACE_Thread_Mutex>::wait_until (this=0x61283cfa5118, expire_at=..., thread_status_manager=...) at DCPS/ConditionVariable.h:72
#9 0x000077cad24211ca in OpenDDS::DCPS::DispatchService::run_event_loop (this=0x61283cfa50d0) at DCPS/DispatchService.cpp:199
#10 0x000077cad242016d in OpenDDS::DCPS::DispatchService::run (arg=0x61283cfa50d0) at DCPS/DispatchService.cpp:161
#11 0x000077cad25791d8 in OpenDDS::DCPS::ThreadPool::run (arg=0x61283cfa51d0) at DCPS/ThreadPool.cpp:64
#12 0x000077cad0bca1e5 in ACE_OS_Thread_Adapter::invoke (this=0x61283cfa00f0) at /var/lib/jenkins/workspace/ACE_TAO_Ubuntu_22_04_Clang23_x64_Debug/ACE/ace/OS_Thread_Adapter.cpp:90
#13 0x000077cad0b5d93e in ace_thread_adapter (args=0x61283cfa00f0) at /var/lib/jenkins/workspace/ACE_TAO_Ubuntu_22_04_Clang23_x64_Debug/ACE/ace/Base_Thread_Adapter.cpp:116
#14 0x000077cad0694a83 in start_thread (arg=<optimized out>) at ./nptl/pthread_create.c:442
#15 0x000077cad07268e0 in clone3 () at ../sysdeps/unix/sysv/linux/x86_64/clone3.S:81

Thread 5 (Thread 0x77cacedfc640 (LWP 773976) "ContentFiltered"):
#0 0x000077cad071b78d in __GI___select (nfds=12, readfds=0x61283cef3f08, writefds=0x0, exceptfds=0x0, timeout=0x0) at ../sysdeps/unix/sysv/linux/select.c:69
#1 0x000077cad24fa19d in ACE_OS::select (width=12, rfds=0x61283cef3f08, wfds=0x0, efds=0x0, timeout=0x0) at /var/lib/jenkins/workspace/ACE_TAO_Ubuntu_22_04_Clang23_x64_Debug/ACE/ace/OS_NS_sys_select.inl:41
#2 0x000077cad24f4d94 in ACE_Select_Reactor_T<ACE_Reactor_Token_T<ACE_Token> >::wait_for_multiple_events (this=0x61283cef3ec0, dispatch_set=..., max_wait_time=0x0) at /var/lib/jenkins/workspace/ACE_TAO_Ubuntu_22_04_Clang23_x64_Debug/ACE/ace/Select_Reactor_T.cpp:1104
#3 0x000077cad24fa4d8 in ACE_Select_Reactor_T<ACE_Reactor_Token_T<ACE_Token> >::handle_events_i (this=0x61283cef3ec0, max_wait_time=0x0) at /var/lib/jenkins/workspace/ACE_TAO_Ubuntu_22_04_Clang23_x64_Debug/ACE/ace/Select_Reactor_T.cpp:1453
#4 0x000077cad24f24fa in ACE_Select_Reactor_T<ACE_Reactor_Token_T<ACE_Token> >::handle_events (this=0x61283cef3ec0, max_wait_time=0x0) at /var/lib/jenkins/workspace/ACE_TAO_Ubuntu_22_04_Clang23_x64_Debug/ACE/ace/Select_Reactor_T.cpp:1433
#5 0x000077cad0bf121f in ACE_Reactor::run_reactor_event_loop (this=0x61283cef2880, eh=0x0) at /var/lib/jenkins/workspace/ACE_TAO_Ubuntu_22_04_Clang23_x64_Debug/ACE/ace/Reactor.cpp:192
#6 0x000077cad24ebc22 in OpenDDS::DCPS::ReactorTask::svc (this=0x61283cef33a0) at DCPS/ReactorTask.cpp:234
#7 0x000077cad0c1a161 in ACE_Task_Base::svc_run (args=0x61283cef35a8) at /var/lib/jenkins/workspace/ACE_TAO_Ubuntu_22_04_Clang23_x64_Debug/ACE/ace/Task.cpp:269
#8 0x000077cad0c1a8fc in ACE_Thread_Adapter::invoke_i (this=0x61283cef3010) at /var/lib/jenkins/workspace/ACE_TAO_Ubuntu_22_04_Clang23_x64_Debug/ACE/ace/Thread_Adapter.cpp:143
#9 0x000077cad0c1a7f4 in ACE_Thread_Adapter::invoke (this=0x61283cef3010) at /var/lib/jenkins/workspace/ACE_TAO_Ubuntu_22_04_Clang23_x64_Debug/ACE/ace/Thread_Adapter.cpp:94
#10 0x000077cad0b5d93e in ace_thread_adapter (args=0x61283cef3010) at /var/lib/jenkins/workspace/ACE_TAO_Ubuntu_22_04_Clang23_x64_Debug/ACE/ace/Base_Thread_Adapter.cpp:116
#11 0x000077cad0694a83 in start_thread (arg=<optimized out>) at ./nptl/pthread_create.c:442
#12 0x000077cad07268e0 in clone3 () at ../sysdeps/unix/sysv/linux/x86_64/clone3.S:81

Thread 4 (Thread 0x77cacf5fd640 (LWP 773975) "ContentFiltered"):
#0 __futex_abstimed_wait_common64 (private=-815806040, cancel=true, abstime=0x77cacf5fcad0, op=137, expected=0, futex_word=0x61283cef0e44) at ./nptl/futex-internal.c:57
#1 __futex_abstimed_wait_common (cancel=true, private=-815806040, abstime=0x77cacf5fcad0, clockid=-815805944, expected=0, futex_word=0x61283cef0e44) at ./nptl/futex-internal.c:87
#2 __GI___futex_abstimed_wait_cancelable64 (futex_word=futex_word@entry=0x61283cef0e44, expected=expected@entry=0, clockid=clockid@entry=1, abstime=abstime@entry=0x77cacf5fcad0, private=private@entry=0) at ./nptl/futex-internal.c:139
#3 0x000077cad0693e5b in __pthread_cond_wait_common (abstime=0x77cacf5fcad0, clockid=1, mutex=0x61283cef0de8, cond=0x61283cef0e18) at ./nptl/pthread_cond_wait.c:503
#4 ___pthread_cond_timedwait64 (cond=0x61283cef0e18, mutex=0x61283cef0de8, abstime=0x77cacf5fcad0) at ./nptl/pthread_cond_wait.c:652
#5 0x000077cad0b6f7ef in ACE_OS::cond_timedwait (cv=0x61283cef0e18, external_mutex=0x61283cef0de8, timeout=0x77cacf5fcc60) at ../ace/OS_NS_Thread.inl:401
#6 0x000077cad0b6fbc5 in ACE_Condition<ACE_Thread_Mutex>::wait (this=0x61283cef0e18, mutex=..., abstime=0x77cacf5fcc60) at /var/lib/jenkins/workspace/ACE_TAO_Ubuntu_22_04_Clang23_x64_Debug/ACE/ace/Condition_Thread_Mutex.cpp:92
#7 0x000077cad0b6fbf1 in ACE_Condition<ACE_Thread_Mutex>::wait (this=0x61283cef0e18, abstime=0x77cacf5fcc60) at /var/lib/jenkins/workspace/ACE_TAO_Ubuntu_22_04_Clang23_x64_Debug/ACE/ace/Condition_Thread_Mutex.cpp:101
#8 0x000077cad24147c2 in OpenDDS::DCPS::ConditionVariable<ACE_Thread_Mutex>::wait_until (this=0x61283cef0e18, expire_at=..., thread_status_manager=...) at DCPS/ConditionVariable.h:72
#9 0x000077cad24211ca in OpenDDS::DCPS::DispatchService::run_event_loop (this=0x61283cef0dd0) at DCPS/DispatchService.cpp:199
#10 0x000077cad242016d in OpenDDS::DCPS::DispatchService::run (arg=0x61283cef0dd0) at DCPS/DispatchService.cpp:161
#11 0x000077cad25791d8 in OpenDDS::DCPS::ThreadPool::run (arg=0x61283cef0ed0) at DCPS/ThreadPool.cpp:64
#12 0x000077cad0bca1e5 in ACE_OS_Thread_Adapter::invoke (this=0x61283ceeeea0) at /var/lib/jenkins/workspace/ACE_TAO_Ubuntu_22_04_Clang23_x64_Debug/ACE/ace/OS_Thread_Adapter.cpp:90
#13 0x000077cad0b5d93e in ace_thread_adapter (args=0x61283ceeeea0) at /var/lib/jenkins/workspace/ACE_TAO_Ubuntu_22_04_Clang23_x64_Debug/ACE/ace/Base_Thread_Adapter.cpp:116
#14 0x000077cad0694a83 in start_thread (arg=<optimized out>) at ./nptl/pthread_create.c:442
#15 0x000077cad07268e0 in clone3 () at ../sysdeps/unix/sysv/linux/x86_64/clone3.S:81

Thread 3 (Thread 0x77cacfdfe640 (LWP 773974) "ContentFiltered"):
#0 0x000077cad071b78d in __GI___select (nfds=6, readfds=0x61283ce72108, writefds=0x0, exceptfds=0x0, timeout=0x0) at ../sysdeps/unix/sysv/linux/select.c:69
#1 0x000077cad24fa19d in ACE_OS::select (width=6, rfds=0x61283ce72108, wfds=0x0, efds=0x0, timeout=0x0) at /var/lib/jenkins/workspace/ACE_TAO_Ubuntu_22_04_Clang23_x64_Debug/ACE/ace/OS_NS_sys_select.inl:41
#2 0x000077cad24f4d94 in ACE_Select_Reactor_T<ACE_Reactor_Token_T<ACE_Token> >::wait_for_multiple_events (this=0x61283ce720c0, dispatch_set=..., max_wait_time=0x0) at /var/lib/jenkins/workspace/ACE_TAO_Ubuntu_22_04_Clang23_x64_Debug/ACE/ace/Select_Reactor_T.cpp:1104
#3 0x000077cad24fa4d8 in ACE_Select_Reactor_T<ACE_Reactor_Token_T<ACE_Token> >::handle_events_i (this=0x61283ce720c0, max_wait_time=0x0) at /var/lib/jenkins/workspace/ACE_TAO_Ubuntu_22_04_Clang23_x64_Debug/ACE/ace/Select_Reactor_T.cpp:1453
#4 0x000077cad24f24fa in ACE_Select_Reactor_T<ACE_Reactor_Token_T<ACE_Token> >::handle_events (this=0x61283ce720c0, max_wait_time=0x0) at /var/lib/jenkins/workspace/ACE_TAO_Ubuntu_22_04_Clang23_x64_Debug/ACE/ace/Select_Reactor_T.cpp:1433
#5 0x000077cad0bf121f in ACE_Reactor::run_reactor_event_loop (this=0x61283ce6dbc0, eh=0x0) at /var/lib/jenkins/workspace/ACE_TAO_Ubuntu_22_04_Clang23_x64_Debug/ACE/ace/Reactor.cpp:192
#6 0x000077cad24ebc22 in OpenDDS::DCPS::ReactorTask::svc (this=0x61283ce68510) at DCPS/ReactorTask.cpp:234
#7 0x000077cad0c1a161 in ACE_Task_Base::svc_run (args=0x61283ce68718) at /var/lib/jenkins/workspace/ACE_TAO_Ubuntu_22_04_Clang23_x64_Debug/ACE/ace/Task.cpp:269
#8 0x000077cad0c1a8fc in ACE_Thread_Adapter::invoke_i (this=0x61283ce75510) at /var/lib/jenkins/workspace/ACE_TAO_Ubuntu_22_04_Clang23_x64_Debug/ACE/ace/Thread_Adapter.cpp:143
#9 0x000077cad0c1a7f4 in ACE_Thread_Adapter::invoke (this=0x61283ce75510) at /var/lib/jenkins/workspace/ACE_TAO_Ubuntu_22_04_Clang23_x64_Debug/ACE/ace/Thread_Adapter.cpp:94
#10 0x000077cad0b5d93e in ace_thread_adapter (args=0x61283ce75510) at /var/lib/jenkins/workspace/ACE_TAO_Ubuntu_22_04_Clang23_x64_Debug/ACE/ace/Base_Thread_Adapter.cpp:116
#11 0x000077cad0694a83 in start_thread (arg=<optimized out>) at ./nptl/pthread_create.c:442
#12 0x000077cad07268e0 in clone3 () at ../sysdeps/unix/sysv/linux/x86_64/clone3.S:81

Thread 2 (Thread 0x77cad05ff640 (LWP 773973) "ContentFiltered"):
#0 __futex_abstimed_wait_common64 (private=0, cancel=true, abstime=0x0, op=393, expected=0, futex_word=0x61283ce729c0) at ./nptl/futex-internal.c:57
#1 __futex_abstimed_wait_common (cancel=true, private=0, abstime=0x0, clockid=0, expected=0, futex_word=0x61283ce729c0) at ./nptl/futex-internal.c:87
#2 __GI___futex_abstimed_wait_cancelable64 (futex_word=futex_word@entry=0x61283ce729c0, expected=expected@entry=0, clockid=clockid@entry=0, abstime=abstime@entry=0x0, private=private@entry=0) at ./nptl/futex-internal.c:139
#3 0x000077cad0693a01 in __pthread_cond_wait_common (abstime=0x0, clockid=0, mutex=0x61283ce72968, cond=0x61283ce72998) at ./nptl/pthread_cond_wait.c:503
#4 ___pthread_cond_wait (cond=0x61283ce72998, mutex=0x61283ce72968) at ./nptl/pthread_cond_wait.c:627
#5 0x000077cad0b6f73d in ACE_OS::cond_wait (cv=0x61283ce72998, external_mutex=0x61283ce72968) at ../ace/OS_NS_Thread.inl:370
#6 0x000077cad0b6fb89 in ACE_Condition<ACE_Thread_Mutex>::wait (this=0x61283ce72998) at /var/lib/jenkins/workspace/ACE_TAO_Ubuntu_22_04_Clang23_x64_Debug/ACE/ace/Condition_Thread_Mutex.cpp:84
#7 0x000077cad3710e6e in OpenDDS::DCPS::ConditionVariable<ACE_Thread_Mutex>::wait (this=0x61283ce72998, thread_status_manager=...) at /var/lib/jenkins/workspace/OpenDDS_ACE8_Ubuntu_22_04_Clang23_x64_Debug/dds/DCPS/ConditionVariable.h:56
#8 0x000077cad242120b in OpenDDS::DCPS::DispatchService::run_event_loop (this=0x61283ce72950) at DCPS/DispatchService.cpp:201
#9 0x000077cad242016d in OpenDDS::DCPS::DispatchService::run (arg=0x61283ce72950) at DCPS/DispatchService.cpp:161
#10 0x000077cad25791d8 in OpenDDS::DCPS::ThreadPool::run (arg=0x61283ce72a50) at DCPS/ThreadPool.cpp:64
#11 0x000077cad0bca1e5 in ACE_OS_Thread_Adapter::invoke (this=0x61283ce6ecf0) at /var/lib/jenkins/workspace/ACE_TAO_Ubuntu_22_04_Clang23_x64_Debug/ACE/ace/OS_Thread_Adapter.cpp:90
#12 0x000077cad0b5d93e in ace_thread_adapter (args=0x61283ce6ecf0) at /var/lib/jenkins/workspace/ACE_TAO_Ubuntu_22_04_Clang23_x64_Debug/ACE/ace/Base_Thread_Adapter.cpp:116
#13 0x000077cad0694a83 in start_thread (arg=<optimized out>) at ./nptl/pthread_create.c:442
#14 0x000077cad07268e0 in clone3 () at ../sysdeps/unix/sysv/linux/x86_64/clone3.S:81

Thread 1 (Thread 0x77cad38b0740 (LWP 773972) "ContentFiltered"):
#0 __futex_abstimed_wait_common64 (private=0, cancel=true, abstime=0x0, op=393, expected=0, futex_word=0x61283cf23c40) at ./nptl/futex-internal.c:57
#1 __futex_abstimed_wait_common (cancel=true, private=0, abstime=0x0, clockid=0, expected=0, futex_word=0x61283cf23c40) at ./nptl/futex-internal.c:87
#2 __GI___futex_abstimed_wait_cancelable64 (futex_word=futex_word@entry=0x61283cf23c40, expected=expected@entry=0, clockid=clockid@entry=0, abstime=abstime@entry=0x0, private=private@entry=0) at ./nptl/futex-internal.c:139
#3 0x000077cad0693a01 in __pthread_cond_wait_common (abstime=0x0, clockid=0, mutex=0x61283cf23be8, cond=0x61283cf23c18) at ./nptl/pthread_cond_wait.c:503
#4 ___pthread_cond_wait (cond=0x61283cf23c18, mutex=0x61283cf23be8) at ./nptl/pthread_cond_wait.c:627
#5 0x000077cad0b6f73d in ACE_OS::cond_wait (cv=0x61283cf23c18, external_mutex=0x61283cf23be8) at ../ace/OS_NS_Thread.inl:370
#6 0x000077cad0b6f533 in ACE_Condition<ACE_Recursive_Thread_Mutex>::wait (this=0x61283cf23c18, mutex=..., abstime=0x0) at /var/lib/jenkins/workspace/ACE_TAO_Ubuntu_22_04_Clang23_x64_Debug/ACE/ace/Condition_Recursive_Thread_Mutex.cpp:88
#7 0x000077cad0b6f4c1 in ACE_Condition<ACE_Recursive_Thread_Mutex>::wait (this=0x61283cf23c18, abstime=0x0) at /var/lib/jenkins/workspace/ACE_TAO_Ubuntu_22_04_Clang23_x64_Debug/ACE/ace/Condition_Recursive_Thread_Mutex.cpp:64
#8 0x000077cad2511412 in OpenDDS::DCPS::ConditionVariable<ACE_Recursive_Thread_Mutex>::wait (this=0x61283cf23c18, thread_status_manager=...) at DCPS/ConditionVariable.h:56
#9 0x000077cad259782e in DDS::WaitSet::wait (this=0x61283cf23be0, active_conditions=..., timeout=...) at DCPS/WaitSet.cpp:148
#10 0x00006128002f6d95 in Utils::waitForSample (dr=...) at /var/lib/jenkins/workspace/OpenDDS_ACE8_Ubuntu_22_04_Clang23_x64_Debug/tests/Utils/WaitForSample.h:22
#11 0x00006128002f0b7d in run_filtering_test (ts=..., pub=..., sub=..., sub2=...) at /var/lib/jenkins/workspace/OpenDDS_ACE8_Ubuntu_22_04_Clang23_x64_Debug/tests/DCPS/ContentFilteredTopic/ContentFilteredTopicTest.cpp:272
#12 0x00006128002f4cf6 in run_test (argc=2, argv=0x7ffca198dda8) at /var/lib/jenkins/workspace/OpenDDS_ACE8_Ubuntu_22_04_Clang23_x64_Debug/tests/DCPS/ContentFilteredTopic/ContentFilteredTopicTest.cpp:678
#13 0x00006128002f4ff9 in main (argc=6, argv=0x7ffca198dda8) at /var/lib/jenkins/workspace/OpenDDS_ACE8_Ubuntu_22_04_Clang23_x64_Debug/tests/DCPS/ContentFilteredTopic/ContentFilteredTopicTest.cpp:693
[Inferior 1 (process 773972) detached]
======= End stuck stacks =======
[Details] ERROR: test returned -1
[Details] auto_run_tests.pl: ERROR: "tests/DCPS/ContentFilteredTopic/run_test.pl rtps_disc nopub dynamic" returned with status 1

tests/DCPS/XTypes/run_test.pl --dynamic-writers

[Details] ERROR: <./subscriber> exited with coredump from signal 6 : ABRT
[Details] 2026-10-08 19:27:31: ERROR: reader_MutableUnion terminated with a signal
[Details] 2026-10-08 19:27:31: ERROR: writer_MutableUnion finished and returned 1
[Details] ERROR: read_i: wait failed: Timeout
[Details] ERROR: read_single MutableUnion failed
[Details] ERROR: set_int32: resolve_string_path: Error
[Details] ERROR: read_i: wait failed: Timeout
[Details] ERROR: control read failed
[Details] test FAILED (process_error).
[Details] 2026-10-08 19:27:51: ERROR: reader_Tryconstruct finished and returned 1
[Details] 2026-10-08 19:27:51: ERROR: writer_Tryconstruct finished and returned 1
[Details] ERROR: read_i: wait failed: Timeout
[Details] ERROR: read_single Trim20Struct failed
[Details] ERROR: wait on control_dw condition returned Timeout
[Details] ERROR: set_string: resolve_string_path: Error
[Details] ERROR: read_i: wait failed: Timeout
[Details] ERROR: control read failed
[Details] test FAILED (process_error).
[Details] 2026-10-08 19:28:08: ERROR: reader_Match_no_xtypes_yn finished and returned 1
[Details] 2026-10-08 19:28:08: ERROR: writer_Match_no_xtypes_yn finished and returned 1
[Details] ERROR: read_i: wait failed: Timeout
[Details] ERROR: read_single AppendableStructNoXTypes failed
[Details] ERROR: wait on control_dw condition returned Timeout
[Details] ERROR: set_int32: resolve_string_path: Error
[Details] ERROR: read_i: wait failed: Timeout
[Details] ERROR: control read failed
[Details] test FAILED (process_error).
[Details] 2026-10-08 19:28:27: ERROR: reader_Dependency finished and returned 1
[Details] 2026-10-08 19:28:27: ERROR: writer_Dependency finished and returned 1
[Details] ERROR: read_i: wait failed: Timeout
[Details] ERROR: read_single AppendableStruct failed
[Details] ERROR: wait on control_dw condition returned Timeout
[Details] ERROR: set_int32: resolve_string_path: Error
[Details] ERROR: set_int32: resolve_string_path: Error
[Details] ERROR: read_i: wait failed: Timeout
[Details] ERROR: control read failed
[Details] test FAILED (process_error).
[Details] 2026-10-08 19:28:43: ERROR: reader_PlainCdr finished and returned 1
[Details] 2026-10-08 19:28:43: ERROR: writer_PlainCdr finished and returned 1
[Details] ERROR: read_i: wait failed: Timeout
[Details] ERROR: read_single PlainCdrStruct failed
[Details] ERROR: wait on control_dw condition returned Timeout
[Details] ERROR: set_int32: resolve_string_path: Error
[Details] ERROR: set_int32: resolve_string_path: Error
[Details] ERROR: read_i: wait failed: Timeout
[Details] ERROR: control read failed
[Details] test FAILED (process_error).
[Details] 2026-10-08 19:29:00: ERROR: reader_MutableStruct finished and returned 1
[Details] 2026-10-08 19:29:00: ERROR: writer_MutableStruct finished and returned 1
[Details] ERROR: read_i: wait failed: Timeout
[Details] ERROR: read_single MutableStruct failed
[Details] ERROR: wait on control_dw condition returned Timeout
[Details] ERROR: set_int32: resolve_string_path: Error
[Details] ERROR: set_int32: resolve_string_path: Error
[Details] ERROR: read_i: wait failed: Timeout
[Details] ERROR: control read failed
[Details] test FAILED (process_error).
[Details] 2026-10-08 19:29:16: ERROR: reader_NoXTypesMatchTypeNames finished and returned 1
[Details] 2026-10-08 19:29:16: ERROR: writer_NoXTypesMatchTypeNames finished and returned 1
[Details] ERROR: read_i: wait failed: Timeout
[Details] ERROR: read_single AppendableStructNoXTypes failed
[Details] ERROR: wait on control_dw condition returned Timeout
[Details] ERROR: set_int32: resolve_string_path: Error
[Details] ERROR: read_i: wait failed: Timeout
[Details] ERROR: control read failed
[Details] test FAILED (process_error).
[Details] 2026-10-08 19:29:32: ERROR: reader_ExtendedAppendableMatch finished and returned 1
[Details] 2026-10-08 19:29:32: ERROR: writer_ExtendedAppendableMatch finished and returned 1
[Details] ERROR: read_i: wait failed: Timeout
[Details] ERROR: read_single ExtendedAppendableStruct failed
[Details] ERROR: wait on control_dw condition returned Timeout
[Details] ERROR: set_int32: resolve_string_path: Error
[Details] ERROR: read_i: wait failed: Timeout
[Details] ERROR: control read failed
[Details] test FAILED (process_error).
[Details] 2026-10-08 19:29:49: ERROR: reader_DisallowTypeCoercion_FinalStructMatch finished and returned 1
[Details] 2026-10-08 19:29:49: ERROR: writer_DisallowTypeCoercion_FinalStructMatch finished and returned 1
[Details] ERROR: read_i: wait failed: Timeout
[Details] ERROR: read_single FinalStructSub failed
[Details] ERROR: wait on control_dw condition returned Timeout
[Details] ERROR: set_int32: resolve_string_path: Error
[Details] ERROR: read_i: wait failed: Timeout
[Details] ERROR: control read failed
[Details] test FAILED (process_error).
[Details] 2026-10-08 19:30:05: ERROR: reader_AppendableMatch finished and returned 1
[Details] 2026-10-08 19:30:05: ERROR: writer_AppendableMatch finished and returned 1
[Details] ERROR: read_i: wait failed: Timeout
[Details] ERROR: read_single AppendableStruct failed
[Details] ERROR: wait on control_dw condition returned Timeout
[Details] ERROR: set_int32: resolve_string_path: Error
[Details] ERROR: set_int32: resolve_string_path: Error
[Details] ERROR: read_i: wait failed: Timeout
[Details] ERROR: control read failed
[Details] test FAILED (process_error).
[Details] 2026-10-08 19:30:21: ERROR: reader_Match_no_xtypes_nn finished and returned 1
[Details] 2026-10-08 19:30:21: ERROR: writer_Match_no_xtypes_nn finished and returned 1
[Details] ERROR: read_i: wait failed: Timeout
[Details] ERROR: read_single AppendableStructNoXTypes failed
[Details] ERROR: wait on control_dw condition returned Timeout
[Details] ERROR: set_int32: resolve_string_path: Error
[Details] ERROR: read_i: wait failed: Timeout
[Details] ERROR: control read failed
[Details] test FAILED (process_error).
[Details] ERROR: <./subscriber> exited with coredump from signal 6 : ABRT
[Details] 2026-10-08 19:30:33: ERROR: reader_IgnoreMemberNames_MutableUnionMatch terminated with a signal
[Details] 2026-10-08 19:30:33: ERROR: writer_IgnoreMemberNames_MutableUnionMatch finished and returned 1
[Details] ERROR: read_i: wait failed: Timeout
[Details] ERROR: read_single MutableUnion failed
[Details] ERROR: set_int32: resolve_string_path: Error
[Details] ERROR: read_i: wait failed: Timeout
[Details] ERROR: control read failed
[Details] test FAILED (process_error).
[Details] 2026-10-08 19:30:48: ERROR: reader_FinalStructMatch finished and returned 1
[Details] 2026-10-08 19:30:48: ERROR: writer_FinalStructMatch finished and returned 1
[Details] ERROR: read_i: wait failed: Timeout
[Details] ERROR: read_single FinalStructSub failed
[Details] ERROR: wait on control_dw condition returned Timeout
[Details] ERROR: set_int32: resolve_string_path: Error
[Details] ERROR: read_i: wait failed: Timeout
[Details] ERROR: control read failed
[Details] test FAILED (process_error).
[Details] 2026-10-08 19:31:04: ERROR: reader_IgnoreMemberNames_MutableStructMatch finished and returned 1
[Details] 2026-10-08 19:31:04: ERROR: writer_IgnoreMemberNames_MutableStructMatch finished and returned 1
[Details] ERROR: read_i: wait failed: Timeout
[Details] ERROR: read_single MutableStruct failed
[Details] ERROR: wait on control_dw condition returned Timeout
[Details] ERROR: set_int32: resolve_string_path: Error
[Details] ERROR: set_int32: resolve_string_path: Error
[Details] ERROR: read_i: wait failed: Timeout
[Details] ERROR: control read failed
[Details] test FAILED (process_error).
[Details] 2026-10-08 19:31:20: ERROR: reader_ExtendedMutableStructMatch finished and returned 1
[Details] 2026-10-08 19:31:20: ERROR: writer_ExtendedMutableStructMatch finished and returned 1
[Details] ERROR: read_i: wait failed: Timeout
[Details] ERROR: read_single MutableStruct failed
[Details] ERROR: wait on control_dw condition returned Timeout
[Details] ERROR: set_int32: resolve_string_path: Error
[Details] ERROR: read_i: wait failed: Timeout
[Details] ERROR: control read failed
[Details] test FAILED (process_error).
[Details] 2026-10-08 19:31:35: ERROR: reader_Match_no_xtypes_ny finished and returned 1
[Details] 2026-10-08 19:31:35: ERROR: writer_Match_no_xtypes_ny finished and returned 1
[Details] ERROR: read_i: wait failed: Timeout
[Details] ERROR: read_single AppendableStructNoXTypes failed
[Details] ERROR: wait on control_dw condition returned Timeout
[Details] ERROR: set_int32: resolve_string_path: Error
[Details] ERROR: read_i: wait failed: Timeout
[Details] ERROR: control read failed
[Details] test FAILED (process_error).
[Details] auto_run_tests.pl: ERROR: "tests/DCPS/XTypes/run_test.pl --dynamic-writers" returned with status 1

tests/DCPS/XTypes/run_test.pl --dynamic-readers

[Details] 2026-10-08 19:31:36: ERROR: reader_PlainCdr finished and returned 1
[Details] 2026-10-08 19:31:46: ERROR: writer_PlainCdr finished and returned 1
[Details] ERROR: check_int32: resolve_string_path: Error
[Details] ERROR: check_int32 for PlainCdrStruct.key_field failed
[Details] ERROR: read_i: wait failed: Timeout
[Details] ERROR: control read failed
[Details] test FAILED (process_error).
[Details] 2026-10-08 19:31:46: ERROR: reader_Match_no_xtypes_yn finished and returned 1
[Details] 2026-10-08 19:31:56: ERROR: writer_Match_no_xtypes_yn finished and returned 1
[Details] ERROR: check_int32: resolve_string_path: Error
[Details] ERROR: check_int32 for AppendableStructNoXTypes.key_field failed
[Details] ERROR: read_i: wait failed: Timeout
[Details] ERROR: control read failed
[Details] test FAILED (process_error).
[Details] 2026-10-08 19:31:57: ERROR: reader_NoXTypesMatchTypeNames finished and returned 1
[Details] 2026-10-08 19:32:07: ERROR: writer_NoXTypesMatchTypeNames finished and returned 1
[Details] ERROR: check_int32: resolve_string_path: Error
[Details] ERROR: check_int32 for AppendableStructNoXTypes.key_field failed
[Details] ERROR: read_i: wait failed: Timeout
[Details] ERROR: control read failed
[Details] test FAILED (process_error).
[Details] 2026-10-08 19:32:13: ERROR: reader_IgnoreMemberNames_MutableStructMatch finished and returned 1
[Details] 2026-10-08 19:32:23: ERROR: writer_IgnoreMemberNames_MutableStructMatch finished and returned 1
[Details] ERROR: check_int32: resolve_string_path: Error
[Details] ERROR: check_int32 for MutableStruct.key_field failed
[Details] ERROR: check_int32: resolve_string_path: Error
[Details] ERROR: check_int32 for MutableStruct.additional_field failed
[Details] ERROR: read_i: wait failed: Timeout
[Details] ERROR: control read failed
[Details] test FAILED (process_error).
[Details] 2026-10-08 19:32:24: ERROR: reader_MutableStruct finished and returned 1
[Details] 2026-10-08 19:32:33: ERROR: writer_MutableStruct finished and returned 1
[Details] ERROR: check_int32: resolve_string_path: Error
[Details] ERROR: check_int32 for MutableStruct.key_field failed
[Details] ERROR: check_int32: resolve_string_path: Error
[Details] ERROR: check_int32 for MutableStruct.additional_field failed
[Details] ERROR: read_i: wait failed: Timeout
[Details] ERROR: control read failed
[Details] test FAILED (process_error).
[Details] 2026-10-08 19:32:34: ERROR: reader_FinalStructMatch finished and returned 1
[Details] 2026-10-08 19:32:44: ERROR: writer_FinalStructMatch finished and returned 1
[Details] ERROR: check_int32: resolve_string_path: Error
[Details] ERROR: check_int32 for FinalStructSub.key_field failed
[Details] ERROR: read_i: wait failed: Timeout
[Details] ERROR: control read failed
[Details] test FAILED (process_error).
[Details] 2026-10-08 19:32:48: ERROR: reader_IgnoreMemberNames_MutableUnionMatch finished and returned 1
[Details] 2026-10-08 19:32:58: ERROR: writer_IgnoreMemberNames_MutableUnionMatch finished and returned 1
[Details] ERROR: check_int32: resolve_string_path: Error
[Details] ERROR: check_int32 for MutableUnion.discriminator failed
[Details] ERROR: read_i: wait failed: Timeout
[Details] ERROR: control read failed
[Details] test FAILED (process_error).
[Details] 2026-10-08 19:33:02: ERROR: reader_Dependency finished and returned 1
[Details] 2026-10-08 19:33:12: ERROR: writer_Dependency finished and returned 1
[Details] ERROR: check_int32: resolve_string_path: Error
[Details] ERROR: check_int32 for AppendableStruct.key_field failed
[Details] ERROR: read_i: wait failed: Timeout
[Details] ERROR: control read failed
[Details] test FAILED (process_error).
[Details] 2026-10-08 19:33:13: ERROR: reader_Match_no_xtypes_nn finished and returned 1
[Details] 2026-10-08 19:33:23: ERROR: writer_Match_no_xtypes_nn finished and returned 1
[Details] ERROR: check_int32: resolve_string_path: Error
[Details] ERROR: check_int32 for AppendableStructNoXTypes.key_field failed
[Details] ERROR: read_i: wait failed: Timeout
[Details] ERROR: control read failed
[Details] test FAILED (process_error).
[Details] 2026-10-08 19:33:24: ERROR: reader_DisallowTypeCoercion_FinalStructMatch finished and returned 1
[Details] 2026-10-08 19:33:34: ERROR: writer_DisallowTypeCoercion_FinalStructMatch finished and returned 1
[Details] ERROR: check_int32: resolve_string_path: Error
[Details] ERROR: check_int32 for FinalStructSub.key_field failed
[Details] ERROR: read_i: wait failed: Timeout
[Details] ERROR: control read failed
[Details] test FAILED (process_error).
[Details] 2026-10-08 19:33:36: ERROR: reader_AppendableMatch finished and returned 1
[Details] 2026-10-08 19:33:46: ERROR: writer_AppendableMatch finished and returned 1
[Details] ERROR: check_int32: resolve_string_path: Error
[Details] ERROR: check_int32 for AppendableStruct.key_field failed
[Details] ERROR: read_i: wait failed: Timeout
[Details] ERROR: control read failed
[Details] test FAILED (process_error).
[Details] 2026-10-08 19:33:47: ERROR: reader_Match_no_xtypes_ny finished and returned 1
[Details] 2026-10-08 19:33:57: ERROR: writer_Match_no_xtypes_ny finished and returned 1
[Details] ERROR: check_int32: resolve_string_path: Error
[Details] ERROR: check_int32 for AppendableStructNoXTypes.key_field failed
[Details] ERROR: read_i: wait failed: Timeout
[Details] ERROR: control read failed
[Details] test FAILED (process_error).
[Details] 2026-10-08 19:34:00: ERROR: reader_MutableUnion finished and returned 1
[Details] 2026-10-08 19:34:10: ERROR: writer_MutableUnion finished and returned 1
[Details] ERROR: check_int32: resolve_string_path: Error
[Details] ERROR: check_int32 for MutableUnion.discriminator failed
[Details] ERROR: read_i: wait failed: Timeout
[Details] ERROR: control read failed
[Details] test FAILED (process_error).
[Details] auto_run_tests.pl: ERROR: "tests/DCPS/XTypes/run_test.pl --dynamic-readers" returned with status 1

tests/DCPS/XTypes/run_test.pl --dynamic-writers --dynamic-readers

[Details] 2026-10-08 19:34:27: ERROR: reader_MutableStruct finished and returned 1
[Details] 2026-10-08 19:34:27: ERROR: writer_MutableStruct finished and returned 1
[Details] ERROR: read_i: wait failed: Timeout
[Details] ERROR: read_single MutableStruct failed
[Details] ERROR: wait on control_dw condition returned Timeout
[Details] ERROR: set_int32: resolve_string_path: Error
[Details] ERROR: set_int32: resolve_string_path: Error
[Details] ERROR: read_i: wait failed: Timeout
[Details] ERROR: control read failed
[Details] test FAILED (process_error).
[Details] ERROR: set_string: resolve_string_path: Error
[Details] test FAILED (success).
[Details] ERROR: set_int32: resolve_string_path: Error
[Details] test FAILED (success).
[Details] 2026-10-08 19:34:48: ERROR: reader_Match_no_xtypes_nn finished and returned 1
[Details] 2026-10-08 19:34:48: ERROR: writer_Match_no_xtypes_nn finished and returned 1
[Details] ERROR: read_i: wait failed: Timeout
[Details] ERROR: read_single AppendableStructNoXTypes failed
[Details] ERROR: wait on control_dw condition returned Timeout
[Details] ERROR: set_int32: resolve_string_path: Error
[Details] ERROR: read_i: wait failed: Timeout
[Details] ERROR: control read failed
[Details] test FAILED (process_error).
[Details] 2026-10-08 19:35:06: ERROR: reader_NoXTypesMatchTypeNames finished and returned 1
[Details] 2026-10-08 19:35:06: ERROR: writer_NoXTypesMatchTypeNames finished and returned 1
[Details] ERROR: read_i: wait failed: Timeout
[Details] ERROR: read_single AppendableStructNoXTypes failed
[Details] ERROR: wait on control_dw condition returned Timeout
[Details] ERROR: set_int32: resolve_string_path: Error
[Details] ERROR: read_i: wait failed: Timeout
[Details] ERROR: control read failed
[Details] test FAILED (process_error).
[Details] 2026-10-08 19:35:23: ERROR: reader_FinalStructMatch finished and returned 1
[Details] 2026-10-08 19:35:23: ERROR: writer_FinalStructMatch finished and returned 1
[Details] ERROR: read_i: wait failed: Timeout
[Details] ERROR: read_single FinalStructSub failed
[Details] ERROR: wait on control_dw condition returned Timeout
[Details] ERROR: set_int32: resolve_string_path: Error
[Details] ERROR: read_i: wait failed: Timeout
[Details] ERROR: control read failed
[Details] test FAILED (process_error).
[Details] 2026-10-08 19:35:39: ERROR: reader_AppendableMatch finished and returned 1
[Details] 2026-10-08 19:35:39: ERROR: writer_AppendableMatch finished and returned 1
[Details] ERROR: read_i: wait failed: Timeout
[Details] ERROR: read_single AppendableStruct failed
[Details] ERROR: wait on control_dw condition returned Timeout
[Details] ERROR: set_int32: resolve_string_path: Error
[Details] ERROR: set_int32: resolve_string_path: Error
[Details] ERROR: read_i: wait failed: Timeout
[Details] ERROR: control read failed
[Details] test FAILED (process_error).
[Details] 2026-10-08 19:35:51: ERROR: reader_MutableUnion finished and returned 1
[Details] 2026-10-08 19:35:51: ERROR: writer_MutableUnion finished and returned 1
[Details] ERROR: read_i: wait failed: Timeout
[Details] ERROR: read_single MutableUnion failed
[Details] ERROR: check_int32 for MutableUnion.key_field failed
[Details] ERROR: set_int32: resolve_string_path: Error
[Details] ERROR: read_i: wait failed: Timeout
[Details] ERROR: control read failed
[Details] test FAILED (process_error).
[Details] 2026-10-08 19:36:06: ERROR: reader_Match_no_xtypes_ny finished and returned 1
[Details] 2026-10-08 19:36:06: ERROR: writer_Match_no_xtypes_ny finished and returned 1
[Details] ERROR: read_i: wait failed: Timeout
[Details] ERROR: read_single AppendableStructNoXTypes failed
[Details] ERROR: wait on control_dw condition returned Timeout
[Details] ERROR: set_int32: resolve_string_path: Error
[Details] ERROR: read_i: wait failed: Timeout
[Details] ERROR: control read failed
[Details] test FAILED (process_error).
[Details] 2026-10-08 19:36:24: ERROR: reader_Dependency finished and returned 1
[Details] 2026-10-08 19:36:24: ERROR: writer_Dependency finished and returned 1
[Details] ERROR: read_i: wait failed: Timeout
[Details] ERROR: read_single AppendableStruct failed
[Details] ERROR: wait on control_dw condition returned Timeout
[Details] ERROR: set_int32: resolve_string_path: Error
[Details] ERROR: set_int32: resolve_string_path: Error
[Details] ERROR: read_i: wait failed: Timeout
[Details] ERROR: control read failed
[Details] test FAILED (process_error).
[Details] 2026-10-08 19:36:34: ERROR: reader_IgnoreMemberNames_MutableUnionMatch finished and returned 1
[Details] 2026-10-08 19:36:34: ERROR: writer_IgnoreMemberNames_MutableUnionMatch finished and returned 1
[Details] ERROR: read_i: wait failed: Timeout
[Details] ERROR: read_single MutableUnion failed
[Details] ERROR: check_int32 for MutableUnion.key_field failed
[Details] ERROR: set_int32: resolve_string_path: Error
[Details] ERROR: read_i: wait failed: Timeout
[Details] ERROR: control read failed
[Details] test FAILED (process_error).
[Details] ERROR: set_int32: resolve_string_path: Error
[Details] test FAILED (success).
[Details] 2026-10-08 19:36:51: ERROR: reader_DisallowTypeCoercion_FinalStructMatch finished and returned 1
[Details] 2026-10-08 19:36:51: ERROR: writer_DisallowTypeCoercion_FinalStructMatch finished and returned 1
[Details] ERROR: read_i: wait failed: Timeout
[Details] ERROR: read_single FinalStructSub failed
[Details] ERROR: wait on control_dw condition returned Timeout
[Details] ERROR: set_int32: resolve_string_path: Error
[Details] ERROR: read_i: wait failed: Timeout
[Details] ERROR: control read failed
[Details] test FAILED (process_error).
[Details] 2026-10-08 19:37:08: ERROR: reader_Match_no_xtypes_yn finished and returned 1
[Details] 2026-10-08 19:37:08: ERROR: writer_Match_no_xtypes_yn finished and returned 1
[Details] ERROR: read_i: wait failed: Timeout
[Details] ERROR: read_single AppendableStructNoXTypes failed
[Details] ERROR: wait on control_dw condition returned Timeout
[Details] ERROR: set_int32: resolve_string_path: Error
[Details] ERROR: read_i: wait failed: Timeout
[Details] ERROR: control read failed
[Details] test FAILED (process_error).
[Details] 2026-10-08 19:37:25: ERROR: reader_IgnoreMemberNames_MutableStructMatch finished and returned 1
[Details] 2026-10-08 19:37:25: ERROR: writer_IgnoreMemberNames_MutableStructMatch finished and returned 1
[Details] ERROR: read_i: wait failed: Timeout
[Details] ERROR: read_single MutableStruct failed
[Details] ERROR: wait on control_dw condition returned Timeout
[Details] ERROR: set_int32: resolve_string_path: Error
[Details] ERROR: set_int32: resolve_string_path: Error
[Details] ERROR: read_i: wait failed: Timeout
[Details] ERROR: control read failed
[Details] test FAILED (process_error).
[Details] 2026-10-08 19:37:40: ERROR: reader_PlainCdr finished and returned 1
[Details] 2026-10-08 19:37:40: ERROR: writer_PlainCdr finished and returned 1
[Details] ERROR: read_i: wait failed: Timeout
[Details] ERROR: read_single PlainCdrStruct failed
[Details] ERROR: wait on control_dw condition returned Timeout
[Details] ERROR: set_int32: resolve_string_path: Error
[Details] ERROR: set_int32: resolve_string_path: Error
[Details] ERROR: read_i: wait failed: Timeout
[Details] ERROR: control read failed
[Details] test FAILED (process_error).
[Details] auto_run_tests.pl: ERROR: "tests/DCPS/XTypes/run_test.pl --dynamic-writers --dynamic-readers" returned with status 1

tests/DCPS/ZeroEnum/run_test.pl

[Details] ERROR: <subscriber> exited with coredump from signal 6 : ABRT
[Details] 2026-10-08 19:47:32: ERROR: subscriber terminated with a signal
[Details] ERROR: publisher timedout
======= Begin stuck stacks =======
[New LWP 792388]
[New LWP 792390]
[New LWP 792393]
[New LWP 792395]
[New LWP 792397]
[New LWP 792399]
[Thread debugging using libthread_db enabled]
Using host libthread_db library "/lib/x86_64-linux-gnu/libthread_db.so.1".
0x00007f37566e57b8 in __GI___clock_nanosleep (clock_id=clock_id@entry=0, flags=flags@entry=0, req=0x7ffc8e65ab68, rem=0x0) at ../sysdeps/unix/sysv/linux/clock_nanosleep.c:78
78 ../sysdeps/unix/sysv/linux/clock_nanosleep.c: No such file or directory.

Thread 7 (Thread 0x7f37477fe640 (LWP 792399) "publisher"):
#0 0x00007f375671b78d in __GI___select (nfds=14, readfds=0x5924eeb2e818, writefds=0x0, exceptfds=0x0, timeout=0x0) at ../sysdeps/unix/sysv/linux/select.c:69
#1 0x00007f37586fa19d in ACE_OS::select (width=14, rfds=0x5924eeb2e818, wfds=0x0, efds=0x0, timeout=0x0) at /var/lib/jenkins/workspace/ACE_TAO_Ubuntu_22_04_Clang23_x64_Debug/ACE/ace/OS_NS_sys_select.inl:41
#2 0x00007f37586f4d94 in ACE_Select_Reactor_T<ACE_Reactor_Token_T<ACE_Token> >::wait_for_multiple_events (this=0x5924eeb2e7d0, dispatch_set=..., max_wait_time=0x0) at /var/lib/jenkins/workspace/ACE_TAO_Ubuntu_22_04_Clang23_x64_Debug/ACE/ace/Select_Reactor_T.cpp:1104
#3 0x00007f37586fa4d8 in ACE_Select_Reactor_T<ACE_Reactor_Token_T<ACE_Token> >::handle_events_i (this=0x5924eeb2e7d0, max_wait_time=0x0) at /var/lib/jenkins/workspace/ACE_TAO_Ubuntu_22_04_Clang23_x64_Debug/ACE/ace/Select_Reactor_T.cpp:1453
#4 0x00007f37586f24fa in ACE_Select_Reactor_T<ACE_Reactor_Token_T<ACE_Token> >::handle_events (this=0x5924eeb2e7d0, max_wait_time=0x0) at /var/lib/jenkins/workspace/ACE_TAO_Ubuntu_22_04_Clang23_x64_Debug/ACE/ace/Select_Reactor_T.cpp:1433
#5 0x00007f3756bf121f in ACE_Reactor::run_reactor_event_loop (this=0x5924eeb2d220, eh=0x0) at /var/lib/jenkins/workspace/ACE_TAO_Ubuntu_22_04_Clang23_x64_Debug/ACE/ace/Reactor.cpp:192
#6 0x00007f37586ebc22 in OpenDDS::DCPS::ReactorTask::svc (this=0x5924eeb2dd00) at DCPS/ReactorTask.cpp:234
#7 0x00007f3756c1a161 in ACE_Task_Base::svc_run (args=0x5924eeb2df08) at /var/lib/jenkins/workspace/ACE_TAO_Ubuntu_22_04_Clang23_x64_Debug/ACE/ace/Task.cpp:269
#8 0x00007f3756c1a8fc in ACE_Thread_Adapter::invoke_i (this=0x5924eeb2ca80) at /var/lib/jenkins/workspace/ACE_TAO_Ubuntu_22_04_Clang23_x64_Debug/ACE/ace/Thread_Adapter.cpp:143
#9 0x00007f3756c1a7f4 in ACE_Thread_Adapter::invoke (this=0x5924eeb2ca80) at /var/lib/jenkins/workspace/ACE_TAO_Ubuntu_22_04_Clang23_x64_Debug/ACE/ace/Thread_Adapter.cpp:94
#10 0x00007f3756b5d93e in ace_thread_adapter (args=0x5924eeb2ca80) at /var/lib/jenkins/workspace/ACE_TAO_Ubuntu_22_04_Clang23_x64_Debug/ACE/ace/Base_Thread_Adapter.cpp:116
#11 0x00007f3756694a83 in start_thread (arg=<optimized out>) at ./nptl/pthread_create.c:442
#12 0x00007f37567268e0 in clone3 () at ../sysdeps/unix/sysv/linux/x86_64/clone3.S:81

Thread 6 (Thread 0x7f3747fff640 (LWP 792397) "publisher"):
#0 __futex_abstimed_wait_common64 (private=1207953832, cancel=true, abstime=0x7f3747ffead0, op=137, expected=0, futex_word=0x5924eeb2be90) at ./nptl/futex-internal.c:57
#1 __futex_abstimed_wait_common (cancel=true, private=1207953832, abstime=0x7f3747ffead0, clockid=1207953928, expected=0, futex_word=0x5924eeb2be90) at ./nptl/futex-internal.c:87
#2 __GI___futex_abstimed_wait_cancelable64 (futex_word=futex_word@entry=0x5924eeb2be90, expected=expected@entry=0, clockid=clockid@entry=1, abstime=abstime@entry=0x7f3747ffead0, private=private@entry=0) at ./nptl/futex-internal.c:139
#3 0x00007f3756693e5b in __pthread_cond_wait_common (abstime=0x7f3747ffead0, clockid=1, mutex=0x5924eeb2be38, cond=0x5924eeb2be68) at ./nptl/pthread_cond_wait.c:503
#4 ___pthread_cond_timedwait64 (cond=0x5924eeb2be68, mutex=0x5924eeb2be38, abstime=0x7f3747ffead0) at ./nptl/pthread_cond_wait.c:652
#5 0x00007f3756b6f7ef in ACE_OS::cond_timedwait (cv=0x5924eeb2be68, external_mutex=0x5924eeb2be38, timeout=0x7f3747ffec60) at ../ace/OS_NS_Thread.inl:401
#6 0x00007f3756b6fbc5 in ACE_Condition<ACE_Thread_Mutex>::wait (this=0x5924eeb2be68, mutex=..., abstime=0x7f3747ffec60) at /var/lib/jenkins/workspace/ACE_TAO_Ubuntu_22_04_Clang23_x64_Debug/ACE/ace/Condition_Thread_Mutex.cpp:92
#7 0x00007f3756b6fbf1 in ACE_Condition<ACE_Thread_Mutex>::wait (this=0x5924eeb2be68, abstime=0x7f3747ffec60) at /var/lib/jenkins/workspace/ACE_TAO_Ubuntu_22_04_Clang23_x64_Debug/ACE/ace/Condition_Thread_Mutex.cpp:101
#8 0x00007f37586147c2 in OpenDDS::DCPS::ConditionVariable<ACE_Thread_Mutex>::wait_until (this=0x5924eeb2be68, expire_at=..., thread_status_manager=...) at DCPS/ConditionVariable.h:72
#9 0x00007f37586211ca in OpenDDS::DCPS::DispatchService::run_event_loop (this=0x5924eeb2be20) at DCPS/DispatchService.cpp:199
#10 0x00007f375862016d in OpenDDS::DCPS::DispatchService::run (arg=0x5924eeb2be20) at DCPS/DispatchService.cpp:161
#11 0x00007f37587791d8 in OpenDDS::DCPS::ThreadPool::run (arg=0x5924eeb2bf20) at DCPS/ThreadPool.cpp:64
#12 0x00007f3756bca1e5 in ACE_OS_Thread_Adapter::invoke (this=0x5924eeb2bd40) at /var/lib/jenkins/workspace/ACE_TAO_Ubuntu_22_04_Clang23_x64_Debug/ACE/ace/OS_Thread_Adapter.cpp:90
#13 0x00007f3756b5d93e in ace_thread_adapter (args=0x5924eeb2bd40) at /var/lib/jenkins/workspace/ACE_TAO_Ubuntu_22_04_Clang23_x64_Debug/ACE/ace/Base_Thread_Adapter.cpp:116
#14 0x00007f3756694a83 in start_thread (arg=<optimized out>) at ./nptl/pthread_create.c:442
#15 0x00007f37567268e0 in clone3 () at ../sysdeps/unix/sysv/linux/x86_64/clone3.S:81

Thread 5 (Thread 0x7f3754dfc640 (LWP 792395) "publisher"):
#0 0x00007f375671b78d in __GI___select (nfds=12, readfds=0x5924eeaeca88, writefds=0x0, exceptfds=0x0, timeout=0x0) at ../sysdeps/unix/sysv/linux/select.c:69
#1 0x00007f37586fa19d in ACE_OS::select (width=12, rfds=0x5924eeaeca88, wfds=0x0, efds=0x0, timeout=0x0) at /var/lib/jenkins/workspace/ACE_TAO_Ubuntu_22_04_Clang23_x64_Debug/ACE/ace/OS_NS_sys_select.inl:41
#2 0x00007f37586f4d94 in ACE_Select_Reactor_T<ACE_Reactor_Token_T<ACE_Token> >::wait_for_multiple_events (this=0x5924eeaeca40, dispatch_set=..., max_wait_time=0x0) at /var/lib/jenkins/workspace/ACE_TAO_Ubuntu_22_04_Clang23_x64_Debug/ACE/ace/Select_Reactor_T.cpp:1104
#3 0x00007f37586fa4d8 in ACE_Select_Reactor_T<ACE_Reactor_Token_T<ACE_Token> >::handle_events_i (this=0x5924eeaeca40, max_wait_time=0x0) at /var/lib/jenkins/workspace/ACE_TAO_Ubuntu_22_04_Clang23_x64_Debug/ACE/ace/Select_Reactor_T.cpp:1453
#4 0x00007f37586f24fa in ACE_Select_Reactor_T<ACE_Reactor_Token_T<ACE_Token> >::handle_events (this=0x5924eeaeca40, max_wait_time=0x0) at /var/lib/jenkins/workspace/ACE_TAO_Ubuntu_22_04_Clang23_x64_Debug/ACE/ace/Select_Reactor_T.cpp:1433
#5 0x00007f3756bf121f in ACE_Reactor::run_reactor_event_loop (this=0x5924eeaeb770, eh=0x0) at /var/lib/jenkins/workspace/ACE_TAO_Ubuntu_22_04_Clang23_x64_Debug/ACE/ace/Reactor.cpp:192
#6 0x00007f37586ebc22 in OpenDDS::DCPS::ReactorTask::svc (this=0x5924eeaebf70) at DCPS/ReactorTask.cpp:234
#7 0x00007f3756c1a161 in ACE_Task_Base::svc_run (args=0x5924eeaec178) at /var/lib/jenkins/workspace/ACE_TAO_Ubuntu_22_04_Clang23_x64_Debug/ACE/ace/Task.cpp:269
#8 0x00007f3756c1a8fc in ACE_Thread_Adapter::invoke_i (this=0x5924eeaeb970) at /var/lib/jenkins/workspace/ACE_TAO_Ubuntu_22_04_Clang23_x64_Debug/ACE/ace/Thread_Adapter.cpp:143
#9 0x00007f3756c1a7f4 in ACE_Thread_Adapter::invoke (this=0x5924eeaeb970) at /var/lib/jenkins/workspace/ACE_TAO_Ubuntu_22_04_Clang23_x64_Debug/ACE/ace/Thread_Adapter.cpp:94
#10 0x00007f3756b5d93e in ace_thread_adapter (args=0x5924eeaeb970) at /var/lib/jenkins/workspace/ACE_TAO_Ubuntu_22_04_Clang23_x64_Debug/ACE/ace/Base_Thread_Adapter.cpp:116
#11 0x00007f3756694a83 in start_thread (arg=<optimized out>) at ./nptl/pthread_create.c:442
#12 0x00007f37567268e0 in clone3 () at ../sysdeps/unix/sysv/linux/x86_64/clone3.S:81

Thread 4 (Thread 0x7f37555fd640 (LWP 792393) "publisher"):
#0 __futex_abstimed_wait_common64 (private=1432340904, cancel=true, abstime=0x7f37555fcad0, op=137, expected=0, futex_word=0x5924eeae9d30) at ./nptl/futex-internal.c:57
#1 __futex_abstimed_wait_common (cancel=true, private=1432340904, abstime=0x7f37555fcad0, clockid=1432341000, expected=0, futex_word=0x5924eeae9d30) at ./nptl/futex-internal.c:87
#2 __GI___futex_abstimed_wait_cancelable64 (futex_word=futex_word@entry=0x5924eeae9d30, expected=expected@entry=0, clockid=clockid@entry=1, abstime=abstime@entry=0x7f37555fcad0, private=private@entry=0) at ./nptl/futex-internal.c:139
#3 0x00007f3756693e5b in __pthread_cond_wait_common (abstime=0x7f37555fcad0, clockid=1, mutex=0x5924eeae9cd8, cond=0x5924eeae9d08) at ./nptl/pthread_cond_wait.c:503
#4 ___pthread_cond_timedwait64 (cond=0x5924eeae9d08, mutex=0x5924eeae9cd8, abstime=0x7f37555fcad0) at ./nptl/pthread_cond_wait.c:652
#5 0x00007f3756b6f7ef in ACE_OS::cond_timedwait (cv=0x5924eeae9d08, external_mutex=0x5924eeae9cd8, timeout=0x7f37555fcc60) at ../ace/OS_NS_Thread.inl:401
#6 0x00007f3756b6fbc5 in ACE_Condition<ACE_Thread_Mutex>::wait (this=0x5924eeae9d08, mutex=..., abstime=0x7f37555fcc60) at /var/lib/jenkins/workspace/ACE_TAO_Ubuntu_22_04_Clang23_x64_Debug/ACE/ace/Condition_Thread_Mutex.cpp:92
#7 0x00007f3756b6fbf1 in ACE_Condition<ACE_Thread_Mutex>::wait (this=0x5924eeae9d08, abstime=0x7f37555fcc60) at /var/lib/jenkins/workspace/ACE_TAO_Ubuntu_22_04_Clang23_x64_Debug/ACE/ace/Condition_Thread_Mutex.cpp:101
#8 0x00007f37586147c2 in OpenDDS::DCPS::ConditionVariable<ACE_Thread_Mutex>::wait_until (this=0x5924eeae9d08, expire_at=..., thread_status_manager=...) at DCPS/ConditionVariable.h:72
#9 0x00007f37586211ca in OpenDDS::DCPS::DispatchService::run_event_loop (this=0x5924eeae9cc0) at DCPS/DispatchService.cpp:199
#10 0x00007f375862016d in OpenDDS::DCPS::DispatchService::run (arg=0x5924eeae9cc0) at DCPS/DispatchService.cpp:161
#11 0x00007f37587791d8 in OpenDDS::DCPS::ThreadPool::run (arg=0x5924eeae9dc0) at DCPS/ThreadPool.cpp:64
#12 0x00007f3756bca1e5 in ACE_OS_Thread_Adapter::invoke (this=0x5924eeae7da0) at /var/lib/jenkins/workspace/ACE_TAO_Ubuntu_22_04_Clang23_x64_Debug/ACE/ace/OS_Thread_Adapter.cpp:90
#13 0x00007f3756b5d93e in ace_thread_adapter (args=0x5924eeae7da0) at /var/lib/jenkins/workspace/ACE_TAO_Ubuntu_22_04_Clang23_x64_Debug/ACE/ace/Base_Thread_Adapter.cpp:116
#14 0x00007f3756694a83 in start_thread (arg=<optimized out>) at ./nptl/pthread_create.c:442
#15 0x00007f37567268e0 in clone3 () at ../sysdeps/unix/sysv/linux/x86_64/clone3.S:81

Thread 3 (Thread 0x7f3755dfe640 (LWP 792390) "publisher"):
#0 0x00007f375671b78d in __GI___select (nfds=7, readfds=0x5924eea74cc8, writefds=0x0, exceptfds=0x0, timeout=0x0) at ../sysdeps/unix/sysv/linux/select.c:69
#1 0x00007f37586fa19d in ACE_OS::select (width=7, rfds=0x5924eea74cc8, wfds=0x0, efds=0x0, timeout=0x0) at /var/lib/jenkins/workspace/ACE_TAO_Ubuntu_22_04_Clang23_x64_Debug/ACE/ace/OS_NS_sys_select.inl:41
#2 0x00007f37586f4d94 in ACE_Select_Reactor_T<ACE_Reactor_Token_T<ACE_Token> >::wait_for_multiple_events (this=0x5924eea74c80, dispatch_set=..., max_wait_time=0x0) at /var/lib/jenkins/workspace/ACE_TAO_Ubuntu_22_04_Clang23_x64_Debug/ACE/ace/Select_Reactor_T.cpp:1104
#3 0x00007f37586fa4d8 in ACE_Select_Reactor_T<ACE_Reactor_Token_T<ACE_Token> >::handle_events_i (this=0x5924eea74c80, max_wait_time=0x0) at /var/lib/jenkins/workspace/ACE_TAO_Ubuntu_22_04_Clang23_x64_Debug/ACE/ace/Select_Reactor_T.cpp:1453
#4 0x00007f37586f24fa in ACE_Select_Reactor_T<ACE_Reactor_Token_T<ACE_Token> >::handle_events (this=0x5924eea74c80, max_wait_time=0x0) at /var/lib/jenkins/workspace/ACE_TAO_Ubuntu_22_04_Clang23_x64_Debug/ACE/ace/Select_Reactor_T.cpp:1433
#5 0x00007f3756bf121f in ACE_Reactor::run_reactor_event_loop (this=0x5924eea79bc0, eh=0x0) at /var/lib/jenkins/workspace/ACE_TAO_Ubuntu_22_04_Clang23_x64_Debug/ACE/ace/Reactor.cpp:192
#6 0x00007f37586ebc22 in OpenDDS::DCPS::ReactorTask::svc (this=0x5924eea62510) at DCPS/ReactorTask.cpp:234
#7 0x00007f3756c1a161 in ACE_Task_Base::svc_run (args=0x5924eea62718) at /var/lib/jenkins/workspace/ACE_TAO_Ubuntu_22_04_Clang23_x64_Debug/ACE/ace/Task.cpp:269
#8 0x00007f3756c1a8fc in ACE_Thread_Adapter::invoke_i (this=0x5924eea77790) at /var/lib/jenkins/workspace/ACE_TAO_Ubuntu_22_04_Clang23_x64_Debug/ACE/ace/Thread_Adapter.cpp:143
#9 0x00007f3756c1a7f4 in ACE_Thread_Adapter::invoke (this=0x5924eea77790) at /var/lib/jenkins/workspace/ACE_TAO_Ubuntu_22_04_Clang23_x64_Debug/ACE/ace/Thread_Adapter.cpp:94
#10 0x00007f3756b5d93e in ace_thread_adapter (args=0x5924eea77790) at /var/lib/jenkins/workspace/ACE_TAO_Ubuntu_22_04_Clang23_x64_Debug/ACE/ace/Base_Thread_Adapter.cpp:116
#11 0x00007f3756694a83 in start_thread (arg=<optimized out>) at ./nptl/pthread_create.c:442
#12 0x00007f37567268e0 in clone3 () at ../sysdeps/unix/sysv/linux/x86_64/clone3.S:81

Thread 2 (Thread 0x7f37565ff640 (LWP 792388) "publisher"):
#0 __futex_abstimed_wait_common64 (private=0, cancel=true, abstime=0x0, op=393, expected=0, futex_word=0x5924eea74380) at ./nptl/futex-internal.c:57
#1 __futex_abstimed_wait_common (cancel=true, private=0, abstime=0x0, clockid=0, expected=0, futex_word=0x5924eea74380) at ./nptl/futex-internal.c:87
#2 __GI___futex_abstimed_wait_cancelable64 (futex_word=futex_word@entry=0x5924eea74380, expected=expected@entry=0, clockid=clockid@entry=0, abstime=abstime@entry=0x0, private=private@entry=0) at ./nptl/futex-internal.c:139
#3 0x00007f3756693a01 in __pthread_cond_wait_common (abstime=0x0, clockid=0, mutex=0x5924eea74328, cond=0x5924eea74358) at ./nptl/pthread_cond_wait.c:503
#4 ___pthread_cond_wait (cond=0x5924eea74358, mutex=0x5924eea74328) at ./nptl/pthread_cond_wait.c:627
#5 0x00007f3756b6f73d in ACE_OS::cond_wait (cv=0x5924eea74358, external_mutex=0x5924eea74328) at ../ace/OS_NS_Thread.inl:370
#6 0x00007f3756b6fb89 in ACE_Condition<ACE_Thread_Mutex>::wait (this=0x5924eea74358) at /var/lib/jenkins/workspace/ACE_TAO_Ubuntu_22_04_Clang23_x64_Debug/ACE/ace/Condition_Thread_Mutex.cpp:84
#7 0x00007f3759910e6e in OpenDDS::DCPS::ConditionVariable<ACE_Thread_Mutex>::wait (this=0x5924eea74358, thread_status_manager=...) at /var/lib/jenkins/workspace/OpenDDS_ACE8_Ubuntu_22_04_Clang23_x64_Debug/dds/DCPS/ConditionVariable.h:56
#8 0x00007f375862120b in OpenDDS::DCPS::DispatchService::run_event_loop (this=0x5924eea74310) at DCPS/DispatchService.cpp:201
#9 0x00007f375862016d in OpenDDS::DCPS::DispatchService::run (arg=0x5924eea74310) at DCPS/DispatchService.cpp:161
#10 0x00007f37587791d8 in OpenDDS::DCPS::ThreadPool::run (arg=0x5924eea74410) at DCPS/ThreadPool.cpp:64
#11 0x00007f3756bca1e5 in ACE_OS_Thread_Adapter::invoke (this=0x5924eea65ce0) at /var/lib/jenkins/workspace/ACE_TAO_Ubuntu_22_04_Clang23_x64_Debug/ACE/ace/OS_Thread_Adapter.cpp:90
#12 0x00007f3756b5d93e in ace_thread_adapter (args=0x5924eea65ce0) at /var/lib/jenkins/workspace/ACE_TAO_Ubuntu_22_04_Clang23_x64_Debug/ACE/ace/Base_Thread_Adapter.cpp:116
#13 0x00007f3756694a83 in start_thread (arg=<optimized out>) at ./nptl/pthread_create.c:442
#14 0x00007f37567268e0 in clone3 () at ../sysdeps/unix/sysv/linux/x86_64/clone3.S:81

Thread 1 (Thread 0x7f3759aa7740 (LWP 792386) "publisher"):
#0 0x00007f37566e57b8 in __GI___clock_nanosleep (clock_id=clock_id@entry=0, flags=flags@entry=0, req=0x7ffc8e65ab68, rem=0x0) at ../sysdeps/unix/sysv/linux/clock_nanosleep.c:78
#1 0x00007f37566ea637 in __GI___nanosleep (req=<optimized out>, rem=<optimized out>) at ../sysdeps/unix/sysv/linux/nanosleep.c:25
#2 0x00005924e2323587 in ACE_OS::sleep (seconds=1) at /var/lib/jenkins/workspace/ACE_TAO_Ubuntu_22_04_Clang23_x64_Debug/ACE/ace/OS_NS_unistd.inl:924
#3 0x00005924e2322b26 in FileBasedDistributedConditionSet::wait_for (this=0x5924eea664d0, waiting_actor=..., posting_actor=..., condition=...) at /var/lib/jenkins/workspace/OpenDDS_ACE8_Ubuntu_22_04_Clang23_x64_Debug/tests/Utils/DistributedConditionSet.h:152
#4 0x00005924e2320474 in main (argc=1, argv=0x7ffc8e65b228) at /var/lib/jenkins/workspace/OpenDDS_ACE8_Ubuntu_22_04_Clang23_x64_Debug/tests/DCPS/ZeroEnum/publisher.cpp:57
[Inferior 1 (process 792386) detached]
======= End stuck stacks =======
[Details] 2026-10-08 19:48:03: ERROR: publisher timedout
[Details] ERROR: TEST could get dynamic type member for my_enum
[Details] test FAILED (success).
[Details] auto_run_tests.pl: ERROR: "tests/DCPS/ZeroEnum/run_test.pl" returned with status 4

tests/security/CheckInstance/run_test.pl

[Details] ERROR: <CheckInstance> exited with coredump from signal 11 : SEGV
[Details] 2026-10-08 19:56:35: ERROR: CheckInstance terminated with a signal
[Details] 2026-10-08 19:56:35.357@LM_ERROR@ERROR: check_local_datawriter_register_instance did not allow an instance to be registered when expected
[Details] test FAILED (success).
[Details] ERROR: test returned 4
[Details] auto_run_tests.pl: ERROR: "tests/security/CheckInstance/run_test.pl" returned with status 1