Daily Build Log (Brief)
Compile
/var/lib/jenkins/workspace/OpenDDS_ACE8_Ubuntu_22_04_Clang22_x64_Debug/tests/FACE/Compiler/idl_test2_lib/GNUmakefile.FACE_idl_test2_lib
[Details] /var/lib/jenkins/workspace/OpenDDS_ACE8_Ubuntu_22_04_Clang22_x64_Debug/tests/FACE/Compiler/idl_test1_lib/FooDefTypeSupportImpl.cpp:867:39: warning: first argument in call to 'memset' is a pointer to non-trivially copyable type 'enumunion::UnionType' [-Wnontrivial-memcall]
[Details] /var/lib/jenkins/workspace/OpenDDS_ACE8_Ubuntu_22_04_Clang22_x64_Debug/tests/FACE/Compiler/idl_test1_lib/FooDefTypeSupportImpl.cpp:867:39: note: explicitly cast the pointer to silence this warning
[Details] /var/lib/jenkins/workspace/OpenDDS_ACE8_Ubuntu_22_04_Clang22_x64_Debug/tests/FACE/Compiler/idl_test1_lib/FooDefTypeSupportImpl.cpp:9524:33: warning: first argument in call to 'memset' is a pointer to non-trivially copyable type 'Xyz::AUnion' [-Wnontrivial-memcall]
[Details] /var/lib/jenkins/workspace/OpenDDS_ACE8_Ubuntu_22_04_Clang22_x64_Debug/tests/FACE/Compiler/idl_test1_lib/FooDefTypeSupportImpl.cpp:9524:33: note: explicitly cast the pointer to silence this warning
[Details] /var/lib/jenkins/workspace/OpenDDS_ACE8_Ubuntu_22_04_Clang22_x64_Debug/tests/FACE/Compiler/idl_test1_lib/FooDefTypeSupportImpl.cpp:19362:39: warning: first argument in call to 'memset' is a pointer to non-trivially copyable type 'Xyz::TestUnion' [-Wnontrivial-memcall]
[Details] /var/lib/jenkins/workspace/OpenDDS_ACE8_Ubuntu_22_04_Clang22_x64_Debug/tests/FACE/Compiler/idl_test1_lib/FooDefTypeSupportImpl.cpp:19362:39: note: explicitly cast the pointer to silence this warning
[Details] /var/lib/jenkins/workspace/OpenDDS_ACE8_Ubuntu_22_04_Clang22_x64_Debug/tests/FACE/Compiler/idl_test1_lib/FooDefTypeSupportImpl.cpp:19950:41: warning: first argument in call to 'memset' is a pointer to non-trivially copyable type 'Xyz::TestUnion2' [-Wnontrivial-memcall]
[Details] /var/lib/jenkins/workspace/OpenDDS_ACE8_Ubuntu_22_04_Clang22_x64_Debug/tests/FACE/Compiler/idl_test1_lib/FooDefTypeSupportImpl.cpp:19950:41: note: explicitly cast the pointer to silence this warning
[Details] /var/lib/jenkins/workspace/OpenDDS_ACE8_Ubuntu_22_04_Clang22_x64_Debug/tests/FACE/Compiler/idl_test1_lib/FooDefTypeSupportImpl.cpp:20529:41: warning: first argument in call to 'memset' is a pointer to non-trivially copyable type 'Xyz::TestUnion3' [-Wnontrivial-memcall]
[Details] /var/lib/jenkins/workspace/OpenDDS_ACE8_Ubuntu_22_04_Clang22_x64_Debug/tests/FACE/Compiler/idl_test1_lib/FooDefTypeSupportImpl.cpp:20529:41: note: explicitly cast the pointer to silence this warning
[Details] /var/lib/jenkins/workspace/OpenDDS_ACE8_Ubuntu_22_04_Clang22_x64_Debug/tests/FACE/Compiler/idl_test1_lib/FooDefTypeSupportImpl.cpp:21101:41: warning: first argument in call to 'memset' is a pointer to non-trivially copyable type 'Xyz::TestUnion4' [-Wnontrivial-memcall]
[Details] /var/lib/jenkins/workspace/OpenDDS_ACE8_Ubuntu_22_04_Clang22_x64_Debug/tests/FACE/Compiler/idl_test1_lib/FooDefTypeSupportImpl.cpp:21101:41: note: explicitly cast the pointer to silence this warning
[Details] /var/lib/jenkins/workspace/OpenDDS_ACE8_Ubuntu_22_04_Clang22_x64_Debug/tests/FACE/Compiler/idl_test1_lib/FooDefTypeSupportImpl.cpp:21722:41: warning: first argument in call to 'memset' is a pointer to non-trivially copyable type 'Xyz::TestUnion5' [-Wnontrivial-memcall]
[Details] /var/lib/jenkins/workspace/OpenDDS_ACE8_Ubuntu_22_04_Clang22_x64_Debug/tests/FACE/Compiler/idl_test1_lib/FooDefTypeSupportImpl.cpp:21722:41: note: explicitly cast the pointer to silence this warning
[Details] /var/lib/jenkins/workspace/OpenDDS_ACE8_Ubuntu_22_04_Clang22_x64_Debug/tests/FACE/Compiler/idl_test1_lib/FooDefTypeSupportImpl.cpp:22352:41: warning: first argument in call to 'memset' is a pointer to non-trivially copyable type 'Xyz::TestUnion6' [-Wnontrivial-memcall]
[Details] /var/lib/jenkins/workspace/OpenDDS_ACE8_Ubuntu_22_04_Clang22_x64_Debug/tests/FACE/Compiler/idl_test1_lib/FooDefTypeSupportImpl.cpp:22352:41: note: explicitly cast the pointer to silence this warning
[Details] /var/lib/jenkins/workspace/OpenDDS_ACE8_Ubuntu_22_04_Clang22_x64_Debug/tests/FACE/Compiler/idl_test1_lib/FooDefTypeSupportImpl.cpp:28146:27: warning: first argument in call to 'memset' is a pointer to non-trivially copyable type 'B85' [-Wnontrivial-memcall]
[Details] /var/lib/jenkins/workspace/OpenDDS_ACE8_Ubuntu_22_04_Clang22_x64_Debug/tests/FACE/Compiler/idl_test1_lib/FooDefTypeSupportImpl.cpp:28146:27: note: explicitly cast the pointer to silence this warning
[Details] /var/lib/jenkins/workspace/OpenDDS_ACE8_Ubuntu_22_04_Clang22_x64_Debug/tests/FACE/Compiler/idl_test1_lib/FooDefTypeSupportImpl.cpp:29004:27: warning: first argument in call to 'memset' is a pointer to non-trivially copyable type 'B86' [-Wnontrivial-memcall]
[Details] /var/lib/jenkins/workspace/OpenDDS_ACE8_Ubuntu_22_04_Clang22_x64_Debug/tests/FACE/Compiler/idl_test1_lib/FooDefTypeSupportImpl.cpp:29004:27: note: explicitly cast the pointer to silence this warning
[Details] /var/lib/jenkins/workspace/OpenDDS_ACE8_Ubuntu_22_04_Clang22_x64_Debug/tests/FACE/Compiler/idl_test1_lib/FooDefTypeSupportImpl.cpp:29858:27: warning: first argument in call to 'memset' is a pointer to non-trivially copyable type 'B87' [-Wnontrivial-memcall]
[Details] /var/lib/jenkins/workspace/OpenDDS_ACE8_Ubuntu_22_04_Clang22_x64_Debug/tests/FACE/Compiler/idl_test1_lib/FooDefTypeSupportImpl.cpp:29858:27: note: explicitly cast the pointer to silence this warning
[Details] /var/lib/jenkins/workspace/OpenDDS_ACE8_Ubuntu_22_04_Clang22_x64_Debug/tests/FACE/Compiler/idl_test1_lib/FooDefTypeSupportImpl.cpp:30712:27: warning: first argument in call to 'memset' is a pointer to non-trivially copyable type 'B88' [-Wnontrivial-memcall]
[Details] /var/lib/jenkins/workspace/OpenDDS_ACE8_Ubuntu_22_04_Clang22_x64_Debug/tests/FACE/Compiler/idl_test1_lib/FooDefTypeSupportImpl.cpp:30712:27: note: explicitly cast the pointer to silence this warning
[Details] 12 warnings generated.
/var/lib/jenkins/workspace/OpenDDS_ACE8_Ubuntu_22_04_Clang22_x64_Debug/tests/FACE/Conformance/GNUmakefile.FaceConformanceIdl
[Details] /var/lib/jenkins/workspace/OpenDDS_ACE8_Ubuntu_22_04_Clang22_x64_Debug/tests/FACE/Compiler/idl_test3_lib/FooDefTypeSupportImpl.cpp:18031:71: warning: first argument in call to 'memset' is a pointer to non-trivially copyable type 'Xyz::UnionOfTypedefsOfTypedefs' [-Wnontrivial-memcall]
[Details] /var/lib/jenkins/workspace/OpenDDS_ACE8_Ubuntu_22_04_Clang22_x64_Debug/tests/FACE/Compiler/idl_test3_lib/FooDefTypeSupportImpl.cpp:18031:71: note: explicitly cast the pointer to silence this warning
[Details] /var/lib/jenkins/workspace/OpenDDS_ACE8_Ubuntu_22_04_Clang22_x64_Debug/tests/FACE/Compiler/idl_test3_lib/FooDefTypeSupportImpl.cpp:27694:33: warning: first argument in call to 'memset' is a pointer to non-trivially copyable type 'Xyz::AUnion' [-Wnontrivial-memcall]
[Details] /var/lib/jenkins/workspace/OpenDDS_ACE8_Ubuntu_22_04_Clang22_x64_Debug/tests/FACE/Compiler/idl_test3_lib/FooDefTypeSupportImpl.cpp:27694:33: note: explicitly cast the pointer to silence this warning
[Details] /var/lib/jenkins/workspace/OpenDDS_ACE8_Ubuntu_22_04_Clang22_x64_Debug/tests/FACE/Compiler/idl_test3_lib/FooDefTypeSupportImpl.cpp:32627:37: warning: first argument in call to 'memset' is a pointer to non-trivially copyable type 'Xyz::BigUnion' [-Wnontrivial-memcall]
[Details] /var/lib/jenkins/workspace/OpenDDS_ACE8_Ubuntu_22_04_Clang22_x64_Debug/tests/FACE/Compiler/idl_test3_lib/FooDefTypeSupportImpl.cpp:32627:37: note: explicitly cast the pointer to silence this warning
/var/lib/jenkins/workspace/OpenDDS_ACE8_Ubuntu_22_04_Clang22_x64_Debug/tests/FACE/Header/Idl/GNUmakefile.FaceHeaderTestIdl
[Details] 3 warnings generated.
Test
tests/DCPS/Compiler/vread_vwrite/run_test.pl
[Details] [ FAILED ] VreadVwriteTest.DynamicSerializeTest (1 ms)
[Details] [ FAILED ] VreadVwriteTest.DynamicWithOptionalTest (0 ms)
[Details] [ FAILED ] 2 tests, listed below:
[Details] [ FAILED ] VreadVwriteTest.DynamicSerializeTest
[Details] [ FAILED ] VreadVwriteTest.DynamicWithOptionalTest
[Details] 2 FAILED TESTS
[Details] ERROR: VreadVwriteTest returned 1
[Details] test FAILED
[Details] auto_run_tests.pl: ERROR: "tests/DCPS/Compiler/vread_vwrite/run_test.pl" returned with status 1
tests/unit-tests/run_test.pl
[Details] [ FAILED ] dds_DCPS_XTypes_DynamicDataImpl.Mutable_WriteRecursiveStruct (0 ms)
[Details] [ FAILED ] dds_DCPS_XTypes_DynamicDataImpl.Mutable_WriteKeyOnly (0 ms)
[Details] [ FAILED ] dds_DCPS_XTypes_DynamicDataImpl.Nested_WriteKeyOnly (0 ms)
[Details] [ FAILED ] dds_DCPS_XTypes_DynamicDataImpl.String_As_Enum (0 ms)
[Details] (161916|161916) ERROR: dynamic_data_json: unknown member id in XmlTypeProviderTest::Sample at $
[Details] (161916|161916) ERROR: dynamic_data_json: failed to populate DynamicData for XmlTypeProviderTest::Sample
[Details] ERROR: <UnitTests> exited with coredump from signal 11 : SEGV
[Details] 2026-09-23 22:18:54: ERROR: UnitTests terminated with a signal
[Details] test FAILED (success).
[Details] auto_run_tests.pl: ERROR: "tests/unit-tests/run_test.pl" returned with status 1
tests/DCPS/FilterExpression/run_test.pl
[Details] ERROR: <FilterExpressionTest> exited with coredump from signal 11 : SEGV
[Details] ERROR: test returned 255
[Details] auto_run_tests.pl: ERROR: "tests/DCPS/FilterExpression/run_test.pl" returned with status 1
tests/DCPS/QueryCondition/run_test.pl rtps_disc dynamic
[Details] ERROR: <QueryConditionTest> exited with coredump from signal 11 : SEGV
[Details] ERROR: test returned 255
[Details] auto_run_tests.pl: ERROR: "tests/DCPS/QueryCondition/run_test.pl rtps_disc dynamic" returned with status 1
tests/DCPS/ContentFilteredTopic/run_test.pl rtps_disc dynamic
[Details] ERROR: ContentFilteredTopicTest timedout
======= Begin stuck stacks =======
[New LWP 163919]
[New LWP 163920]
[New LWP 163921]
[New LWP 163922]
[New LWP 163923]
[New LWP 163924]
[New LWP 163925]
[New LWP 163926]
[New LWP 163927]
[New LWP 163928]
[New LWP 163929]
[New LWP 163930]
[Thread debugging using libthread_db enabled]
Using host libthread_db library "/lib/x86_64-linux-gnu/libthread_db.so.1".
__futex_abstimed_wait_common64 (private=0, cancel=true, abstime=0x0, op=393, expected=0, futex_word=0x55d733f97460) at ./nptl/futex-internal.c:57
57 ./nptl/futex-internal.c: No such file or directory.
Thread 13 (Thread 0x7a756d7fa640 (LWP 163930) "ContentFiltered"):
#0 0x00007a758731b78d in __GI___select (nfds=24, readfds=0x55d7340ba4d8, writefds=0x0, exceptfds=0x0, timeout=0x0) at ../sysdeps/unix/sysv/linux/select.c:69
#1 0x00007a75890f2c4d in ACE_OS::select (width=24, rfds=0x55d7340ba4d8, wfds=0x0, efds=0x0, timeout=0x0) at /var/lib/jenkins/workspace/ACE_TAO_Ubuntu_22_04_Clang22_x64_Debug/ACE/ace/OS_NS_sys_select.inl:41
#2 0x00007a75890ed844 in ACE_Select_Reactor_T<ACE_Reactor_Token_T<ACE_Token> >::wait_for_multiple_events (this=0x55d7340ba490, dispatch_set=..., max_wait_time=0x0) at /var/lib/jenkins/workspace/ACE_TAO_Ubuntu_22_04_Clang22_x64_Debug/ACE/ace/Select_Reactor_T.cpp:1104
#3 0x00007a75890f2f88 in ACE_Select_Reactor_T<ACE_Reactor_Token_T<ACE_Token> >::handle_events_i (this=0x55d7340ba490, max_wait_time=0x0) at /var/lib/jenkins/workspace/ACE_TAO_Ubuntu_22_04_Clang22_x64_Debug/ACE/ace/Select_Reactor_T.cpp:1453
#4 0x00007a75890eafea in ACE_Select_Reactor_T<ACE_Reactor_Token_T<ACE_Token> >::handle_events (this=0x55d7340ba490, max_wait_time=0x0) at /var/lib/jenkins/workspace/ACE_TAO_Ubuntu_22_04_Clang22_x64_Debug/ACE/ace/Select_Reactor_T.cpp:1433
#5 0x00007a75877f080f in ACE_Reactor::run_reactor_event_loop (this=0x55d7340b8e50, eh=0x0) at /var/lib/jenkins/workspace/ACE_TAO_Ubuntu_22_04_Clang22_x64_Debug/ACE/ace/Reactor.cpp:192
#6 0x00007a75890e4722 in OpenDDS::DCPS::ReactorTask::svc (this=0x55d7340b9970) at DCPS/ReactorTask.cpp:234
#7 0x00007a7587819671 in ACE_Task_Base::svc_run (args=0x55d7340b9b78) at /var/lib/jenkins/workspace/ACE_TAO_Ubuntu_22_04_Clang22_x64_Debug/ACE/ace/Task.cpp:269
#8 0x00007a7587819e0c in ACE_Thread_Adapter::invoke_i (this=0x55d7340b8560) at /var/lib/jenkins/workspace/ACE_TAO_Ubuntu_22_04_Clang22_x64_Debug/ACE/ace/Thread_Adapter.cpp:143
#9 0x00007a7587819d04 in ACE_Thread_Adapter::invoke (this=0x55d7340b8560) at /var/lib/jenkins/workspace/ACE_TAO_Ubuntu_22_04_Clang22_x64_Debug/ACE/ace/Thread_Adapter.cpp:94
#10 0x00007a758775d67e in ace_thread_adapter (args=0x55d7340b8560) at /var/lib/jenkins/workspace/ACE_TAO_Ubuntu_22_04_Clang22_x64_Debug/ACE/ace/Base_Thread_Adapter.cpp:116
#11 0x00007a7587294a83 in start_thread (arg=<optimized out>) at ./nptl/pthread_create.c:442
#12 0x00007a75873268e0 in clone3 () at ../sysdeps/unix/sysv/linux/x86_64/clone3.S:81
Thread 12 (Thread 0x7a756dffb640 (LWP 163929) "ContentFiltered"):
#0 __futex_abstimed_wait_common64 (private=0, cancel=true, abstime=0x0, op=393, expected=0, futex_word=0x55d7340b7934) at ./nptl/futex-internal.c:57
#1 __futex_abstimed_wait_common (cancel=true, private=0, abstime=0x0, clockid=0, expected=0, futex_word=0x55d7340b7934) at ./nptl/futex-internal.c:87
#2 __GI___futex_abstimed_wait_cancelable64 (futex_word=futex_word@entry=0x55d7340b7934, expected=expected@entry=0, clockid=clockid@entry=0, abstime=abstime@entry=0x0, private=private@entry=0) at ./nptl/futex-internal.c:139
#3 0x00007a7587293a01 in __pthread_cond_wait_common (abstime=0x0, clockid=0, mutex=0x55d7340b78d8, cond=0x55d7340b7908) at ./nptl/pthread_cond_wait.c:503
#4 ___pthread_cond_wait (cond=0x55d7340b7908, mutex=0x55d7340b78d8) at ./nptl/pthread_cond_wait.c:627
#5 0x00007a758776eedd in ACE_OS::cond_wait (cv=0x55d7340b7908, external_mutex=0x55d7340b78d8) at ../ace/OS_NS_Thread.inl:370
#6 0x00007a758776f329 in ACE_Condition<ACE_Thread_Mutex>::wait (this=0x55d7340b7908) at /var/lib/jenkins/workspace/ACE_TAO_Ubuntu_22_04_Clang22_x64_Debug/ACE/ace/Condition_Thread_Mutex.cpp:84
#7 0x00007a758a2f924e in OpenDDS::DCPS::ConditionVariable<ACE_Thread_Mutex>::wait (this=0x55d7340b7908, thread_status_manager=...) at /var/lib/jenkins/workspace/OpenDDS_ACE8_Ubuntu_22_04_Clang22_x64_Debug/dds/DCPS/ConditionVariable.h:56
#8 0x00007a758901a55b in OpenDDS::DCPS::DispatchService::run_event_loop (this=0x55d7340b78c0) at DCPS/DispatchService.cpp:201
#9 0x00007a75890194cd in OpenDDS::DCPS::DispatchService::run (arg=0x55d7340b78c0) at DCPS/DispatchService.cpp:161
#10 0x00007a7589171188 in OpenDDS::DCPS::ThreadPool::run (arg=0x55d7340b79c0) at DCPS/ThreadPool.cpp:64
#11 0x00007a75877c9815 in ACE_OS_Thread_Adapter::invoke (this=0x55d7340ae310) at /var/lib/jenkins/workspace/ACE_TAO_Ubuntu_22_04_Clang22_x64_Debug/ACE/ace/OS_Thread_Adapter.cpp:90
#12 0x00007a758775d67e in ace_thread_adapter (args=0x55d7340ae310) at /var/lib/jenkins/workspace/ACE_TAO_Ubuntu_22_04_Clang22_x64_Debug/ACE/ace/Base_Thread_Adapter.cpp:116
#13 0x00007a7587294a83 in start_thread (arg=<optimized out>) at ./nptl/pthread_create.c:442
#14 0x00007a75873268e0 in clone3 () at ../sysdeps/unix/sysv/linux/x86_64/clone3.S:81
Thread 11 (Thread 0x7a756e7fc640 (LWP 163928) "ContentFiltered"):
#0 0x00007a758731b78d in __GI___select (nfds=21, readfds=0x55d734098fe8, writefds=0x0, exceptfds=0x0, timeout=0x0) at ../sysdeps/unix/sysv/linux/select.c:69
#1 0x00007a75890f2c4d in ACE_OS::select (width=21, rfds=0x55d734098fe8, wfds=0x0, efds=0x0, timeout=0x0) at /var/lib/jenkins/workspace/ACE_TAO_Ubuntu_22_04_Clang22_x64_Debug/ACE/ace/OS_NS_sys_select.inl:41
#2 0x00007a75890ed844 in ACE_Select_Reactor_T<ACE_Reactor_Token_T<ACE_Token> >::wait_for_multiple_events (this=0x55d734098fa0, dispatch_set=..., max_wait_time=0x0) at /var/lib/jenkins/workspace/ACE_TAO_Ubuntu_22_04_Clang22_x64_Debug/ACE/ace/Select_Reactor_T.cpp:1104
#3 0x00007a75890f2f88 in ACE_Select_Reactor_T<ACE_Reactor_Token_T<ACE_Token> >::handle_events_i (this=0x55d734098fa0, max_wait_time=0x0) at /var/lib/jenkins/workspace/ACE_TAO_Ubuntu_22_04_Clang22_x64_Debug/ACE/ace/Select_Reactor_T.cpp:1453
#4 0x00007a75890eafea in ACE_Select_Reactor_T<ACE_Reactor_Token_T<ACE_Token> >::handle_events (this=0x55d734098fa0, max_wait_time=0x0) at /var/lib/jenkins/workspace/ACE_TAO_Ubuntu_22_04_Clang22_x64_Debug/ACE/ace/Select_Reactor_T.cpp:1433
#5 0x00007a75877f080f in ACE_Reactor::run_reactor_event_loop (this=0x55d734097960, eh=0x0) at /var/lib/jenkins/workspace/ACE_TAO_Ubuntu_22_04_Clang22_x64_Debug/ACE/ace/Reactor.cpp:192
#6 0x00007a75890e4722 in OpenDDS::DCPS::ReactorTask::svc (this=0x55d734098480) at DCPS/ReactorTask.cpp:234
#7 0x00007a7587819671 in ACE_Task_Base::svc_run (args=0x55d734098688) at /var/lib/jenkins/workspace/ACE_TAO_Ubuntu_22_04_Clang22_x64_Debug/ACE/ace/Task.cpp:269
#8 0x00007a7587819e0c in ACE_Thread_Adapter::invoke_i (this=0x55d73407ca00) at /var/lib/jenkins/workspace/ACE_TAO_Ubuntu_22_04_Clang22_x64_Debug/ACE/ace/Thread_Adapter.cpp:143
#9 0x00007a7587819d04 in ACE_Thread_Adapter::invoke (this=0x55d73407ca00) at /var/lib/jenkins/workspace/ACE_TAO_Ubuntu_22_04_Clang22_x64_Debug/ACE/ace/Thread_Adapter.cpp:94
#10 0x00007a758775d67e in ace_thread_adapter (args=0x55d73407ca00) at /var/lib/jenkins/workspace/ACE_TAO_Ubuntu_22_04_Clang22_x64_Debug/ACE/ace/Base_Thread_Adapter.cpp:116
#11 0x00007a7587294a83 in start_thread (arg=<optimized out>) at ./nptl/pthread_create.c:442
#12 0x00007a75873268e0 in clone3 () at ../sysdeps/unix/sysv/linux/x86_64/clone3.S:81
Thread 10 (Thread 0x7a756effd640 (LWP 163927) "ContentFiltered"):
#0 __futex_abstimed_wait_common64 (private=0, cancel=true, abstime=0x0, op=393, expected=0, futex_word=0x55d734096420) at ./nptl/futex-internal.c:57
#1 __futex_abstimed_wait_common (cancel=true, private=0, abstime=0x0, clockid=0, expected=0, futex_word=0x55d734096420) at ./nptl/futex-internal.c:87
#2 __GI___futex_abstimed_wait_cancelable64 (futex_word=futex_word@entry=0x55d734096420, expected=expected@entry=0, clockid=clockid@entry=0, abstime=abstime@entry=0x0, private=private@entry=0) at ./nptl/futex-internal.c:139
#3 0x00007a7587293a01 in __pthread_cond_wait_common (abstime=0x0, clockid=0, mutex=0x55d7340963c8, cond=0x55d7340963f8) at ./nptl/pthread_cond_wait.c:503
#4 ___pthread_cond_wait (cond=0x55d7340963f8, mutex=0x55d7340963c8) at ./nptl/pthread_cond_wait.c:627
#5 0x00007a758776eedd in ACE_OS::cond_wait (cv=0x55d7340963f8, external_mutex=0x55d7340963c8) at ../ace/OS_NS_Thread.inl:370
#6 0x00007a758776f329 in ACE_Condition<ACE_Thread_Mutex>::wait (this=0x55d7340963f8) at /var/lib/jenkins/workspace/ACE_TAO_Ubuntu_22_04_Clang22_x64_Debug/ACE/ace/Condition_Thread_Mutex.cpp:84
#7 0x00007a758a2f924e in OpenDDS::DCPS::ConditionVariable<ACE_Thread_Mutex>::wait (this=0x55d7340963f8, thread_status_manager=...) at /var/lib/jenkins/workspace/OpenDDS_ACE8_Ubuntu_22_04_Clang22_x64_Debug/dds/DCPS/ConditionVariable.h:56
#8 0x00007a758901a55b in OpenDDS::DCPS::DispatchService::run_event_loop (this=0x55d7340963b0) at DCPS/DispatchService.cpp:201
#9 0x00007a75890194cd in OpenDDS::DCPS::DispatchService::run (arg=0x55d7340963b0) at DCPS/DispatchService.cpp:161
#10 0x00007a7589171188 in OpenDDS::DCPS::ThreadPool::run (arg=0x55d7340964b0) at DCPS/ThreadPool.cpp:64
#11 0x00007a75877c9815 in ACE_OS_Thread_Adapter::invoke (this=0x55d73407cef0) at /var/lib/jenkins/workspace/ACE_TAO_Ubuntu_22_04_Clang22_x64_Debug/ACE/ace/OS_Thread_Adapter.cpp:90
#12 0x00007a758775d67e in ace_thread_adapter (args=0x55d73407cef0) at /var/lib/jenkins/workspace/ACE_TAO_Ubuntu_22_04_Clang22_x64_Debug/ACE/ace/Base_Thread_Adapter.cpp:116
#13 0x00007a7587294a83 in start_thread (arg=<optimized out>) at ./nptl/pthread_create.c:442
#14 0x00007a75873268e0 in clone3 () at ../sysdeps/unix/sysv/linux/x86_64/clone3.S:81
Thread 9 (Thread 0x7a756f7fe640 (LWP 163926) "ContentFiltered"):
#0 0x00007a758731b78d in __GI___select (nfds=18, readfds=0x55d73406c698, writefds=0x0, exceptfds=0x0, timeout=0x0) at ../sysdeps/unix/sysv/linux/select.c:69
#1 0x00007a75890f2c4d in ACE_OS::select (width=18, rfds=0x55d73406c698, wfds=0x0, efds=0x0, timeout=0x0) at /var/lib/jenkins/workspace/ACE_TAO_Ubuntu_22_04_Clang22_x64_Debug/ACE/ace/OS_NS_sys_select.inl:41
#2 0x00007a75890ed844 in ACE_Select_Reactor_T<ACE_Reactor_Token_T<ACE_Token> >::wait_for_multiple_events (this=0x55d73406c650, dispatch_set=..., max_wait_time=0x0) at /var/lib/jenkins/workspace/ACE_TAO_Ubuntu_22_04_Clang22_x64_Debug/ACE/ace/Select_Reactor_T.cpp:1104
#3 0x00007a75890f2f88 in ACE_Select_Reactor_T<ACE_Reactor_Token_T<ACE_Token> >::handle_events_i (this=0x55d73406c650, max_wait_time=0x0) at /var/lib/jenkins/workspace/ACE_TAO_Ubuntu_22_04_Clang22_x64_Debug/ACE/ace/Select_Reactor_T.cpp:1453
#4 0x00007a75890eafea in ACE_Select_Reactor_T<ACE_Reactor_Token_T<ACE_Token> >::handle_events (this=0x55d73406c650, max_wait_time=0x0) at /var/lib/jenkins/workspace/ACE_TAO_Ubuntu_22_04_Clang22_x64_Debug/ACE/ace/Select_Reactor_T.cpp:1433
#5 0x00007a75877f080f in ACE_Reactor::run_reactor_event_loop (this=0x55d734055900, eh=0x0) at /var/lib/jenkins/workspace/ACE_TAO_Ubuntu_22_04_Clang22_x64_Debug/ACE/ace/Reactor.cpp:192
#6 0x00007a75890e4722 in OpenDDS::DCPS::ReactorTask::svc (this=0x55d73406bb30) at DCPS/ReactorTask.cpp:234
#7 0x00007a7587819671 in ACE_Task_Base::svc_run (args=0x55d73406bd38) at /var/lib/jenkins/workspace/ACE_TAO_Ubuntu_22_04_Clang22_x64_Debug/ACE/ace/Task.cpp:269
#8 0x00007a7587819e0c in ACE_Thread_Adapter::invoke_i (this=0x55d73405c260) at /var/lib/jenkins/workspace/ACE_TAO_Ubuntu_22_04_Clang22_x64_Debug/ACE/ace/Thread_Adapter.cpp:143
#9 0x00007a7587819d04 in ACE_Thread_Adapter::invoke (this=0x55d73405c260) at /var/lib/jenkins/workspace/ACE_TAO_Ubuntu_22_04_Clang22_x64_Debug/ACE/ace/Thread_Adapter.cpp:94
#10 0x00007a758775d67e in ace_thread_adapter (args=0x55d73405c260) at /var/lib/jenkins/workspace/ACE_TAO_Ubuntu_22_04_Clang22_x64_Debug/ACE/ace/Base_Thread_Adapter.cpp:116
#11 0x00007a7587294a83 in start_thread (arg=<optimized out>) at ./nptl/pthread_create.c:442
#12 0x00007a75873268e0 in clone3 () at ../sysdeps/unix/sysv/linux/x86_64/clone3.S:81
Thread 8 (Thread 0x7a756ffff640 (LWP 163925) "ContentFiltered"):
#0 __futex_abstimed_wait_common64 (private=0, cancel=true, abstime=0x0, op=393, expected=0, futex_word=0x55d73406a6f4) at ./nptl/futex-internal.c:57
#1 __futex_abstimed_wait_common (cancel=true, private=0, abstime=0x0, clockid=0, expected=0, futex_word=0x55d73406a6f4) at ./nptl/futex-internal.c:87
#2 __GI___futex_abstimed_wait_cancelable64 (futex_word=futex_word@entry=0x55d73406a6f4, expected=expected@entry=0, clockid=clockid@entry=0, abstime=abstime@entry=0x0, private=private@entry=0) at ./nptl/futex-internal.c:139
#3 0x00007a7587293a01 in __pthread_cond_wait_common (abstime=0x0, clockid=0, mutex=0x55d73406a698, cond=0x55d73406a6c8) at ./nptl/pthread_cond_wait.c:503
#4 ___pthread_cond_wait (cond=0x55d73406a6c8, mutex=0x55d73406a698) at ./nptl/pthread_cond_wait.c:627
#5 0x00007a758776eedd in ACE_OS::cond_wait (cv=0x55d73406a6c8, external_mutex=0x55d73406a698) at ../ace/OS_NS_Thread.inl:370
#6 0x00007a758776f329 in ACE_Condition<ACE_Thread_Mutex>::wait (this=0x55d73406a6c8) at /var/lib/jenkins/workspace/ACE_TAO_Ubuntu_22_04_Clang22_x64_Debug/ACE/ace/Condition_Thread_Mutex.cpp:84
#7 0x00007a758a2f924e in OpenDDS::DCPS::ConditionVariable<ACE_Thread_Mutex>::wait (this=0x55d73406a6c8, thread_status_manager=...) at /var/lib/jenkins/workspace/OpenDDS_ACE8_Ubuntu_22_04_Clang22_x64_Debug/dds/DCPS/ConditionVariable.h:56
#8 0x00007a758901a55b in OpenDDS::DCPS::DispatchService::run_event_loop (this=0x55d73406a680) at DCPS/DispatchService.cpp:201
#9 0x00007a75890194cd in OpenDDS::DCPS::DispatchService::run (arg=0x55d73406a680) at DCPS/DispatchService.cpp:161
#10 0x00007a7589171188 in OpenDDS::DCPS::ThreadPool::run (arg=0x55d73406a780) at DCPS/ThreadPool.cpp:64
#11 0x00007a75877c9815 in ACE_OS_Thread_Adapter::invoke (this=0x55d73405dfe0) at /var/lib/jenkins/workspace/ACE_TAO_Ubuntu_22_04_Clang22_x64_Debug/ACE/ace/OS_Thread_Adapter.cpp:90
#12 0x00007a758775d67e in ace_thread_adapter (args=0x55d73405dfe0) at /var/lib/jenkins/workspace/ACE_TAO_Ubuntu_22_04_Clang22_x64_Debug/ACE/ace/Base_Thread_Adapter.cpp:116
#13 0x00007a7587294a83 in start_thread (arg=<optimized out>) at ./nptl/pthread_create.c:442
#14 0x00007a75873268e0 in clone3 () at ../sysdeps/unix/sysv/linux/x86_64/clone3.S:81
Thread 7 (Thread 0x7a75849fa640 (LWP 163924) "ContentFiltered"):
#0 0x00007a758731b78d in __GI___select (nfds=16, readfds=0x55d734024098, writefds=0x0, exceptfds=0x0, timeout=0x0) at ../sysdeps/unix/sysv/linux/select.c:69
#1 0x00007a75890f2c4d in ACE_OS::select (width=16, rfds=0x55d734024098, wfds=0x0, efds=0x0, timeout=0x0) at /var/lib/jenkins/workspace/ACE_TAO_Ubuntu_22_04_Clang22_x64_Debug/ACE/ace/OS_NS_sys_select.inl:41
#2 0x00007a75890ed844 in ACE_Select_Reactor_T<ACE_Reactor_Token_T<ACE_Token> >::wait_for_multiple_events (this=0x55d734024050, dispatch_set=..., max_wait_time=0x0) at /var/lib/jenkins/workspace/ACE_TAO_Ubuntu_22_04_Clang22_x64_Debug/ACE/ace/Select_Reactor_T.cpp:1104
#3 0x00007a75890f2f88 in ACE_Select_Reactor_T<ACE_Reactor_Token_T<ACE_Token> >::handle_events_i (this=0x55d734024050, max_wait_time=0x0) at /var/lib/jenkins/workspace/ACE_TAO_Ubuntu_22_04_Clang22_x64_Debug/ACE/ace/Select_Reactor_T.cpp:1453
#4 0x00007a75890eafea in ACE_Select_Reactor_T<ACE_Reactor_Token_T<ACE_Token> >::handle_events (this=0x55d734024050, max_wait_time=0x0) at /var/lib/jenkins/workspace/ACE_TAO_Ubuntu_22_04_Clang22_x64_Debug/ACE/ace/Select_Reactor_T.cpp:1433
#5 0x00007a75877f080f in ACE_Reactor::run_reactor_event_loop (this=0x55d734022480, eh=0x0) at /var/lib/jenkins/workspace/ACE_TAO_Ubuntu_22_04_Clang22_x64_Debug/ACE/ace/Reactor.cpp:192
#6 0x00007a75890e4722 in OpenDDS::DCPS::ReactorTask::svc (this=0x55d734023530) at DCPS/ReactorTask.cpp:234
#7 0x00007a7587819671 in ACE_Task_Base::svc_run (args=0x55d734023738) at /var/lib/jenkins/workspace/ACE_TAO_Ubuntu_22_04_Clang22_x64_Debug/ACE/ace/Task.cpp:269
#8 0x00007a7587819e0c in ACE_Thread_Adapter::invoke_i (this=0x55d734022f20) at /var/lib/jenkins/workspace/ACE_TAO_Ubuntu_22_04_Clang22_x64_Debug/ACE/ace/Thread_Adapter.cpp:143
#9 0x00007a7587819d04 in ACE_Thread_Adapter::invoke (this=0x55d734022f20) at /var/lib/jenkins/workspace/ACE_TAO_Ubuntu_22_04_Clang22_x64_Debug/ACE/ace/Thread_Adapter.cpp:94
#10 0x00007a758775d67e in ace_thread_adapter (args=0x55d734022f20) at /var/lib/jenkins/workspace/ACE_TAO_Ubuntu_22_04_Clang22_x64_Debug/ACE/ace/Base_Thread_Adapter.cpp:116
#11 0x00007a7587294a83 in start_thread (arg=<optimized out>) at ./nptl/pthread_create.c:442
#12 0x00007a75873268e0 in clone3 () at ../sysdeps/unix/sysv/linux/x86_64/clone3.S:81
Thread 6 (Thread 0x7a75851fb640 (LWP 163923) "ContentFiltered"):
#0 __futex_abstimed_wait_common64 (private=-2061522520, cancel=true, abstime=0x7a75851faad0, op=137, expected=0, futex_word=0x55d734020fe4) at ./nptl/futex-internal.c:57
#1 __futex_abstimed_wait_common (cancel=true, private=-2061522520, abstime=0x7a75851faad0, clockid=-2061522424, expected=0, futex_word=0x55d734020fe4) at ./nptl/futex-internal.c:87
#2 __GI___futex_abstimed_wait_cancelable64 (futex_word=futex_word@entry=0x55d734020fe4, expected=expected@entry=0, clockid=clockid@entry=1, abstime=abstime@entry=0x7a75851faad0, private=private@entry=0) at ./nptl/futex-internal.c:139
#3 0x00007a7587293e5b in __pthread_cond_wait_common (abstime=0x7a75851faad0, clockid=1, mutex=0x55d734020f88, cond=0x55d734020fb8) at ./nptl/pthread_cond_wait.c:503
#4 ___pthread_cond_timedwait64 (cond=0x55d734020fb8, mutex=0x55d734020f88, abstime=0x7a75851faad0) at ./nptl/pthread_cond_wait.c:652
#5 0x00007a758776ef8f in ACE_OS::cond_timedwait (cv=0x55d734020fb8, external_mutex=0x55d734020f88, timeout=0x7a75851fac60) at ../ace/OS_NS_Thread.inl:401
#6 0x00007a758776f365 in ACE_Condition<ACE_Thread_Mutex>::wait (this=0x55d734020fb8, mutex=..., abstime=0x7a75851fac60) at /var/lib/jenkins/workspace/ACE_TAO_Ubuntu_22_04_Clang22_x64_Debug/ACE/ace/Condition_Thread_Mutex.cpp:92
#7 0x00007a758776f391 in ACE_Condition<ACE_Thread_Mutex>::wait (this=0x55d734020fb8, abstime=0x7a75851fac60) at /var/lib/jenkins/workspace/ACE_TAO_Ubuntu_22_04_Clang22_x64_Debug/ACE/ace/Condition_Thread_Mutex.cpp:101
#8 0x00007a758900db42 in OpenDDS::DCPS::ConditionVariable<ACE_Thread_Mutex>::wait_until (this=0x55d734020fb8, expire_at=..., thread_status_manager=...) at DCPS/ConditionVariable.h:72
#9 0x00007a758901a51a in OpenDDS::DCPS::DispatchService::run_event_loop (this=0x55d734020f70) at DCPS/DispatchService.cpp:199
#10 0x00007a75890194cd in OpenDDS::DCPS::DispatchService::run (arg=0x55d734020f70) at DCPS/DispatchService.cpp:161
#11 0x00007a7589171188 in OpenDDS::DCPS::ThreadPool::run (arg=0x55d734021070) at DCPS/ThreadPool.cpp:64
#12 0x00007a75877c9815 in ACE_OS_Thread_Adapter::invoke (this=0x55d73401ae90) at /var/lib/jenkins/workspace/ACE_TAO_Ubuntu_22_04_Clang22_x64_Debug/ACE/ace/OS_Thread_Adapter.cpp:90
#13 0x00007a758775d67e in ace_thread_adapter (args=0x55d73401ae90) at /var/lib/jenkins/workspace/ACE_TAO_Ubuntu_22_04_Clang22_x64_Debug/ACE/ace/Base_Thread_Adapter.cpp:116
#14 0x00007a7587294a83 in start_thread (arg=<optimized out>) at ./nptl/pthread_create.c:442
#15 0x00007a75873268e0 in clone3 () at ../sysdeps/unix/sysv/linux/x86_64/clone3.S:81
Thread 5 (Thread 0x7a75859fc640 (LWP 163922) "ContentFiltered"):
#0 0x00007a758731b78d in __GI___select (nfds=11, readfds=0x55d733f67928, writefds=0x0, exceptfds=0x0, timeout=0x0) at ../sysdeps/unix/sysv/linux/select.c:69
#1 0x00007a75890f2c4d in ACE_OS::select (width=11, rfds=0x55d733f67928, wfds=0x0, efds=0x0, timeout=0x0) at /var/lib/jenkins/workspace/ACE_TAO_Ubuntu_22_04_Clang22_x64_Debug/ACE/ace/OS_NS_sys_select.inl:41
#2 0x00007a75890ed844 in ACE_Select_Reactor_T<ACE_Reactor_Token_T<ACE_Token> >::wait_for_multiple_events (this=0x55d733f678e0, dispatch_set=..., max_wait_time=0x0) at /var/lib/jenkins/workspace/ACE_TAO_Ubuntu_22_04_Clang22_x64_Debug/ACE/ace/Select_Reactor_T.cpp:1104
#3 0x00007a75890f2f88 in ACE_Select_Reactor_T<ACE_Reactor_Token_T<ACE_Token> >::handle_events_i (this=0x55d733f678e0, max_wait_time=0x0) at /var/lib/jenkins/workspace/ACE_TAO_Ubuntu_22_04_Clang22_x64_Debug/ACE/ace/Select_Reactor_T.cpp:1453
#4 0x00007a75890eafea in ACE_Select_Reactor_T<ACE_Reactor_Token_T<ACE_Token> >::handle_events (this=0x55d733f678e0, max_wait_time=0x0) at /var/lib/jenkins/workspace/ACE_TAO_Ubuntu_22_04_Clang22_x64_Debug/ACE/ace/Select_Reactor_T.cpp:1433
#5 0x00007a75877f080f in ACE_Reactor::run_reactor_event_loop (this=0x55d733f662a0, eh=0x0) at /var/lib/jenkins/workspace/ACE_TAO_Ubuntu_22_04_Clang22_x64_Debug/ACE/ace/Reactor.cpp:192
#6 0x00007a75890e4722 in OpenDDS::DCPS::ReactorTask::svc (this=0x55d733f66dc0) at DCPS/ReactorTask.cpp:234
#7 0x00007a7587819671 in ACE_Task_Base::svc_run (args=0x55d733f66fc8) at /var/lib/jenkins/workspace/ACE_TAO_Ubuntu_22_04_Clang22_x64_Debug/ACE/ace/Task.cpp:269
#8 0x00007a7587819e0c in ACE_Thread_Adapter::invoke_i (this=0x55d733f66a30) at /var/lib/jenkins/workspace/ACE_TAO_Ubuntu_22_04_Clang22_x64_Debug/ACE/ace/Thread_Adapter.cpp:143
#9 0x00007a7587819d04 in ACE_Thread_Adapter::invoke (this=0x55d733f66a30) at /var/lib/jenkins/workspace/ACE_TAO_Ubuntu_22_04_Clang22_x64_Debug/ACE/ace/Thread_Adapter.cpp:94
#10 0x00007a758775d67e in ace_thread_adapter (args=0x55d733f66a30) at /var/lib/jenkins/workspace/ACE_TAO_Ubuntu_22_04_Clang22_x64_Debug/ACE/ace/Base_Thread_Adapter.cpp:116
#11 0x00007a7587294a83 in start_thread (arg=<optimized out>) at ./nptl/pthread_create.c:442
#12 0x00007a75873268e0 in clone3 () at ../sysdeps/unix/sysv/linux/x86_64/clone3.S:81
Thread 4 (Thread 0x7a75861fd640 (LWP 163921) "ContentFiltered"):
#0 __futex_abstimed_wait_common64 (private=-2044737112, cancel=true, abstime=0x7a75861fcad0, op=137, expected=0, futex_word=0x55d733f64864) at ./nptl/futex-internal.c:57
#1 __futex_abstimed_wait_common (cancel=true, private=-2044737112, abstime=0x7a75861fcad0, clockid=-2044737016, expected=0, futex_word=0x55d733f64864) at ./nptl/futex-internal.c:87
#2 __GI___futex_abstimed_wait_cancelable64 (futex_word=futex_word@entry=0x55d733f64864, expected=expected@entry=0, clockid=clockid@entry=1, abstime=abstime@entry=0x7a75861fcad0, private=private@entry=0) at ./nptl/futex-internal.c:139
#3 0x00007a7587293e5b in __pthread_cond_wait_common (abstime=0x7a75861fcad0, clockid=1, mutex=0x55d733f64808, cond=0x55d733f64838) at ./nptl/pthread_cond_wait.c:503
#4 ___pthread_cond_timedwait64 (cond=0x55d733f64838, mutex=0x55d733f64808, abstime=0x7a75861fcad0) at ./nptl/pthread_cond_wait.c:652
#5 0x00007a758776ef8f in ACE_OS::cond_timedwait (cv=0x55d733f64838, external_mutex=0x55d733f64808, timeout=0x7a75861fcc60) at ../ace/OS_NS_Thread.inl:401
#6 0x00007a758776f365 in ACE_Condition<ACE_Thread_Mutex>::wait (this=0x55d733f64838, mutex=..., abstime=0x7a75861fcc60) at /var/lib/jenkins/workspace/ACE_TAO_Ubuntu_22_04_Clang22_x64_Debug/ACE/ace/Condition_Thread_Mutex.cpp:92
#7 0x00007a758776f391 in ACE_Condition<ACE_Thread_Mutex>::wait (this=0x55d733f64838, abstime=0x7a75861fcc60) at /var/lib/jenkins/workspace/ACE_TAO_Ubuntu_22_04_Clang22_x64_Debug/ACE/ace/Condition_Thread_Mutex.cpp:101
#8 0x00007a758900db42 in OpenDDS::DCPS::ConditionVariable<ACE_Thread_Mutex>::wait_until (this=0x55d733f64838, expire_at=..., thread_status_manager=...) at DCPS/ConditionVariable.h:72
#9 0x00007a758901a51a in OpenDDS::DCPS::DispatchService::run_event_loop (this=0x55d733f647f0) at DCPS/DispatchService.cpp:199
#10 0x00007a75890194cd in OpenDDS::DCPS::DispatchService::run (arg=0x55d733f647f0) at DCPS/DispatchService.cpp:161
#11 0x00007a7589171188 in OpenDDS::DCPS::ThreadPool::run (arg=0x55d733f648f0) at DCPS/ThreadPool.cpp:64
#12 0x00007a75877c9815 in ACE_OS_Thread_Adapter::invoke (this=0x55d733f628c0) at /var/lib/jenkins/workspace/ACE_TAO_Ubuntu_22_04_Clang22_x64_Debug/ACE/ace/OS_Thread_Adapter.cpp:90
#13 0x00007a758775d67e in ace_thread_adapter (args=0x55d733f628c0) at /var/lib/jenkins/workspace/ACE_TAO_Ubuntu_22_04_Clang22_x64_Debug/ACE/ace/Base_Thread_Adapter.cpp:116
#14 0x00007a7587294a83 in start_thread (arg=<optimized out>) at ./nptl/pthread_create.c:442
#15 0x00007a75873268e0 in clone3 () at ../sysdeps/unix/sysv/linux/x86_64/clone3.S:81
Thread 3 (Thread 0x7a75869fe640 (LWP 163920) "ContentFiltered"):
#0 0x00007a758731b78d in __GI___select (nfds=6, readfds=0x55d733ee6548, writefds=0x0, exceptfds=0x0, timeout=0x0) at ../sysdeps/unix/sysv/linux/select.c:69
#1 0x00007a75890f2c4d in ACE_OS::select (width=6, rfds=0x55d733ee6548, wfds=0x0, efds=0x0, timeout=0x0) at /var/lib/jenkins/workspace/ACE_TAO_Ubuntu_22_04_Clang22_x64_Debug/ACE/ace/OS_NS_sys_select.inl:41
#2 0x00007a75890ed844 in ACE_Select_Reactor_T<ACE_Reactor_Token_T<ACE_Token> >::wait_for_multiple_events (this=0x55d733ee6500, dispatch_set=..., max_wait_time=0x0) at /var/lib/jenkins/workspace/ACE_TAO_Ubuntu_22_04_Clang22_x64_Debug/ACE/ace/Select_Reactor_T.cpp:1104
#3 0x00007a75890f2f88 in ACE_Select_Reactor_T<ACE_Reactor_Token_T<ACE_Token> >::handle_events_i (this=0x55d733ee6500, max_wait_time=0x0) at /var/lib/jenkins/workspace/ACE_TAO_Ubuntu_22_04_Clang22_x64_Debug/ACE/ace/Select_Reactor_T.cpp:1453
#4 0x00007a75890eafea in ACE_Select_Reactor_T<ACE_Reactor_Token_T<ACE_Token> >::handle_events (this=0x55d733ee6500, max_wait_time=0x0) at /var/lib/jenkins/workspace/ACE_TAO_Ubuntu_22_04_Clang22_x64_Debug/ACE/ace/Select_Reactor_T.cpp:1433
#5 0x00007a75877f080f in ACE_Reactor::run_reactor_event_loop (this=0x55d733ee15f0, eh=0x0) at /var/lib/jenkins/workspace/ACE_TAO_Ubuntu_22_04_Clang22_x64_Debug/ACE/ace/Reactor.cpp:192
#6 0x00007a75890e4722 in OpenDDS::DCPS::ReactorTask::svc (this=0x55d733edc510) at DCPS/ReactorTask.cpp:234
#7 0x00007a7587819671 in ACE_Task_Base::svc_run (args=0x55d733edc718) at /var/lib/jenkins/workspace/ACE_TAO_Ubuntu_22_04_Clang22_x64_Debug/ACE/ace/Task.cpp:269
#8 0x00007a7587819e0c in ACE_Thread_Adapter::invoke_i (this=0x55d733ee93e0) at /var/lib/jenkins/workspace/ACE_TAO_Ubuntu_22_04_Clang22_x64_Debug/ACE/ace/Thread_Adapter.cpp:143
#9 0x00007a7587819d04 in ACE_Thread_Adapter::invoke (this=0x55d733ee93e0) at /var/lib/jenkins/workspace/ACE_TAO_Ubuntu_22_04_Clang22_x64_Debug/ACE/ace/Thread_Adapter.cpp:94
#10 0x00007a758775d67e in ace_thread_adapter (args=0x55d733ee93e0) at /var/lib/jenkins/workspace/ACE_TAO_Ubuntu_22_04_Clang22_x64_Debug/ACE/ace/Base_Thread_Adapter.cpp:116
#11 0x00007a7587294a83 in start_thread (arg=<optimized out>) at ./nptl/pthread_create.c:442
#12 0x00007a75873268e0 in clone3 () at ../sysdeps/unix/sysv/linux/x86_64/clone3.S:81
Thread 2 (Thread 0x7a75871ff640 (LWP 163919) "ContentFiltered"):
#0 __futex_abstimed_wait_common64 (private=0, cancel=true, abstime=0x0, op=393, expected=0, futex_word=0x55d733ee5ac0) at ./nptl/futex-internal.c:57
#1 __futex_abstimed_wait_common (cancel=true, private=0, abstime=0x0, clockid=0, expected=0, futex_word=0x55d733ee5ac0) at ./nptl/futex-internal.c:87
#2 __GI___futex_abstimed_wait_cancelable64 (futex_word=futex_word@entry=0x55d733ee5ac0, expected=expected@entry=0, clockid=clockid@entry=0, abstime=abstime@entry=0x0, private=private@entry=0) at ./nptl/futex-internal.c:139
#3 0x00007a7587293a01 in __pthread_cond_wait_common (abstime=0x0, clockid=0, mutex=0x55d733ee5a68, cond=0x55d733ee5a98) at ./nptl/pthread_cond_wait.c:503
#4 ___pthread_cond_wait (cond=0x55d733ee5a98, mutex=0x55d733ee5a68) at ./nptl/pthread_cond_wait.c:627
#5 0x00007a758776eedd in ACE_OS::cond_wait (cv=0x55d733ee5a98, external_mutex=0x55d733ee5a68) at ../ace/OS_NS_Thread.inl:370
#6 0x00007a758776f329 in ACE_Condition<ACE_Thread_Mutex>::wait (this=0x55d733ee5a98) at /var/lib/jenkins/workspace/ACE_TAO_Ubuntu_22_04_Clang22_x64_Debug/ACE/ace/Condition_Thread_Mutex.cpp:84
#7 0x00007a758a2f924e in OpenDDS::DCPS::ConditionVariable<ACE_Thread_Mutex>::wait (this=0x55d733ee5a98, thread_status_manager=...) at /var/lib/jenkins/workspace/OpenDDS_ACE8_Ubuntu_22_04_Clang22_x64_Debug/dds/DCPS/ConditionVariable.h:56
#8 0x00007a758901a55b in OpenDDS::DCPS::DispatchService::run_event_loop (this=0x55d733ee5a50) at DCPS/DispatchService.cpp:201
#9 0x00007a75890194cd in OpenDDS::DCPS::DispatchService::run (arg=0x55d733ee5a50) at DCPS/DispatchService.cpp:161
#10 0x00007a7589171188 in OpenDDS::DCPS::ThreadPool::run (arg=0x55d733ee5b50) at DCPS/ThreadPool.cpp:64
#11 0x00007a75877c9815 in ACE_OS_Thread_Adapter::invoke (this=0x55d733ee2720) at /var/lib/jenkins/workspace/ACE_TAO_Ubuntu_22_04_Clang22_x64_Debug/ACE/ace/OS_Thread_Adapter.cpp:90
#12 0x00007a758775d67e in ace_thread_adapter (args=0x55d733ee2720) at /var/lib/jenkins/workspace/ACE_TAO_Ubuntu_22_04_Clang22_x64_Debug/ACE/ace/Base_Thread_Adapter.cpp:116
#13 0x00007a7587294a83 in start_thread (arg=<optimized out>) at ./nptl/pthread_create.c:442
#14 0x00007a75873268e0 in clone3 () at ../sysdeps/unix/sysv/linux/x86_64/clone3.S:81
Thread 1 (Thread 0x7a758a497740 (LWP 163918) "ContentFiltered"):
#0 __futex_abstimed_wait_common64 (private=0, cancel=true, abstime=0x0, op=393, expected=0, futex_word=0x55d733f97460) at ./nptl/futex-internal.c:57
#1 __futex_abstimed_wait_common (cancel=true, private=0, abstime=0x0, clockid=0, expected=0, futex_word=0x55d733f97460) at ./nptl/futex-internal.c:87
#2 __GI___futex_abstimed_wait_cancelable64 (futex_word=futex_word@entry=0x55d733f97460, expected=expected@entry=0, clockid=clockid@entry=0, abstime=abstime@entry=0x0, private=private@entry=0) at ./nptl/futex-internal.c:139
#3 0x00007a7587293a01 in __pthread_cond_wait_common (abstime=0x0, clockid=0, mutex=0x55d733f97408, cond=0x55d733f97438) at ./nptl/pthread_cond_wait.c:503
#4 ___pthread_cond_wait (cond=0x55d733f97438, mutex=0x55d733f97408) at ./nptl/pthread_cond_wait.c:627
#5 0x00007a758776eedd in ACE_OS::cond_wait (cv=0x55d733f97438, external_mutex=0x55d733f97408) at ../ace/OS_NS_Thread.inl:370
#6 0x00007a758776ecd3 in ACE_Condition<ACE_Recursive_Thread_Mutex>::wait (this=0x55d733f97438, mutex=..., abstime=0x0) at /var/lib/jenkins/workspace/ACE_TAO_Ubuntu_22_04_Clang22_x64_Debug/ACE/ace/Condition_Recursive_Thread_Mutex.cpp:88
#7 0x00007a758776ec61 in ACE_Condition<ACE_Recursive_Thread_Mutex>::wait (this=0x55d733f97438, abstime=0x0) at /var/lib/jenkins/workspace/ACE_TAO_Ubuntu_22_04_Clang22_x64_Debug/ACE/ace/Condition_Recursive_Thread_Mutex.cpp:64
#8 0x00007a7589109df2 in OpenDDS::DCPS::ConditionVariable<ACE_Recursive_Thread_Mutex>::wait (this=0x55d733f97438, thread_status_manager=...) at DCPS/ConditionVariable.h:56
#9 0x00007a758918f78e in DDS::WaitSet::wait (this=0x55d733f97400, active_conditions=..., timeout=...) at DCPS/WaitSet.cpp:148
#10 0x000055d6fbb086b5 in Utils::waitForSample (dr=...) at /var/lib/jenkins/workspace/OpenDDS_ACE8_Ubuntu_22_04_Clang22_x64_Debug/tests/Utils/WaitForSample.h:22
#11 0x000055d6fbb02752 in run_filtering_test (ts=..., pub=..., sub=..., sub2=...) at /var/lib/jenkins/workspace/OpenDDS_ACE8_Ubuntu_22_04_Clang22_x64_Debug/tests/DCPS/ContentFilteredTopic/ContentFilteredTopicTest.cpp:272
#12 0x000055d6fbb06896 in run_test (argc=2, argv=0x7fffed612578) at /var/lib/jenkins/workspace/OpenDDS_ACE8_Ubuntu_22_04_Clang22_x64_Debug/tests/DCPS/ContentFilteredTopic/ContentFilteredTopicTest.cpp:678
#13 0x000055d6fbb06b99 in main (argc=4, argv=0x7fffed612578) at /var/lib/jenkins/workspace/OpenDDS_ACE8_Ubuntu_22_04_Clang22_x64_Debug/tests/DCPS/ContentFilteredTopic/ContentFilteredTopicTest.cpp:693
[Inferior 1 (process 163918) detached]
======= End stuck stacks =======
[Details] ERROR: test returned -1
[Details] auto_run_tests.pl: ERROR: "tests/DCPS/ContentFilteredTopic/run_test.pl rtps_disc dynamic" returned with status 1
tests/DCPS/ContentFilteredTopic/run_test.pl rtps_disc nopub dynamic
[Details] ERROR: ContentFilteredTopicTest timedout
======= Begin stuck stacks =======
[New LWP 163949]
[New LWP 163950]
[New LWP 163951]
[New LWP 163952]
[New LWP 163953]
[New LWP 163954]
[New LWP 163955]
[New LWP 163956]
[New LWP 163957]
[New LWP 163958]
[New LWP 163959]
[New LWP 163960]
[Thread debugging using libthread_db enabled]
Using host libthread_db library "/lib/x86_64-linux-gnu/libthread_db.so.1".
__futex_abstimed_wait_common64 (private=0, cancel=true, abstime=0x0, op=393, expected=0, futex_word=0x643a6ae583f0) at ./nptl/futex-internal.c:57
57 ./nptl/futex-internal.c: No such file or directory.
Thread 13 (Thread 0x79368cff9640 (LWP 163960) "ContentFiltered"):
#0 0x00007936a6f1b78d in __GI___select (nfds=24, readfds=0x643a6af7ba98, writefds=0x0, exceptfds=0x0, timeout=0x0) at ../sysdeps/unix/sysv/linux/select.c:69
#1 0x00007936a8cf2c4d in ACE_OS::select (width=24, rfds=0x643a6af7ba98, wfds=0x0, efds=0x0, timeout=0x0) at /var/lib/jenkins/workspace/ACE_TAO_Ubuntu_22_04_Clang22_x64_Debug/ACE/ace/OS_NS_sys_select.inl:41
#2 0x00007936a8ced844 in ACE_Select_Reactor_T<ACE_Reactor_Token_T<ACE_Token> >::wait_for_multiple_events (this=0x643a6af7ba50, dispatch_set=..., max_wait_time=0x0) at /var/lib/jenkins/workspace/ACE_TAO_Ubuntu_22_04_Clang22_x64_Debug/ACE/ace/Select_Reactor_T.cpp:1104
#3 0x00007936a8cf2f88 in ACE_Select_Reactor_T<ACE_Reactor_Token_T<ACE_Token> >::handle_events_i (this=0x643a6af7ba50, max_wait_time=0x0) at /var/lib/jenkins/workspace/ACE_TAO_Ubuntu_22_04_Clang22_x64_Debug/ACE/ace/Select_Reactor_T.cpp:1453
#4 0x00007936a8ceafea in ACE_Select_Reactor_T<ACE_Reactor_Token_T<ACE_Token> >::handle_events (this=0x643a6af7ba50, max_wait_time=0x0) at /var/lib/jenkins/workspace/ACE_TAO_Ubuntu_22_04_Clang22_x64_Debug/ACE/ace/Select_Reactor_T.cpp:1433
#5 0x00007936a73f080f in ACE_Reactor::run_reactor_event_loop (this=0x643a6af7a410, eh=0x0) at /var/lib/jenkins/workspace/ACE_TAO_Ubuntu_22_04_Clang22_x64_Debug/ACE/ace/Reactor.cpp:192
#6 0x00007936a8ce4722 in OpenDDS::DCPS::ReactorTask::svc (this=0x643a6af7af30) at DCPS/ReactorTask.cpp:234
#7 0x00007936a7419671 in ACE_Task_Base::svc_run (args=0x643a6af7b138) at /var/lib/jenkins/workspace/ACE_TAO_Ubuntu_22_04_Clang22_x64_Debug/ACE/ace/Task.cpp:269
#8 0x00007936a7419e0c in ACE_Thread_Adapter::invoke_i (this=0x643a6af79b30) at /var/lib/jenkins/workspace/ACE_TAO_Ubuntu_22_04_Clang22_x64_Debug/ACE/ace/Thread_Adapter.cpp:143
#9 0x00007936a7419d04 in ACE_Thread_Adapter::invoke (this=0x643a6af79b30) at /var/lib/jenkins/workspace/ACE_TAO_Ubuntu_22_04_Clang22_x64_Debug/ACE/ace/Thread_Adapter.cpp:94
#10 0x00007936a735d67e in ace_thread_adapter (args=0x643a6af79b30) at /var/lib/jenkins/workspace/ACE_TAO_Ubuntu_22_04_Clang22_x64_Debug/ACE/ace/Base_Thread_Adapter.cpp:116
#11 0x00007936a6e94a83 in start_thread (arg=<optimized out>) at ./nptl/pthread_create.c:442
#12 0x00007936a6f268e0 in clone3 () at ../sysdeps/unix/sysv/linux/x86_64/clone3.S:81
Thread 12 (Thread 0x79368d7fa640 (LWP 163959) "ContentFiltered"):
#0 __futex_abstimed_wait_common64 (private=0, cancel=true, abstime=0x0, op=393, expected=0, futex_word=0x643a6af78f04) at ./nptl/futex-internal.c:57
#1 __futex_abstimed_wait_common (cancel=true, private=0, abstime=0x0, clockid=0, expected=0, futex_word=0x643a6af78f04) at ./nptl/futex-internal.c:87
#2 __GI___futex_abstimed_wait_cancelable64 (futex_word=futex_word@entry=0x643a6af78f04, expected=expected@entry=0, clockid=clockid@entry=0, abstime=abstime@entry=0x0, private=private@entry=0) at ./nptl/futex-internal.c:139
#3 0x00007936a6e93a01 in __pthread_cond_wait_common (abstime=0x0, clockid=0, mutex=0x643a6af78ea8, cond=0x643a6af78ed8) at ./nptl/pthread_cond_wait.c:503
#4 ___pthread_cond_wait (cond=0x643a6af78ed8, mutex=0x643a6af78ea8) at ./nptl/pthread_cond_wait.c:627
#5 0x00007936a736eedd in ACE_OS::cond_wait (cv=0x643a6af78ed8, external_mutex=0x643a6af78ea8) at ../ace/OS_NS_Thread.inl:370
#6 0x00007936a736f329 in ACE_Condition<ACE_Thread_Mutex>::wait (this=0x643a6af78ed8) at /var/lib/jenkins/workspace/ACE_TAO_Ubuntu_22_04_Clang22_x64_Debug/ACE/ace/Condition_Thread_Mutex.cpp:84
#7 0x00007936a9ef924e in OpenDDS::DCPS::ConditionVariable<ACE_Thread_Mutex>::wait (this=0x643a6af78ed8, thread_status_manager=...) at /var/lib/jenkins/workspace/OpenDDS_ACE8_Ubuntu_22_04_Clang22_x64_Debug/dds/DCPS/ConditionVariable.h:56
#8 0x00007936a8c1a55b in OpenDDS::DCPS::DispatchService::run_event_loop (this=0x643a6af78e90) at DCPS/DispatchService.cpp:201
#9 0x00007936a8c194cd in OpenDDS::DCPS::DispatchService::run (arg=0x643a6af78e90) at DCPS/DispatchService.cpp:161
#10 0x00007936a8d71188 in OpenDDS::DCPS::ThreadPool::run (arg=0x643a6af78f90) at DCPS/ThreadPool.cpp:64
#11 0x00007936a73c9815 in ACE_OS_Thread_Adapter::invoke (this=0x643a6af6f5a0) at /var/lib/jenkins/workspace/ACE_TAO_Ubuntu_22_04_Clang22_x64_Debug/ACE/ace/OS_Thread_Adapter.cpp:90
#12 0x00007936a735d67e in ace_thread_adapter (args=0x643a6af6f5a0) at /var/lib/jenkins/workspace/ACE_TAO_Ubuntu_22_04_Clang22_x64_Debug/ACE/ace/Base_Thread_Adapter.cpp:116
#13 0x00007936a6e94a83 in start_thread (arg=<optimized out>) at ./nptl/pthread_create.c:442
#14 0x00007936a6f268e0 in clone3 () at ../sysdeps/unix/sysv/linux/x86_64/clone3.S:81
Thread 11 (Thread 0x79368dffb640 (LWP 163958) "ContentFiltered"):
#0 0x00007936a6f1b78d in __GI___select (nfds=21, readfds=0x643a6af5a2d8, writefds=0x0, exceptfds=0x0, timeout=0x0) at ../sysdeps/unix/sysv/linux/select.c:69
#1 0x00007936a8cf2c4d in ACE_OS::select (width=21, rfds=0x643a6af5a2d8, wfds=0x0, efds=0x0, timeout=0x0) at /var/lib/jenkins/workspace/ACE_TAO_Ubuntu_22_04_Clang22_x64_Debug/ACE/ace/OS_NS_sys_select.inl:41
#2 0x00007936a8ced844 in ACE_Select_Reactor_T<ACE_Reactor_Token_T<ACE_Token> >::wait_for_multiple_events (this=0x643a6af5a290, dispatch_set=..., max_wait_time=0x0) at /var/lib/jenkins/workspace/ACE_TAO_Ubuntu_22_04_Clang22_x64_Debug/ACE/ace/Select_Reactor_T.cpp:1104
#3 0x00007936a8cf2f88 in ACE_Select_Reactor_T<ACE_Reactor_Token_T<ACE_Token> >::handle_events_i (this=0x643a6af5a290, max_wait_time=0x0) at /var/lib/jenkins/workspace/ACE_TAO_Ubuntu_22_04_Clang22_x64_Debug/ACE/ace/Select_Reactor_T.cpp:1453
#4 0x00007936a8ceafea in ACE_Select_Reactor_T<ACE_Reactor_Token_T<ACE_Token> >::handle_events (this=0x643a6af5a290, max_wait_time=0x0) at /var/lib/jenkins/workspace/ACE_TAO_Ubuntu_22_04_Clang22_x64_Debug/ACE/ace/Select_Reactor_T.cpp:1433
#5 0x00007936a73f080f in ACE_Reactor::run_reactor_event_loop (this=0x643a6af58c50, eh=0x0) at /var/lib/jenkins/workspace/ACE_TAO_Ubuntu_22_04_Clang22_x64_Debug/ACE/ace/Reactor.cpp:192
#6 0x00007936a8ce4722 in OpenDDS::DCPS::ReactorTask::svc (this=0x643a6af59770) at DCPS/ReactorTask.cpp:234
#7 0x00007936a7419671 in ACE_Task_Base::svc_run (args=0x643a6af59978) at /var/lib/jenkins/workspace/ACE_TAO_Ubuntu_22_04_Clang22_x64_Debug/ACE/ace/Task.cpp:269
#8 0x00007936a7419e0c in ACE_Thread_Adapter::invoke_i (this=0x643a6af3e290) at /var/lib/jenkins/workspace/ACE_TAO_Ubuntu_22_04_Clang22_x64_Debug/ACE/ace/Thread_Adapter.cpp:143
#9 0x00007936a7419d04 in ACE_Thread_Adapter::invoke (this=0x643a6af3e290) at /var/lib/jenkins/workspace/ACE_TAO_Ubuntu_22_04_Clang22_x64_Debug/ACE/ace/Thread_Adapter.cpp:94
#10 0x00007936a735d67e in ace_thread_adapter (args=0x643a6af3e290) at /var/lib/jenkins/workspace/ACE_TAO_Ubuntu_22_04_Clang22_x64_Debug/ACE/ace/Base_Thread_Adapter.cpp:116
#11 0x00007936a6e94a83 in start_thread (arg=<optimized out>) at ./nptl/pthread_create.c:442
#12 0x00007936a6f268e0 in clone3 () at ../sysdeps/unix/sysv/linux/x86_64/clone3.S:81
Thread 10 (Thread 0x79368e7fc640 (LWP 163957) "ContentFiltered"):
#0 __futex_abstimed_wait_common64 (private=0, cancel=true, abstime=0x0, op=393, expected=0, futex_word=0x643a6af576b4) at ./nptl/futex-internal.c:57
#1 __futex_abstimed_wait_common (cancel=true, private=0, abstime=0x0, clockid=0, expected=0, futex_word=0x643a6af576b4) at ./nptl/futex-internal.c:87
#2 __GI___futex_abstimed_wait_cancelable64 (futex_word=futex_word@entry=0x643a6af576b4, expected=expected@entry=0, clockid=clockid@entry=0, abstime=abstime@entry=0x0, private=private@entry=0) at ./nptl/futex-internal.c:139
#3 0x00007936a6e93a01 in __pthread_cond_wait_common (abstime=0x0, clockid=0, mutex=0x643a6af57658, cond=0x643a6af57688) at ./nptl/pthread_cond_wait.c:503
#4 ___pthread_cond_wait (cond=0x643a6af57688, mutex=0x643a6af57658) at ./nptl/pthread_cond_wait.c:627
#5 0x00007936a736eedd in ACE_OS::cond_wait (cv=0x643a6af57688, external_mutex=0x643a6af57658) at ../ace/OS_NS_Thread.inl:370
#6 0x00007936a736f329 in ACE_Condition<ACE_Thread_Mutex>::wait (this=0x643a6af57688) at /var/lib/jenkins/workspace/ACE_TAO_Ubuntu_22_04_Clang22_x64_Debug/ACE/ace/Condition_Thread_Mutex.cpp:84
#7 0x00007936a9ef924e in OpenDDS::DCPS::ConditionVariable<ACE_Thread_Mutex>::wait (this=0x643a6af57688, thread_status_manager=...) at /var/lib/jenkins/workspace/OpenDDS_ACE8_Ubuntu_22_04_Clang22_x64_Debug/dds/DCPS/ConditionVariable.h:56
#8 0x00007936a8c1a55b in OpenDDS::DCPS::DispatchService::run_event_loop (this=0x643a6af57640) at DCPS/DispatchService.cpp:201
#9 0x00007936a8c194cd in OpenDDS::DCPS::DispatchService::run (arg=0x643a6af57640) at DCPS/DispatchService.cpp:161
#10 0x00007936a8d71188 in OpenDDS::DCPS::ThreadPool::run (arg=0x643a6af57740) at DCPS/ThreadPool.cpp:64
#11 0x00007936a73c9815 in ACE_OS_Thread_Adapter::invoke (this=0x643a6af3f040) at /var/lib/jenkins/workspace/ACE_TAO_Ubuntu_22_04_Clang22_x64_Debug/ACE/ace/OS_Thread_Adapter.cpp:90
#12 0x00007936a735d67e in ace_thread_adapter (args=0x643a6af3f040) at /var/lib/jenkins/workspace/ACE_TAO_Ubuntu_22_04_Clang22_x64_Debug/ACE/ace/Base_Thread_Adapter.cpp:116
#13 0x00007936a6e94a83 in start_thread (arg=<optimized out>) at ./nptl/pthread_create.c:442
#14 0x00007936a6f268e0 in clone3 () at ../sysdeps/unix/sysv/linux/x86_64/clone3.S:81
Thread 9 (Thread 0x79368effd640 (LWP 163956) "ContentFiltered"):
#0 0x00007936a6f1b78d in __GI___select (nfds=18, readfds=0x643a6af2d2b8, writefds=0x0, exceptfds=0x0, timeout=0x0) at ../sysdeps/unix/sysv/linux/select.c:69
#1 0x00007936a8cf2c4d in ACE_OS::select (width=18, rfds=0x643a6af2d2b8, wfds=0x0, efds=0x0, timeout=0x0) at /var/lib/jenkins/workspace/ACE_TAO_Ubuntu_22_04_Clang22_x64_Debug/ACE/ace/OS_NS_sys_select.inl:41
#2 0x00007936a8ced844 in ACE_Select_Reactor_T<ACE_Reactor_Token_T<ACE_Token> >::wait_for_multiple_events (this=0x643a6af2d270, dispatch_set=..., max_wait_time=0x0) at /var/lib/jenkins/workspace/ACE_TAO_Ubuntu_22_04_Clang22_x64_Debug/ACE/ace/Select_Reactor_T.cpp:1104
#3 0x00007936a8cf2f88 in ACE_Select_Reactor_T<ACE_Reactor_Token_T<ACE_Token> >::handle_events_i (this=0x643a6af2d270, max_wait_time=0x0) at /var/lib/jenkins/workspace/ACE_TAO_Ubuntu_22_04_Clang22_x64_Debug/ACE/ace/Select_Reactor_T.cpp:1453
#4 0x00007936a8ceafea in ACE_Select_Reactor_T<ACE_Reactor_Token_T<ACE_Token> >::handle_events (this=0x643a6af2d270, max_wait_time=0x0) at /var/lib/jenkins/workspace/ACE_TAO_Ubuntu_22_04_Clang22_x64_Debug/ACE/ace/Select_Reactor_T.cpp:1433
#5 0x00007936a73f080f in ACE_Reactor::run_reactor_event_loop (this=0x643a6af17840, eh=0x0) at /var/lib/jenkins/workspace/ACE_TAO_Ubuntu_22_04_Clang22_x64_Debug/ACE/ace/Reactor.cpp:192
#6 0x00007936a8ce4722 in OpenDDS::DCPS::ReactorTask::svc (this=0x643a6af2c750) at DCPS/ReactorTask.cpp:234
#7 0x00007936a7419671 in ACE_Task_Base::svc_run (args=0x643a6af2c958) at /var/lib/jenkins/workspace/ACE_TAO_Ubuntu_22_04_Clang22_x64_Debug/ACE/ace/Task.cpp:269
#8 0x00007936a7419e0c in ACE_Thread_Adapter::invoke_i (this=0x643a6af10870) at /var/lib/jenkins/workspace/ACE_TAO_Ubuntu_22_04_Clang22_x64_Debug/ACE/ace/Thread_Adapter.cpp:143
#9 0x00007936a7419d04 in ACE_Thread_Adapter::invoke (this=0x643a6af10870) at /var/lib/jenkins/workspace/ACE_TAO_Ubuntu_22_04_Clang22_x64_Debug/ACE/ace/Thread_Adapter.cpp:94
#10 0x00007936a735d67e in ace_thread_adapter (args=0x643a6af10870) at /var/lib/jenkins/workspace/ACE_TAO_Ubuntu_22_04_Clang22_x64_Debug/ACE/ace/Base_Thread_Adapter.cpp:116
#11 0x00007936a6e94a83 in start_thread (arg=<optimized out>) at ./nptl/pthread_create.c:442
#12 0x00007936a6f268e0 in clone3 () at ../sysdeps/unix/sysv/linux/x86_64/clone3.S:81
Thread 8 (Thread 0x79368f7fe640 (LWP 163955) "ContentFiltered"):
#0 __futex_abstimed_wait_common64 (private=0, cancel=true, abstime=0x0, op=393, expected=0, futex_word=0x643a6af2ac74) at ./nptl/futex-internal.c:57
#1 __futex_abstimed_wait_common (cancel=true, private=0, abstime=0x0, clockid=0, expected=0, futex_word=0x643a6af2ac74) at ./nptl/futex-internal.c:87
#2 __GI___futex_abstimed_wait_cancelable64 (futex_word=futex_word@entry=0x643a6af2ac74, expected=expected@entry=0, clockid=clockid@entry=0, abstime=abstime@entry=0x0, private=private@entry=0) at ./nptl/futex-internal.c:139
#3 0x00007936a6e93a01 in __pthread_cond_wait_common (abstime=0x0, clockid=0, mutex=0x643a6af2ac18, cond=0x643a6af2ac48) at ./nptl/pthread_cond_wait.c:503
#4 ___pthread_cond_wait (cond=0x643a6af2ac48, mutex=0x643a6af2ac18) at ./nptl/pthread_cond_wait.c:627
#5 0x00007936a736eedd in ACE_OS::cond_wait (cv=0x643a6af2ac48, external_mutex=0x643a6af2ac18) at ../ace/OS_NS_Thread.inl:370
#6 0x00007936a736f329 in ACE_Condition<ACE_Thread_Mutex>::wait (this=0x643a6af2ac48) at /var/lib/jenkins/workspace/ACE_TAO_Ubuntu_22_04_Clang22_x64_Debug/ACE/ace/Condition_Thread_Mutex.cpp:84
#7 0x00007936a9ef924e in OpenDDS::DCPS::ConditionVariable<ACE_Thread_Mutex>::wait (this=0x643a6af2ac48, thread_status_manager=...) at /var/lib/jenkins/workspace/OpenDDS_ACE8_Ubuntu_22_04_Clang22_x64_Debug/dds/DCPS/ConditionVariable.h:56
#8 0x00007936a8c1a55b in OpenDDS::DCPS::DispatchService::run_event_loop (this=0x643a6af2ac00) at DCPS/DispatchService.cpp:201
#9 0x00007936a8c194cd in OpenDDS::DCPS::DispatchService::run (arg=0x643a6af2ac00) at DCPS/DispatchService.cpp:161
#10 0x00007936a8d71188 in OpenDDS::DCPS::ThreadPool::run (arg=0x643a6af2ad00) at DCPS/ThreadPool.cpp:64
#11 0x00007936a73c9815 in ACE_OS_Thread_Adapter::invoke (this=0x643a6af08470) at /var/lib/jenkins/workspace/ACE_TAO_Ubuntu_22_04_Clang22_x64_Debug/ACE/ace/OS_Thread_Adapter.cpp:90
#12 0x00007936a735d67e in ace_thread_adapter (args=0x643a6af08470) at /var/lib/jenkins/workspace/ACE_TAO_Ubuntu_22_04_Clang22_x64_Debug/ACE/ace/Base_Thread_Adapter.cpp:116
#13 0x00007936a6e94a83 in start_thread (arg=<optimized out>) at ./nptl/pthread_create.c:442
#14 0x00007936a6f268e0 in clone3 () at ../sysdeps/unix/sysv/linux/x86_64/clone3.S:81
Thread 7 (Thread 0x79368ffff640 (LWP 163954) "ContentFiltered"):
#0 0x00007936a6f1b78d in __GI___select (nfds=16, readfds=0x643a6aedc098, writefds=0x0, exceptfds=0x0, timeout=0x0) at ../sysdeps/unix/sysv/linux/select.c:69
#1 0x00007936a8cf2c4d in ACE_OS::select (width=16, rfds=0x643a6aedc098, wfds=0x0, efds=0x0, timeout=0x0) at /var/lib/jenkins/workspace/ACE_TAO_Ubuntu_22_04_Clang22_x64_Debug/ACE/ace/OS_NS_sys_select.inl:41
#2 0x00007936a8ced844 in ACE_Select_Reactor_T<ACE_Reactor_Token_T<ACE_Token> >::wait_for_multiple_events (this=0x643a6aedc050, dispatch_set=..., max_wait_time=0x0) at /var/lib/jenkins/workspace/ACE_TAO_Ubuntu_22_04_Clang22_x64_Debug/ACE/ace/Select_Reactor_T.cpp:1104
#3 0x00007936a8cf2f88 in ACE_Select_Reactor_T<ACE_Reactor_Token_T<ACE_Token> >::handle_events_i (this=0x643a6aedc050, max_wait_time=0x0) at /var/lib/jenkins/workspace/ACE_TAO_Ubuntu_22_04_Clang22_x64_Debug/ACE/ace/Select_Reactor_T.cpp:1453
#4 0x00007936a8ceafea in ACE_Select_Reactor_T<ACE_Reactor_Token_T<ACE_Token> >::handle_events (this=0x643a6aedc050, max_wait_time=0x0) at /var/lib/jenkins/workspace/ACE_TAO_Ubuntu_22_04_Clang22_x64_Debug/ACE/ace/Select_Reactor_T.cpp:1433
#5 0x00007936a73f080f in ACE_Reactor::run_reactor_event_loop (this=0x643a6aeda480, eh=0x0) at /var/lib/jenkins/workspace/ACE_TAO_Ubuntu_22_04_Clang22_x64_Debug/ACE/ace/Reactor.cpp:192
#6 0x00007936a8ce4722 in OpenDDS::DCPS::ReactorTask::svc (this=0x643a6aedb530) at DCPS/ReactorTask.cpp:234
#7 0x00007936a7419671 in ACE_Task_Base::svc_run (args=0x643a6aedb738) at /var/lib/jenkins/workspace/ACE_TAO_Ubuntu_22_04_Clang22_x64_Debug/ACE/ace/Task.cpp:269
#8 0x00007936a7419e0c in ACE_Thread_Adapter::invoke_i (this=0x643a6aedaf20) at /var/lib/jenkins/workspace/ACE_TAO_Ubuntu_22_04_Clang22_x64_Debug/ACE/ace/Thread_Adapter.cpp:143
#9 0x00007936a7419d04 in ACE_Thread_Adapter::invoke (this=0x643a6aedaf20) at /var/lib/jenkins/workspace/ACE_TAO_Ubuntu_22_04_Clang22_x64_Debug/ACE/ace/Thread_Adapter.cpp:94
#10 0x00007936a735d67e in ace_thread_adapter (args=0x643a6aedaf20) at /var/lib/jenkins/workspace/ACE_TAO_Ubuntu_22_04_Clang22_x64_Debug/ACE/ace/Base_Thread_Adapter.cpp:116
#11 0x00007936a6e94a83 in start_thread (arg=<optimized out>) at ./nptl/pthread_create.c:442
#12 0x00007936a6f268e0 in clone3 () at ../sysdeps/unix/sysv/linux/x86_64/clone3.S:81
Thread 6 (Thread 0x7936a4dfb640 (LWP 163953) "ContentFiltered"):
#0 __futex_abstimed_wait_common64 (private=-1528845912, cancel=true, abstime=0x7936a4dfaad0, op=137, expected=0, futex_word=0x643a6aed8f64) at ./nptl/futex-internal.c:57
#1 __futex_abstimed_wait_common (cancel=true, private=-1528845912, abstime=0x7936a4dfaad0, clockid=-1528845816, expected=0, futex_word=0x643a6aed8f64) at ./nptl/futex-internal.c:87
#2 __GI___futex_abstimed_wait_cancelable64 (futex_word=futex_word@entry=0x643a6aed8f64, expected=expected@entry=0, clockid=clockid@entry=1, abstime=abstime@entry=0x7936a4dfaad0, private=private@entry=0) at ./nptl/futex-internal.c:139
#3 0x00007936a6e93e5b in __pthread_cond_wait_common (abstime=0x7936a4dfaad0, clockid=1, mutex=0x643a6aed8f08, cond=0x643a6aed8f38) at ./nptl/pthread_cond_wait.c:503
#4 ___pthread_cond_timedwait64 (cond=0x643a6aed8f38, mutex=0x643a6aed8f08, abstime=0x7936a4dfaad0) at ./nptl/pthread_cond_wait.c:652
#5 0x00007936a736ef8f in ACE_OS::cond_timedwait (cv=0x643a6aed8f38, external_mutex=0x643a6aed8f08, timeout=0x7936a4dfac60) at ../ace/OS_NS_Thread.inl:401
#6 0x00007936a736f365 in ACE_Condition<ACE_Thread_Mutex>::wait (this=0x643a6aed8f38, mutex=..., abstime=0x7936a4dfac60) at /var/lib/jenkins/workspace/ACE_TAO_Ubuntu_22_04_Clang22_x64_Debug/ACE/ace/Condition_Thread_Mutex.cpp:92
#7 0x00007936a736f391 in ACE_Condition<ACE_Thread_Mutex>::wait (this=0x643a6aed8f38, abstime=0x7936a4dfac60) at /var/lib/jenkins/workspace/ACE_TAO_Ubuntu_22_04_Clang22_x64_Debug/ACE/ace/Condition_Thread_Mutex.cpp:101
#8 0x00007936a8c0db42 in OpenDDS::DCPS::ConditionVariable<ACE_Thread_Mutex>::wait_until (this=0x643a6aed8f38, expire_at=..., thread_status_manager=...) at DCPS/ConditionVariable.h:72
#9 0x00007936a8c1a51a in OpenDDS::DCPS::DispatchService::run_event_loop (this=0x643a6aed8ef0) at DCPS/DispatchService.cpp:199
#10 0x00007936a8c194cd in OpenDDS::DCPS::DispatchService::run (arg=0x643a6aed8ef0) at DCPS/DispatchService.cpp:161
#11 0x00007936a8d71188 in OpenDDS::DCPS::ThreadPool::run (arg=0x643a6aed8ff0) at DCPS/ThreadPool.cpp:64
#12 0x00007936a73c9815 in ACE_OS_Thread_Adapter::invoke (this=0x643a6aed30e0) at /var/lib/jenkins/workspace/ACE_TAO_Ubuntu_22_04_Clang22_x64_Debug/ACE/ace/OS_Thread_Adapter.cpp:90
#13 0x00007936a735d67e in ace_thread_adapter (args=0x643a6aed30e0) at /var/lib/jenkins/workspace/ACE_TAO_Ubuntu_22_04_Clang22_x64_Debug/ACE/ace/Base_Thread_Adapter.cpp:116
#14 0x00007936a6e94a83 in start_thread (arg=<optimized out>) at ./nptl/pthread_create.c:442
#15 0x00007936a6f268e0 in clone3 () at ../sysdeps/unix/sysv/linux/x86_64/clone3.S:81
Thread 5 (Thread 0x7936a55fc640 (LWP 163952) "ContentFiltered"):
#0 0x00007936a6f1b78d in __GI___select (nfds=12, readfds=0x643a6ae27f08, writefds=0x0, exceptfds=0x0, timeout=0x0) at ../sysdeps/unix/sysv/linux/select.c:69
#1 0x00007936a8cf2c4d in ACE_OS::select (width=12, rfds=0x643a6ae27f08, wfds=0x0, efds=0x0, timeout=0x0) at /var/lib/jenkins/workspace/ACE_TAO_Ubuntu_22_04_Clang22_x64_Debug/ACE/ace/OS_NS_sys_select.inl:41
#2 0x00007936a8ced844 in ACE_Select_Reactor_T<ACE_Reactor_Token_T<ACE_Token> >::wait_for_multiple_events (this=0x643a6ae27ec0, dispatch_set=..., max_wait_time=0x0) at /var/lib/jenkins/workspace/ACE_TAO_Ubuntu_22_04_Clang22_x64_Debug/ACE/ace/Select_Reactor_T.cpp:1104
#3 0x00007936a8cf2f88 in ACE_Select_Reactor_T<ACE_Reactor_Token_T<ACE_Token> >::handle_events_i (this=0x643a6ae27ec0, max_wait_time=0x0) at /var/lib/jenkins/workspace/ACE_TAO_Ubuntu_22_04_Clang22_x64_Debug/ACE/ace/Select_Reactor_T.cpp:1453
#4 0x00007936a8ceafea in ACE_Select_Reactor_T<ACE_Reactor_Token_T<ACE_Token> >::handle_events (this=0x643a6ae27ec0, max_wait_time=0x0) at /var/lib/jenkins/workspace/ACE_TAO_Ubuntu_22_04_Clang22_x64_Debug/ACE/ace/Select_Reactor_T.cpp:1433
#5 0x00007936a73f080f in ACE_Reactor::run_reactor_event_loop (this=0x643a6ae26880, eh=0x0) at /var/lib/jenkins/workspace/ACE_TAO_Ubuntu_22_04_Clang22_x64_Debug/ACE/ace/Reactor.cpp:192
#6 0x00007936a8ce4722 in OpenDDS::DCPS::ReactorTask::svc (this=0x643a6ae273a0) at DCPS/ReactorTask.cpp:234
#7 0x00007936a7419671 in ACE_Task_Base::svc_run (args=0x643a6ae275a8) at /var/lib/jenkins/workspace/ACE_TAO_Ubuntu_22_04_Clang22_x64_Debug/ACE/ace/Task.cpp:269
#8 0x00007936a7419e0c in ACE_Thread_Adapter::invoke_i (this=0x643a6ae27010) at /var/lib/jenkins/workspace/ACE_TAO_Ubuntu_22_04_Clang22_x64_Debug/ACE/ace/Thread_Adapter.cpp:143
#9 0x00007936a7419d04 in ACE_Thread_Adapter::invoke (this=0x643a6ae27010) at /var/lib/jenkins/workspace/ACE_TAO_Ubuntu_22_04_Clang22_x64_Debug/ACE/ace/Thread_Adapter.cpp:94
#10 0x00007936a735d67e in ace_thread_adapter (args=0x643a6ae27010) at /var/lib/jenkins/workspace/ACE_TAO_Ubuntu_22_04_Clang22_x64_Debug/ACE/ace/Base_Thread_Adapter.cpp:116
#11 0x00007936a6e94a83 in start_thread (arg=<optimized out>) at ./nptl/pthread_create.c:442
#12 0x00007936a6f268e0 in clone3 () at ../sysdeps/unix/sysv/linux/x86_64/clone3.S:81
Thread 4 (Thread 0x7936a5dfd640 (LWP 163951) "ContentFiltered"):
#0 __futex_abstimed_wait_common64 (private=-1512060504, cancel=true, abstime=0x7936a5dfcad0, op=137, expected=0, futex_word=0x643a6ae24e44) at ./nptl/futex-internal.c:57
#1 __futex_abstimed_wait_common (cancel=true, private=-1512060504, abstime=0x7936a5dfcad0, clockid=-1512060408, expected=0, futex_word=0x643a6ae24e44) at ./nptl/futex-internal.c:87
#2 __GI___futex_abstimed_wait_cancelable64 (futex_word=futex_word@entry=0x643a6ae24e44, expected=expected@entry=0, clockid=clockid@entry=1, abstime=abstime@entry=0x7936a5dfcad0, private=private@entry=0) at ./nptl/futex-internal.c:139
#3 0x00007936a6e93e5b in __pthread_cond_wait_common (abstime=0x7936a5dfcad0, clockid=1, mutex=0x643a6ae24de8, cond=0x643a6ae24e18) at ./nptl/pthread_cond_wait.c:503
#4 ___pthread_cond_timedwait64 (cond=0x643a6ae24e18, mutex=0x643a6ae24de8, abstime=0x7936a5dfcad0) at ./nptl/pthread_cond_wait.c:652
#5 0x00007936a736ef8f in ACE_OS::cond_timedwait (cv=0x643a6ae24e18, external_mutex=0x643a6ae24de8, timeout=0x7936a5dfcc60) at ../ace/OS_NS_Thread.inl:401
#6 0x00007936a736f365 in ACE_Condition<ACE_Thread_Mutex>::wait (this=0x643a6ae24e18, mutex=..., abstime=0x7936a5dfcc60) at /var/lib/jenkins/workspace/ACE_TAO_Ubuntu_22_04_Clang22_x64_Debug/ACE/ace/Condition_Thread_Mutex.cpp:92
#7 0x00007936a736f391 in ACE_Condition<ACE_Thread_Mutex>::wait (this=0x643a6ae24e18, abstime=0x7936a5dfcc60) at /var/lib/jenkins/workspace/ACE_TAO_Ubuntu_22_04_Clang22_x64_Debug/ACE/ace/Condition_Thread_Mutex.cpp:101
#8 0x00007936a8c0db42 in OpenDDS::DCPS::ConditionVariable<ACE_Thread_Mutex>::wait_until (this=0x643a6ae24e18, expire_at=..., thread_status_manager=...) at DCPS/ConditionVariable.h:72
#9 0x00007936a8c1a51a in OpenDDS::DCPS::DispatchService::run_event_loop (this=0x643a6ae24dd0) at DCPS/DispatchService.cpp:199
#10 0x00007936a8c194cd in OpenDDS::DCPS::DispatchService::run (arg=0x643a6ae24dd0) at DCPS/DispatchService.cpp:161
#11 0x00007936a8d71188 in OpenDDS::DCPS::ThreadPool::run (arg=0x643a6ae24ed0) at DCPS/ThreadPool.cpp:64
#12 0x00007936a73c9815 in ACE_OS_Thread_Adapter::invoke (this=0x643a6ae22ea0) at /var/lib/jenkins/workspace/ACE_TAO_Ubuntu_22_04_Clang22_x64_Debug/ACE/ace/OS_Thread_Adapter.cpp:90
#13 0x00007936a735d67e in ace_thread_adapter (args=0x643a6ae22ea0) at /var/lib/jenkins/workspace/ACE_TAO_Ubuntu_22_04_Clang22_x64_Debug/ACE/ace/Base_Thread_Adapter.cpp:116
#14 0x00007936a6e94a83 in start_thread (arg=<optimized out>) at ./nptl/pthread_create.c:442
#15 0x00007936a6f268e0 in clone3 () at ../sysdeps/unix/sysv/linux/x86_64/clone3.S:81
Thread 3 (Thread 0x7936a65fe640 (LWP 163950) "ContentFiltered"):
#0 0x00007936a6f1b78d in __GI___select (nfds=6, readfds=0x643a6ada6108, writefds=0x0, exceptfds=0x0, timeout=0x0) at ../sysdeps/unix/sysv/linux/select.c:69
#1 0x00007936a8cf2c4d in ACE_OS::select (width=6, rfds=0x643a6ada6108, wfds=0x0, efds=0x0, timeout=0x0) at /var/lib/jenkins/workspace/ACE_TAO_Ubuntu_22_04_Clang22_x64_Debug/ACE/ace/OS_NS_sys_select.inl:41
#2 0x00007936a8ced844 in ACE_Select_Reactor_T<ACE_Reactor_Token_T<ACE_Token> >::wait_for_multiple_events (this=0x643a6ada60c0, dispatch_set=..., max_wait_time=0x0) at /var/lib/jenkins/workspace/ACE_TAO_Ubuntu_22_04_Clang22_x64_Debug/ACE/ace/Select_Reactor_T.cpp:1104
#3 0x00007936a8cf2f88 in ACE_Select_Reactor_T<ACE_Reactor_Token_T<ACE_Token> >::handle_events_i (this=0x643a6ada60c0, max_wait_time=0x0) at /var/lib/jenkins/workspace/ACE_TAO_Ubuntu_22_04_Clang22_x64_Debug/ACE/ace/Select_Reactor_T.cpp:1453
#4 0x00007936a8ceafea in ACE_Select_Reactor_T<ACE_Reactor_Token_T<ACE_Token> >::handle_events (this=0x643a6ada60c0, max_wait_time=0x0) at /var/lib/jenkins/workspace/ACE_TAO_Ubuntu_22_04_Clang22_x64_Debug/ACE/ace/Select_Reactor_T.cpp:1433
#5 0x00007936a73f080f in ACE_Reactor::run_reactor_event_loop (this=0x643a6ada1bc0, eh=0x0) at /var/lib/jenkins/workspace/ACE_TAO_Ubuntu_22_04_Clang22_x64_Debug/ACE/ace/Reactor.cpp:192
#6 0x00007936a8ce4722 in OpenDDS::DCPS::ReactorTask::svc (this=0x643a6ad9c510) at DCPS/ReactorTask.cpp:234
#7 0x00007936a7419671 in ACE_Task_Base::svc_run (args=0x643a6ad9c718) at /var/lib/jenkins/workspace/ACE_TAO_Ubuntu_22_04_Clang22_x64_Debug/ACE/ace/Task.cpp:269
#8 0x00007936a7419e0c in ACE_Thread_Adapter::invoke_i (this=0x643a6ada9510) at /var/lib/jenkins/workspace/ACE_TAO_Ubuntu_22_04_Clang22_x64_Debug/ACE/ace/Thread_Adapter.cpp:143
#9 0x00007936a7419d04 in ACE_Thread_Adapter::invoke (this=0x643a6ada9510) at /var/lib/jenkins/workspace/ACE_TAO_Ubuntu_22_04_Clang22_x64_Debug/ACE/ace/Thread_Adapter.cpp:94
#10 0x00007936a735d67e in ace_thread_adapter (args=0x643a6ada9510) at /var/lib/jenkins/workspace/ACE_TAO_Ubuntu_22_04_Clang22_x64_Debug/ACE/ace/Base_Thread_Adapter.cpp:116
#11 0x00007936a6e94a83 in start_thread (arg=<optimized out>) at ./nptl/pthread_create.c:442
#12 0x00007936a6f268e0 in clone3 () at ../sysdeps/unix/sysv/linux/x86_64/clone3.S:81
Thread 2 (Thread 0x7936a6dff640 (LWP 163949) "ContentFiltered"):
#0 __futex_abstimed_wait_common64 (private=0, cancel=true, abstime=0x0, op=393, expected=0, futex_word=0x643a6ada69c0) at ./nptl/futex-internal.c:57
#1 __futex_abstimed_wait_common (cancel=true, private=0, abstime=0x0, clockid=0, expected=0, futex_word=0x643a6ada69c0) at ./nptl/futex-internal.c:87
#2 __GI___futex_abstimed_wait_cancelable64 (futex_word=futex_word@entry=0x643a6ada69c0, expected=expected@entry=0, clockid=clockid@entry=0, abstime=abstime@entry=0x0, private=private@entry=0) at ./nptl/futex-internal.c:139
#3 0x00007936a6e93a01 in __pthread_cond_wait_common (abstime=0x0, clockid=0, mutex=0x643a6ada6968, cond=0x643a6ada6998) at ./nptl/pthread_cond_wait.c:503
#4 ___pthread_cond_wait (cond=0x643a6ada6998, mutex=0x643a6ada6968) at ./nptl/pthread_cond_wait.c:627
#5 0x00007936a736eedd in ACE_OS::cond_wait (cv=0x643a6ada6998, external_mutex=0x643a6ada6968) at ../ace/OS_NS_Thread.inl:370
#6 0x00007936a736f329 in ACE_Condition<ACE_Thread_Mutex>::wait (this=0x643a6ada6998) at /var/lib/jenkins/workspace/ACE_TAO_Ubuntu_22_04_Clang22_x64_Debug/ACE/ace/Condition_Thread_Mutex.cpp:84
#7 0x00007936a9ef924e in OpenDDS::DCPS::ConditionVariable<ACE_Thread_Mutex>::wait (this=0x643a6ada6998, thread_status_manager=...) at /var/lib/jenkins/workspace/OpenDDS_ACE8_Ubuntu_22_04_Clang22_x64_Debug/dds/DCPS/ConditionVariable.h:56
#8 0x00007936a8c1a55b in OpenDDS::DCPS::DispatchService::run_event_loop (this=0x643a6ada6950) at DCPS/DispatchService.cpp:201
#9 0x00007936a8c194cd in OpenDDS::DCPS::DispatchService::run (arg=0x643a6ada6950) at DCPS/DispatchService.cpp:161
#10 0x00007936a8d71188 in OpenDDS::DCPS::ThreadPool::run (arg=0x643a6ada6a50) at DCPS/ThreadPool.cpp:64
#11 0x00007936a73c9815 in ACE_OS_Thread_Adapter::invoke (this=0x643a6ada2cf0) at /var/lib/jenkins/workspace/ACE_TAO_Ubuntu_22_04_Clang22_x64_Debug/ACE/ace/OS_Thread_Adapter.cpp:90
#12 0x00007936a735d67e in ace_thread_adapter (args=0x643a6ada2cf0) at /var/lib/jenkins/workspace/ACE_TAO_Ubuntu_22_04_Clang22_x64_Debug/ACE/ace/Base_Thread_Adapter.cpp:116
#13 0x00007936a6e94a83 in start_thread (arg=<optimized out>) at ./nptl/pthread_create.c:442
#14 0x00007936a6f268e0 in clone3 () at ../sysdeps/unix/sysv/linux/x86_64/clone3.S:81
Thread 1 (Thread 0x7936aa09b740 (LWP 163948) "ContentFiltered"):
#0 __futex_abstimed_wait_common64 (private=0, cancel=true, abstime=0x0, op=393, expected=0, futex_word=0x643a6ae583f0) at ./nptl/futex-internal.c:57
#1 __futex_abstimed_wait_common (cancel=true, private=0, abstime=0x0, clockid=0, expected=0, futex_word=0x643a6ae583f0) at ./nptl/futex-internal.c:87
#2 __GI___futex_abstimed_wait_cancelable64 (futex_word=futex_word@entry=0x643a6ae583f0, expected=expected@entry=0, clockid=clockid@entry=0, abstime=abstime@entry=0x0, private=private@entry=0) at ./nptl/futex-internal.c:139
#3 0x00007936a6e93a01 in __pthread_cond_wait_common (abstime=0x0, clockid=0, mutex=0x643a6ae58398, cond=0x643a6ae583c8) at ./nptl/pthread_cond_wait.c:503
#4 ___pthread_cond_wait (cond=0x643a6ae583c8, mutex=0x643a6ae58398) at ./nptl/pthread_cond_wait.c:627
#5 0x00007936a736eedd in ACE_OS::cond_wait (cv=0x643a6ae583c8, external_mutex=0x643a6ae58398) at ../ace/OS_NS_Thread.inl:370
#6 0x00007936a736ecd3 in ACE_Condition<ACE_Recursive_Thread_Mutex>::wait (this=0x643a6ae583c8, mutex=..., abstime=0x0) at /var/lib/jenkins/workspace/ACE_TAO_Ubuntu_22_04_Clang22_x64_Debug/ACE/ace/Condition_Recursive_Thread_Mutex.cpp:88
#7 0x00007936a736ec61 in ACE_Condition<ACE_Recursive_Thread_Mutex>::wait (this=0x643a6ae583c8, abstime=0x0) at /var/lib/jenkins/workspace/ACE_TAO_Ubuntu_22_04_Clang22_x64_Debug/ACE/ace/Condition_Recursive_Thread_Mutex.cpp:64
#8 0x00007936a8d09df2 in OpenDDS::DCPS::ConditionVariable<ACE_Recursive_Thread_Mutex>::wait (this=0x643a6ae583c8, thread_status_manager=...) at DCPS/ConditionVariable.h:56
#9 0x00007936a8d8f78e in DDS::WaitSet::wait (this=0x643a6ae58390, active_conditions=..., timeout=...) at DCPS/WaitSet.cpp:148
#10 0x0000643a306736b5 in Utils::waitForSample (dr=...) at /var/lib/jenkins/workspace/OpenDDS_ACE8_Ubuntu_22_04_Clang22_x64_Debug/tests/Utils/WaitForSample.h:22
#11 0x0000643a3066d752 in run_filtering_test (ts=..., pub=..., sub=..., sub2=...) at /var/lib/jenkins/workspace/OpenDDS_ACE8_Ubuntu_22_04_Clang22_x64_Debug/tests/DCPS/ContentFilteredTopic/ContentFilteredTopicTest.cpp:272
#12 0x0000643a30671896 in run_test (argc=2, argv=0x7ffeadd0ec68) at /var/lib/jenkins/workspace/OpenDDS_ACE8_Ubuntu_22_04_Clang22_x64_Debug/tests/DCPS/ContentFilteredTopic/ContentFilteredTopicTest.cpp:678
#13 0x0000643a30671b99 in main (argc=6, argv=0x7ffeadd0ec68) at /var/lib/jenkins/workspace/OpenDDS_ACE8_Ubuntu_22_04_Clang22_x64_Debug/tests/DCPS/ContentFilteredTopic/ContentFilteredTopicTest.cpp:693
[Inferior 1 (process 163948) detached]
======= End stuck stacks =======
[Details] ERROR: test returned -1
[Details] auto_run_tests.pl: ERROR: "tests/DCPS/ContentFilteredTopic/run_test.pl rtps_disc nopub dynamic" returned with status 1
tests/DCPS/XTypes/run_test.pl --dynamic-writers
[Details] 2026-09-23 23:02:59: ERROR: reader_Match_no_xtypes_yn finished and returned 1
[Details] 2026-09-23 23:02:59: ERROR: writer_Match_no_xtypes_yn finished and returned 1
[Details] ERROR: read_i: wait failed: Timeout
[Details] ERROR: read_single AppendableStructNoXTypes failed
[Details] ERROR: wait on control_dw condition returned Timeout
[Details] ERROR: set_int32: resolve_string_path: Error
[Details] ERROR: read_i: wait failed: Timeout
[Details] ERROR: control read failed
[Details] test FAILED (process_error).
[Details] 2026-09-23 23:03:15: ERROR: reader_Tryconstruct finished and returned 1
[Details] 2026-09-23 23:03:15: ERROR: writer_Tryconstruct finished and returned 1
[Details] ERROR: read_i: wait failed: Timeout
[Details] ERROR: read_single Trim20Struct failed
[Details] ERROR: wait on control_dw condition returned Timeout
[Details] ERROR: set_string: resolve_string_path: Error
[Details] ERROR: read_i: wait failed: Timeout
[Details] ERROR: control read failed
[Details] test FAILED (process_error).
[Details] 2026-09-23 23:03:26: ERROR: reader_MutableUnion finished and returned 1
[Details] 2026-09-23 23:03:26: ERROR: writer_MutableUnion finished and returned 1
[Details] ERROR: read_i: wait failed: Timeout
[Details] ERROR: read_single MutableUnion failed
[Details] ERROR: check_int32 for MutableUnion.key_field: expected 103, received 0
[Details] ERROR: set_int32: resolve_string_path: Error
[Details] ERROR: read_i: wait failed: Timeout
[Details] ERROR: control read failed
[Details] test FAILED (process_error).
[Details] 2026-09-23 23:03:36: ERROR: reader_IgnoreMemberNames_MutableUnionMatch finished and returned 1
[Details] 2026-09-23 23:03:36: ERROR: writer_IgnoreMemberNames_MutableUnionMatch finished and returned 1
[Details] ERROR: read_i: wait failed: Timeout
[Details] ERROR: read_single MutableUnion failed
[Details] ERROR: check_int32 for MutableUnion.key_field: expected 104, received 0
[Details] ERROR: set_int32: resolve_string_path: Error
[Details] ERROR: read_i: wait failed: Timeout
[Details] ERROR: control read failed
[Details] test FAILED (process_error).
[Details] 2026-09-23 23:03:53: ERROR: reader_FinalStructMatch finished and returned 1
[Details] 2026-09-23 23:03:53: ERROR: writer_FinalStructMatch finished and returned 1
[Details] ERROR: read_i: wait failed: Timeout
[Details] ERROR: read_single FinalStructSub failed
[Details] ERROR: wait on control_dw condition returned Timeout
[Details] ERROR: set_int32: resolve_string_path: Error
[Details] ERROR: read_i: wait failed: Timeout
[Details] ERROR: control read failed
[Details] test FAILED (process_error).
[Details] 2026-09-23 23:04:10: ERROR: reader_ExtendedMutableStructMatch finished and returned 1
[Details] 2026-09-23 23:04:10: ERROR: writer_ExtendedMutableStructMatch finished and returned 1
[Details] ERROR: read_i: wait failed: Timeout
[Details] ERROR: read_single MutableStruct failed
[Details] ERROR: wait on control_dw condition returned Timeout
[Details] ERROR: set_int32: resolve_string_path: Error
[Details] ERROR: read_i: wait failed: Timeout
[Details] ERROR: control read failed
[Details] test FAILED (process_error).
[Details] 2026-09-23 23:04:26: ERROR: reader_Match_no_xtypes_ny finished and returned 1
[Details] 2026-09-23 23:04:26: ERROR: writer_Match_no_xtypes_ny finished and returned 1
[Details] ERROR: read_i: wait failed: Timeout
[Details] ERROR: read_single AppendableStructNoXTypes failed
[Details] ERROR: wait on control_dw condition returned Timeout
[Details] ERROR: set_int32: resolve_string_path: Error
[Details] ERROR: read_i: wait failed: Timeout
[Details] ERROR: control read failed
[Details] test FAILED (process_error).
[Details] 2026-09-23 23:04:41: ERROR: reader_Match_no_xtypes_nn finished and returned 1
[Details] 2026-09-23 23:04:41: ERROR: writer_Match_no_xtypes_nn finished and returned 1
[Details] ERROR: read_i: wait failed: Timeout
[Details] ERROR: read_single AppendableStructNoXTypes failed
[Details] ERROR: wait on control_dw condition returned Timeout
[Details] ERROR: set_int32: resolve_string_path: Error
[Details] ERROR: read_i: wait failed: Timeout
[Details] ERROR: control read failed
[Details] test FAILED (process_error).
[Details] 2026-09-23 23:04:58: ERROR: reader_IgnoreMemberNames_MutableStructMatch finished and returned 1
[Details] 2026-09-23 23:04:58: ERROR: writer_IgnoreMemberNames_MutableStructMatch finished and returned 1
[Details] ERROR: read_i: wait failed: Timeout
[Details] ERROR: read_single MutableStruct failed
[Details] ERROR: wait on control_dw condition returned Timeout
[Details] ERROR: set_int32: resolve_string_path: Error
[Details] ERROR: set_int32: resolve_string_path: Error
[Details] ERROR: read_i: wait failed: Timeout
[Details] ERROR: control read failed
[Details] test FAILED (process_error).
[Details] 2026-09-23 23:05:18: ERROR: reader_PlainCdr finished and returned 1
[Details] 2026-09-23 23:05:18: ERROR: writer_PlainCdr finished and returned 1
[Details] ERROR: read_i: wait failed: Timeout
[Details] ERROR: read_single PlainCdrStruct failed
[Details] ERROR: wait on control_dw condition returned Timeout
[Details] ERROR: set_int32: resolve_string_path: Error
[Details] ERROR: set_int32: resolve_string_path: Error
[Details] ERROR: read_i: wait failed: Timeout
[Details] ERROR: control read failed
[Details] test FAILED (process_error).
[Details] 2026-09-23 23:05:37: ERROR: reader_MutableStruct finished and returned 1
[Details] 2026-09-23 23:05:37: ERROR: writer_MutableStruct finished and returned 1
[Details] ERROR: read_i: wait failed: Timeout
[Details] ERROR: read_single MutableStruct failed
[Details] ERROR: wait on control_dw condition returned Timeout
[Details] ERROR: set_int32: resolve_string_path: Error
[Details] ERROR: set_int32: resolve_string_path: Error
[Details] ERROR: read_i: wait failed: Timeout
[Details] ERROR: control read failed
[Details] test FAILED (process_error).
[Details] 2026-09-23 23:05:52: ERROR: reader_ExtendedAppendableMatch finished and returned 1
[Details] 2026-09-23 23:05:52: ERROR: writer_ExtendedAppendableMatch finished and returned 1
[Details] ERROR: read_i: wait failed: Timeout
[Details] ERROR: read_single ExtendedAppendableStruct failed
[Details] ERROR: wait on control_dw condition returned Timeout
[Details] ERROR: set_int32: resolve_string_path: Error
[Details] ERROR: read_i: wait failed: Timeout
[Details] ERROR: control read failed
[Details] test FAILED (process_error).
[Details] 2026-09-23 23:06:08: ERROR: reader_DisallowTypeCoercion_FinalStructMatch finished and returned 1
[Details] 2026-09-23 23:06:08: ERROR: writer_DisallowTypeCoercion_FinalStructMatch finished and returned 1
[Details] ERROR: read_i: wait failed: Timeout
[Details] ERROR: read_single FinalStructSub failed
[Details] ERROR: wait on control_dw condition returned Timeout
[Details] ERROR: set_int32: resolve_string_path: Error
[Details] ERROR: read_i: wait failed: Timeout
[Details] ERROR: control read failed
[Details] test FAILED (process_error).
[Details] 2026-09-23 23:06:24: ERROR: reader_NoXTypesMatchTypeNames finished and returned 1
[Details] 2026-09-23 23:06:24: ERROR: writer_NoXTypesMatchTypeNames finished and returned 1
[Details] ERROR: read_i: wait failed: Timeout
[Details] ERROR: read_single AppendableStructNoXTypes failed
[Details] ERROR: wait on control_dw condition returned Timeout
[Details] ERROR: set_int32: resolve_string_path: Error
[Details] ERROR: read_i: wait failed: Timeout
[Details] ERROR: control read failed
[Details] test FAILED (process_error).
[Details] 2026-09-23 23:06:40: ERROR: reader_AppendableMatch finished and returned 1
[Details] 2026-09-23 23:06:40: ERROR: writer_AppendableMatch finished and returned 1
[Details] ERROR: read_i: wait failed: Timeout
[Details] ERROR: read_single AppendableStruct failed
[Details] ERROR: wait on control_dw condition returned Timeout
[Details] ERROR: set_int32: resolve_string_path: Error
[Details] ERROR: set_int32: resolve_string_path: Error
[Details] ERROR: read_i: wait failed: Timeout
[Details] ERROR: control read failed
[Details] test FAILED (process_error).
[Details] 2026-09-23 23:06:58: ERROR: reader_Dependency finished and returned 1
[Details] 2026-09-23 23:06:58: ERROR: writer_Dependency finished and returned 1
[Details] ERROR: read_i: wait failed: Timeout
[Details] ERROR: read_single AppendableStruct failed
[Details] ERROR: wait on control_dw condition returned Timeout
[Details] ERROR: set_int32: resolve_string_path: Error
[Details] ERROR: set_int32: resolve_string_path: Error
[Details] ERROR: read_i: wait failed: Timeout
[Details] ERROR: control read failed
[Details] test FAILED (process_error).
[Details] auto_run_tests.pl: ERROR: "tests/DCPS/XTypes/run_test.pl --dynamic-writers" returned with status 1
tests/DCPS/XTypes/run_test.pl --dynamic-readers
[Details] 2026-09-23 23:07:01: ERROR: reader_PlainCdr finished and returned 1
[Details] 2026-09-23 23:07:11: ERROR: writer_PlainCdr finished and returned 1
[Details] ERROR: check_int32: resolve_string_path: Error
[Details] ERROR: check_int32 for PlainCdrStruct.key_field failed
[Details] ERROR: read_i: wait failed: Timeout
[Details] ERROR: control read failed
[Details] test FAILED (process_error).
[Details] 2026-09-23 23:07:12: ERROR: reader_IgnoreMemberNames_MutableStructMatch finished and returned 1
[Details] 2026-09-23 23:07:21: ERROR: writer_IgnoreMemberNames_MutableStructMatch finished and returned 1
[Details] ERROR: check_int32: resolve_string_path: Error
[Details] ERROR: check_int32 for MutableStruct.key_field failed
[Details] ERROR: check_int32: resolve_string_path: Error
[Details] ERROR: check_int32 for MutableStruct.additional_field failed
[Details] ERROR: read_i: wait failed: Timeout
[Details] ERROR: control read failed
[Details] test FAILED (process_error).
[Details] 2026-09-23 23:07:22: ERROR: reader_DisallowTypeCoercion_FinalStructMatch finished and returned 1
[Details] 2026-09-23 23:07:32: ERROR: writer_DisallowTypeCoercion_FinalStructMatch finished and returned 1
[Details] ERROR: check_int32: resolve_string_path: Error
[Details] ERROR: check_int32 for FinalStructSub.key_field failed
[Details] ERROR: read_i: wait failed: Timeout
[Details] ERROR: control read failed
[Details] test FAILED (process_error).
[Details] 2026-09-23 23:07:33: ERROR: reader_MutableUnion finished and returned 1
[Details] 2026-09-23 23:07:42: ERROR: writer_MutableUnion finished and returned 1
[Details] ERROR: check_int32: resolve_string_path: Error
[Details] ERROR: check_int32 for MutableUnion.discriminator failed
[Details] ERROR: read_i: wait failed: Timeout
[Details] ERROR: control read failed
[Details] test FAILED (process_error).
[Details] 2026-09-23 23:07:46: ERROR: reader_FinalStructMatch finished and returned 1
[Details] 2026-09-23 23:07:56: ERROR: writer_FinalStructMatch finished and returned 1
[Details] ERROR: check_int32: resolve_string_path: Error
[Details] ERROR: check_int32 for FinalStructSub.key_field failed
[Details] ERROR: read_i: wait failed: Timeout
[Details] ERROR: control read failed
[Details] test FAILED (process_error).
[Details] 2026-09-23 23:07:57: ERROR: reader_AppendableMatch finished and returned 1
[Details] 2026-09-23 23:08:06: ERROR: writer_AppendableMatch finished and returned 1
[Details] ERROR: check_int32: resolve_string_path: Error
[Details] ERROR: check_int32 for AppendableStruct.key_field failed
[Details] ERROR: read_i: wait failed: Timeout
[Details] ERROR: control read failed
[Details] test FAILED (process_error).
[Details] 2026-09-23 23:08:11: ERROR: reader_Match_no_xtypes_yn finished and returned 1
[Details] 2026-09-23 23:08:20: ERROR: writer_Match_no_xtypes_yn finished and returned 1
[Details] ERROR: check_int32: resolve_string_path: Error
[Details] ERROR: check_int32 for AppendableStructNoXTypes.key_field failed
[Details] ERROR: read_i: wait failed: Timeout
[Details] ERROR: control read failed
[Details] test FAILED (process_error).
[Details] 2026-09-23 23:08:23: ERROR: reader_MutableStruct finished and returned 1
[Details] 2026-09-23 23:08:33: ERROR: writer_MutableStruct finished and returned 1
[Details] ERROR: check_int32: resolve_string_path: Error
[Details] ERROR: check_int32 for MutableStruct.key_field failed
[Details] ERROR: check_int32: resolve_string_path: Error
[Details] ERROR: check_int32 for MutableStruct.additional_field failed
[Details] ERROR: read_i: wait failed: Timeout
[Details] ERROR: control read failed
[Details] test FAILED (process_error).
[Details] 2026-09-23 23:08:36: ERROR: reader_NoXTypesMatchTypeNames finished and returned 1
[Details] 2026-09-23 23:08:45: ERROR: writer_NoXTypesMatchTypeNames finished and returned 1
[Details] ERROR: check_int32: resolve_string_path: Error
[Details] ERROR: check_int32 for AppendableStructNoXTypes.key_field failed
[Details] ERROR: read_i: wait failed: Timeout
[Details] ERROR: control read failed
[Details] test FAILED (process_error).
[Details] 2026-09-23 23:08:48: ERROR: reader_Dependency finished and returned 1
[Details] 2026-09-23 23:08:58: ERROR: writer_Dependency finished and returned 1
[Details] ERROR: check_int32: resolve_string_path: Error
[Details] ERROR: check_int32 for AppendableStruct.key_field failed
[Details] ERROR: read_i: wait failed: Timeout
[Details] ERROR: control read failed
[Details] test FAILED (process_error).
[Details] 2026-09-23 23:09:00: ERROR: reader_Match_no_xtypes_ny finished and returned 1
[Details] 2026-09-23 23:09:10: ERROR: writer_Match_no_xtypes_ny finished and returned 1
[Details] ERROR: check_int32: resolve_string_path: Error
[Details] ERROR: check_int32 for AppendableStructNoXTypes.key_field failed
[Details] ERROR: read_i: wait failed: Timeout
[Details] ERROR: control read failed
[Details] test FAILED (process_error).
[Details] 2026-09-23 23:09:11: ERROR: reader_IgnoreMemberNames_MutableUnionMatch finished and returned 1
[Details] 2026-09-23 23:09:21: ERROR: writer_IgnoreMemberNames_MutableUnionMatch finished and returned 1
[Details] ERROR: check_int32: resolve_string_path: Error
[Details] ERROR: check_int32 for MutableUnion.discriminator failed
[Details] ERROR: read_i: wait failed: Timeout
[Details] ERROR: control read failed
[Details] test FAILED (process_error).
[Details] 2026-09-23 23:09:26: ERROR: reader_Match_no_xtypes_nn finished and returned 1
[Details] 2026-09-23 23:09:36: ERROR: writer_Match_no_xtypes_nn finished and returned 1
[Details] ERROR: check_int32: resolve_string_path: Error
[Details] ERROR: check_int32 for AppendableStructNoXTypes.key_field failed
[Details] ERROR: read_i: wait failed: Timeout
[Details] ERROR: control read failed
[Details] test FAILED (process_error).
[Details] auto_run_tests.pl: ERROR: "tests/DCPS/XTypes/run_test.pl --dynamic-readers" returned with status 1
tests/DCPS/XTypes/run_test.pl --dynamic-writers --dynamic-readers
[Details] 2026-09-23 23:09:53: ERROR: reader_PlainCdr finished and returned 1
[Details] 2026-09-23 23:09:53: ERROR: writer_PlainCdr finished and returned 1
[Details] ERROR: read_i: wait failed: Timeout
[Details] ERROR: read_single PlainCdrStruct failed
[Details] ERROR: wait on control_dw condition returned Timeout
[Details] ERROR: set_int32: resolve_string_path: Error
[Details] ERROR: set_int32: resolve_string_path: Error
[Details] ERROR: read_i: wait failed: Timeout
[Details] ERROR: control read failed
[Details] test FAILED (process_error).
[Details] 2026-09-23 23:10:04: ERROR: reader_IgnoreMemberNames_MutableUnionMatch finished and returned 1
[Details] 2026-09-23 23:10:04: ERROR: writer_IgnoreMemberNames_MutableUnionMatch finished and returned 1
[Details] ERROR: read_i: wait failed: Timeout
[Details] ERROR: read_single MutableUnion failed
[Details] ERROR: check_int32 for MutableUnion.key_field failed
[Details] ERROR: set_int32: resolve_string_path: Error
[Details] ERROR: read_i: wait failed: Timeout
[Details] ERROR: control read failed
[Details] test FAILED (process_error).
[Details] ERROR: set_int32: resolve_string_path: Error
[Details] test FAILED (success).
[Details] 2026-09-23 23:10:21: ERROR: reader_IgnoreMemberNames_MutableStructMatch finished and returned 1
[Details] 2026-09-23 23:10:21: ERROR: writer_IgnoreMemberNames_MutableStructMatch finished and returned 1
[Details] ERROR: read_i: wait failed: Timeout
[Details] ERROR: read_single MutableStruct failed
[Details] ERROR: wait on control_dw condition returned Timeout
[Details] ERROR: set_int32: resolve_string_path: Error
[Details] ERROR: set_int32: resolve_string_path: Error
[Details] ERROR: read_i: wait failed: Timeout
[Details] ERROR: control read failed
[Details] test FAILED (process_error).
[Details] 2026-09-23 23:10:38: ERROR: reader_AppendableMatch finished and returned 1
[Details] 2026-09-23 23:10:38: ERROR: writer_AppendableMatch finished and returned 1
[Details] ERROR: read_i: wait failed: Timeout
[Details] ERROR: read_single AppendableStruct failed
[Details] ERROR: wait on control_dw condition returned Timeout
[Details] ERROR: set_int32: resolve_string_path: Error
[Details] ERROR: set_int32: resolve_string_path: Error
[Details] ERROR: read_i: wait failed: Timeout
[Details] ERROR: control read failed
[Details] test FAILED (process_error).
[Details] ERROR: set_int32: resolve_string_path: Error
[Details] test FAILED (success).
[Details] 2026-09-23 23:10:59: ERROR: reader_FinalStructMatch finished and returned 1
[Details] 2026-09-23 23:10:59: ERROR: writer_FinalStructMatch finished and returned 1
[Details] ERROR: read_i: wait failed: Timeout
[Details] ERROR: read_single FinalStructSub failed
[Details] ERROR: wait on control_dw condition returned Timeout
[Details] ERROR: set_int32: resolve_string_path: Error
[Details] ERROR: read_i: wait failed: Timeout
[Details] ERROR: control read failed
[Details] test FAILED (process_error).
[Details] 2026-09-23 23:11:16: ERROR: reader_DisallowTypeCoercion_FinalStructMatch finished and returned 1
[Details] 2026-09-23 23:11:16: ERROR: writer_DisallowTypeCoercion_FinalStructMatch finished and returned 1
[Details] ERROR: read_i: wait failed: Timeout
[Details] ERROR: read_single FinalStructSub failed
[Details] ERROR: wait on control_dw condition returned Timeout
[Details] ERROR: set_int32: resolve_string_path: Error
[Details] ERROR: read_i: wait failed: Timeout
[Details] ERROR: control read failed
[Details] test FAILED (process_error).
[Details] 2026-09-23 23:11:32: ERROR: reader_Match_no_xtypes_yn finished and returned 1
[Details] 2026-09-23 23:11:32: ERROR: writer_Match_no_xtypes_yn finished and returned 1
[Details] ERROR: read_i: wait failed: Timeout
[Details] ERROR: read_single AppendableStructNoXTypes failed
[Details] ERROR: wait on control_dw condition returned Timeout
[Details] ERROR: set_int32: resolve_string_path: Error
[Details] ERROR: read_i: wait failed: Timeout
[Details] ERROR: control read failed
[Details] test FAILED (process_error).
[Details] ERROR: set_string: resolve_string_path: Error
[Details] test FAILED (success).
[Details] 2026-09-23 23:11:51: ERROR: reader_Dependency finished and returned 1
[Details] 2026-09-23 23:11:51: ERROR: writer_Dependency finished and returned 1
[Details] ERROR: read_i: wait failed: Timeout
[Details] ERROR: read_single AppendableStruct failed
[Details] ERROR: wait on control_dw condition returned Timeout
[Details] ERROR: set_int32: resolve_string_path: Error
[Details] ERROR: set_int32: resolve_string_path: Error
[Details] ERROR: read_i: wait failed: Timeout
[Details] ERROR: control read failed
[Details] test FAILED (process_error).
[Details] 2026-09-23 23:12:06: ERROR: reader_MutableStruct finished and returned 1
[Details] 2026-09-23 23:12:06: ERROR: writer_MutableStruct finished and returned 1
[Details] ERROR: read_i: wait failed: Timeout
[Details] ERROR: read_single MutableStruct failed
[Details] ERROR: wait on control_dw condition returned Timeout
[Details] ERROR: set_int32: resolve_string_path: Error
[Details] ERROR: set_int32: resolve_string_path: Error
[Details] ERROR: read_i: wait failed: Timeout
[Details] ERROR: control read failed
[Details] test FAILED (process_error).
[Details] 2026-09-23 23:12:17: ERROR: reader_MutableUnion finished and returned 1
[Details] 2026-09-23 23:12:17: ERROR: writer_MutableUnion finished and returned 1
[Details] ERROR: read_i: wait failed: Timeout
[Details] ERROR: read_single MutableUnion failed
[Details] ERROR: check_int32 for MutableUnion.key_field failed
[Details] ERROR: set_int32: resolve_string_path: Error
[Details] ERROR: read_i: wait failed: Timeout
[Details] ERROR: control read failed
[Details] test FAILED (process_error).
[Details] 2026-09-23 23:12:33: ERROR: reader_NoXTypesMatchTypeNames finished and returned 1
[Details] 2026-09-23 23:12:33: ERROR: writer_NoXTypesMatchTypeNames finished and returned 1
[Details] ERROR: read_i: wait failed: Timeout
[Details] ERROR: read_single AppendableStructNoXTypes failed
[Details] ERROR: wait on control_dw condition returned Timeout
[Details] ERROR: set_int32: resolve_string_path: Error
[Details] ERROR: read_i: wait failed: Timeout
[Details] ERROR: control read failed
[Details] test FAILED (process_error).
[Details] 2026-09-23 23:12:51: ERROR: reader_Match_no_xtypes_nn finished and returned 1
[Details] 2026-09-23 23:12:51: ERROR: writer_Match_no_xtypes_nn finished and returned 1
[Details] ERROR: read_i: wait failed: Timeout
[Details] ERROR: read_single AppendableStructNoXTypes failed
[Details] ERROR: wait on control_dw condition returned Timeout
[Details] ERROR: set_int32: resolve_string_path: Error
[Details] ERROR: read_i: wait failed: Timeout
[Details] ERROR: control read failed
[Details] test FAILED (process_error).
[Details] 2026-09-23 23:13:08: ERROR: reader_Match_no_xtypes_ny finished and returned 1
[Details] 2026-09-23 23:13:08: ERROR: writer_Match_no_xtypes_ny finished and returned 1
[Details] ERROR: read_i: wait failed: Timeout
[Details] ERROR: read_single AppendableStructNoXTypes failed
[Details] ERROR: wait on control_dw condition returned Timeout
[Details] ERROR: set_int32: resolve_string_path: Error
[Details] ERROR: read_i: wait failed: Timeout
[Details] ERROR: control read failed
[Details] test FAILED (process_error).
[Details] auto_run_tests.pl: ERROR: "tests/DCPS/XTypes/run_test.pl --dynamic-writers --dynamic-readers" returned with status 1
tests/DCPS/ZeroEnum/run_test.pl
[Details] ERROR: <subscriber> exited with coredump from signal 6 : ABRT
[Details] 2026-09-23 23:23:18: ERROR: subscriber terminated with a signal
[Details] ERROR: publisher timedout
======= Begin stuck stacks =======
[New LWP 177073]
[New LWP 177076]
[New LWP 177078]
[New LWP 177080]
[New LWP 177082]
[New LWP 177084]
[Thread debugging using libthread_db enabled]
Using host libthread_db library "/lib/x86_64-linux-gnu/libthread_db.so.1".
0x00007a8287ee57b8 in __GI___clock_nanosleep (clock_id=clock_id@entry=0, flags=flags@entry=0, req=0x7ffe27a70db8, rem=0x0) at ../sysdeps/unix/sysv/linux/clock_nanosleep.c:78
78 ../sysdeps/unix/sysv/linux/clock_nanosleep.c: No such file or directory.
Thread 7 (Thread 0x7a82855fa640 (LWP 177084) "publisher"):
#0 0x00007a8287f1b78d in __GI___select (nfds=14, readfds=0x61addbde92c8, writefds=0x0, exceptfds=0x0, timeout=0x0) at ../sysdeps/unix/sysv/linux/select.c:69
#1 0x00007a8289cf2c4d in ACE_OS::select (width=14, rfds=0x61addbde92c8, wfds=0x0, efds=0x0, timeout=0x0) at /var/lib/jenkins/workspace/ACE_TAO_Ubuntu_22_04_Clang22_x64_Debug/ACE/ace/OS_NS_sys_select.inl:41
#2 0x00007a8289ced844 in ACE_Select_Reactor_T<ACE_Reactor_Token_T<ACE_Token> >::wait_for_multiple_events (this=0x61addbde9280, dispatch_set=..., max_wait_time=0x0) at /var/lib/jenkins/workspace/ACE_TAO_Ubuntu_22_04_Clang22_x64_Debug/ACE/ace/Select_Reactor_T.cpp:1104
#3 0x00007a8289cf2f88 in ACE_Select_Reactor_T<ACE_Reactor_Token_T<ACE_Token> >::handle_events_i (this=0x61addbde9280, max_wait_time=0x0) at /var/lib/jenkins/workspace/ACE_TAO_Ubuntu_22_04_Clang22_x64_Debug/ACE/ace/Select_Reactor_T.cpp:1453
#4 0x00007a8289ceafea in ACE_Select_Reactor_T<ACE_Reactor_Token_T<ACE_Token> >::handle_events (this=0x61addbde9280, max_wait_time=0x0) at /var/lib/jenkins/workspace/ACE_TAO_Ubuntu_22_04_Clang22_x64_Debug/ACE/ace/Select_Reactor_T.cpp:1433
#5 0x00007a82883f080f in ACE_Reactor::run_reactor_event_loop (this=0x61addbdd87c0, eh=0x0) at /var/lib/jenkins/workspace/ACE_TAO_Ubuntu_22_04_Clang22_x64_Debug/ACE/ace/Reactor.cpp:192
#6 0x00007a8289ce4722 in OpenDDS::DCPS::ReactorTask::svc (this=0x61addbde7e50) at DCPS/ReactorTask.cpp:234
#7 0x00007a8288419671 in ACE_Task_Base::svc_run (args=0x61addbde8058) at /var/lib/jenkins/workspace/ACE_TAO_Ubuntu_22_04_Clang22_x64_Debug/ACE/ace/Task.cpp:269
#8 0x00007a8288419e0c in ACE_Thread_Adapter::invoke_i (this=0x61addbde78a0) at /var/lib/jenkins/workspace/ACE_TAO_Ubuntu_22_04_Clang22_x64_Debug/ACE/ace/Thread_Adapter.cpp:143
#9 0x00007a8288419d04 in ACE_Thread_Adapter::invoke (this=0x61addbde78a0) at /var/lib/jenkins/workspace/ACE_TAO_Ubuntu_22_04_Clang22_x64_Debug/ACE/ace/Thread_Adapter.cpp:94
#10 0x00007a828835d67e in ace_thread_adapter (args=0x61addbde78a0) at /var/lib/jenkins/workspace/ACE_TAO_Ubuntu_22_04_Clang22_x64_Debug/ACE/ace/Base_Thread_Adapter.cpp:116
#11 0x00007a8287e94a83 in start_thread (arg=<optimized out>) at ./nptl/pthread_create.c:442
#12 0x00007a8287f268e0 in clone3 () at ../sysdeps/unix/sysv/linux/x86_64/clone3.S:81
Thread 6 (Thread 0x7a8285dfb640 (LWP 177082) "publisher"):
#0 __futex_abstimed_wait_common64 (private=-2048939608, cancel=true, abstime=0x7a8285dfaad0, op=137, expected=0, futex_word=0x61addbde6df4) at ./nptl/futex-internal.c:57
#1 __futex_abstimed_wait_common (cancel=true, private=-2048939608, abstime=0x7a8285dfaad0, clockid=-2048939512, expected=0, futex_word=0x61addbde6df4) at ./nptl/futex-internal.c:87
#2 __GI___futex_abstimed_wait_cancelable64 (futex_word=futex_word@entry=0x61addbde6df4, expected=expected@entry=0, clockid=clockid@entry=1, abstime=abstime@entry=0x7a8285dfaad0, private=private@entry=0) at ./nptl/futex-internal.c:139
#3 0x00007a8287e93e5b in __pthread_cond_wait_common (abstime=0x7a8285dfaad0, clockid=1, mutex=0x61addbde6d98, cond=0x61addbde6dc8) at ./nptl/pthread_cond_wait.c:503
#4 ___pthread_cond_timedwait64 (cond=0x61addbde6dc8, mutex=0x61addbde6d98, abstime=0x7a8285dfaad0) at ./nptl/pthread_cond_wait.c:652
#5 0x00007a828836ef8f in ACE_OS::cond_timedwait (cv=0x61addbde6dc8, external_mutex=0x61addbde6d98, timeout=0x7a8285dfac60) at ../ace/OS_NS_Thread.inl:401
#6 0x00007a828836f365 in ACE_Condition<ACE_Thread_Mutex>::wait (this=0x61addbde6dc8, mutex=..., abstime=0x7a8285dfac60) at /var/lib/jenkins/workspace/ACE_TAO_Ubuntu_22_04_Clang22_x64_Debug/ACE/ace/Condition_Thread_Mutex.cpp:92
#7 0x00007a828836f391 in ACE_Condition<ACE_Thread_Mutex>::wait (this=0x61addbde6dc8, abstime=0x7a8285dfac60) at /var/lib/jenkins/workspace/ACE_TAO_Ubuntu_22_04_Clang22_x64_Debug/ACE/ace/Condition_Thread_Mutex.cpp:101
#8 0x00007a8289c0db42 in OpenDDS::DCPS::ConditionVariable<ACE_Thread_Mutex>::wait_until (this=0x61addbde6dc8, expire_at=..., thread_status_manager=...) at DCPS/ConditionVariable.h:72
#9 0x00007a8289c1a51a in OpenDDS::DCPS::DispatchService::run_event_loop (this=0x61addbde6d80) at DCPS/DispatchService.cpp:199
#10 0x00007a8289c194cd in OpenDDS::DCPS::DispatchService::run (arg=0x61addbde6d80) at DCPS/DispatchService.cpp:161
#11 0x00007a8289d71188 in OpenDDS::DCPS::ThreadPool::run (arg=0x61addbde6e80) at DCPS/ThreadPool.cpp:64
#12 0x00007a82883c9815 in ACE_OS_Thread_Adapter::invoke (this=0x61addbdd5c00) at /var/lib/jenkins/workspace/ACE_TAO_Ubuntu_22_04_Clang22_x64_Debug/ACE/ace/OS_Thread_Adapter.cpp:90
#13 0x00007a828835d67e in ace_thread_adapter (args=0x61addbdd5c00) at /var/lib/jenkins/workspace/ACE_TAO_Ubuntu_22_04_Clang22_x64_Debug/ACE/ace/Base_Thread_Adapter.cpp:116
#14 0x00007a8287e94a83 in start_thread (arg=<optimized out>) at ./nptl/pthread_create.c:442
#15 0x00007a8287f268e0 in clone3 () at ../sysdeps/unix/sysv/linux/x86_64/clone3.S:81
Thread 5 (Thread 0x7a82865fc640 (LWP 177080) "publisher"):
#0 0x00007a8287f1b78d in __GI___select (nfds=12, readfds=0x61addbda7a88, writefds=0x0, exceptfds=0x0, timeout=0x0) at ../sysdeps/unix/sysv/linux/select.c:69
#1 0x00007a8289cf2c4d in ACE_OS::select (width=12, rfds=0x61addbda7a88, wfds=0x0, efds=0x0, timeout=0x0) at /var/lib/jenkins/workspace/ACE_TAO_Ubuntu_22_04_Clang22_x64_Debug/ACE/ace/OS_NS_sys_select.inl:41
#2 0x00007a8289ced844 in ACE_Select_Reactor_T<ACE_Reactor_Token_T<ACE_Token> >::wait_for_multiple_events (this=0x61addbda7a40, dispatch_set=..., max_wait_time=0x0) at /var/lib/jenkins/workspace/ACE_TAO_Ubuntu_22_04_Clang22_x64_Debug/ACE/ace/Select_Reactor_T.cpp:1104
#3 0x00007a8289cf2f88 in ACE_Select_Reactor_T<ACE_Reactor_Token_T<ACE_Token> >::handle_events_i (this=0x61addbda7a40, max_wait_time=0x0) at /var/lib/jenkins/workspace/ACE_TAO_Ubuntu_22_04_Clang22_x64_Debug/ACE/ace/Select_Reactor_T.cpp:1453
#4 0x00007a8289ceafea in ACE_Select_Reactor_T<ACE_Reactor_Token_T<ACE_Token> >::handle_events (this=0x61addbda7a40, max_wait_time=0x0) at /var/lib/jenkins/workspace/ACE_TAO_Ubuntu_22_04_Clang22_x64_Debug/ACE/ace/Select_Reactor_T.cpp:1433
#5 0x00007a82883f080f in ACE_Reactor::run_reactor_event_loop (this=0x61addbda6770, eh=0x0) at /var/lib/jenkins/workspace/ACE_TAO_Ubuntu_22_04_Clang22_x64_Debug/ACE/ace/Reactor.cpp:192
#6 0x00007a8289ce4722 in OpenDDS::DCPS::ReactorTask::svc (this=0x61addbda6f70) at DCPS/ReactorTask.cpp:234
#7 0x00007a8288419671 in ACE_Task_Base::svc_run (args=0x61addbda7178) at /var/lib/jenkins/workspace/ACE_TAO_Ubuntu_22_04_Clang22_x64_Debug/ACE/ace/Task.cpp:269
#8 0x00007a8288419e0c in ACE_Thread_Adapter::invoke_i (this=0x61addbda6970) at /var/lib/jenkins/workspace/ACE_TAO_Ubuntu_22_04_Clang22_x64_Debug/ACE/ace/Thread_Adapter.cpp:143
#9 0x00007a8288419d04 in ACE_Thread_Adapter::invoke (this=0x61addbda6970) at /var/lib/jenkins/workspace/ACE_TAO_Ubuntu_22_04_Clang22_x64_Debug/ACE/ace/Thread_Adapter.cpp:94
#10 0x00007a828835d67e in ace_thread_adapter (args=0x61addbda6970) at /var/lib/jenkins/workspace/ACE_TAO_Ubuntu_22_04_Clang22_x64_Debug/ACE/ace/Base_Thread_Adapter.cpp:116
#11 0x00007a8287e94a83 in start_thread (arg=<optimized out>) at ./nptl/pthread_create.c:442
#12 0x00007a8287f268e0 in clone3 () at ../sysdeps/unix/sysv/linux/x86_64/clone3.S:81
Thread 4 (Thread 0x7a8286dfd640 (LWP 177078) "publisher"):
#0 __futex_abstimed_wait_common64 (private=-2032154200, cancel=true, abstime=0x7a8286dfcad0, op=137, expected=0, futex_word=0x61addbda4d30) at ./nptl/futex-internal.c:57
#1 __futex_abstimed_wait_common (cancel=true, private=-2032154200, abstime=0x7a8286dfcad0, clockid=-2032154104, expected=0, futex_word=0x61addbda4d30) at ./nptl/futex-internal.c:87
#2 __GI___futex_abstimed_wait_cancelable64 (futex_word=futex_word@entry=0x61addbda4d30, expected=expected@entry=0, clockid=clockid@entry=1, abstime=abstime@entry=0x7a8286dfcad0, private=private@entry=0) at ./nptl/futex-internal.c:139
#3 0x00007a8287e93e5b in __pthread_cond_wait_common (abstime=0x7a8286dfcad0, clockid=1, mutex=0x61addbda4cd8, cond=0x61addbda4d08) at ./nptl/pthread_cond_wait.c:503
#4 ___pthread_cond_timedwait64 (cond=0x61addbda4d08, mutex=0x61addbda4cd8, abstime=0x7a8286dfcad0) at ./nptl/pthread_cond_wait.c:652
#5 0x00007a828836ef8f in ACE_OS::cond_timedwait (cv=0x61addbda4d08, external_mutex=0x61addbda4cd8, timeout=0x7a8286dfcc60) at ../ace/OS_NS_Thread.inl:401
#6 0x00007a828836f365 in ACE_Condition<ACE_Thread_Mutex>::wait (this=0x61addbda4d08, mutex=..., abstime=0x7a8286dfcc60) at /var/lib/jenkins/workspace/ACE_TAO_Ubuntu_22_04_Clang22_x64_Debug/ACE/ace/Condition_Thread_Mutex.cpp:92
#7 0x00007a828836f391 in ACE_Condition<ACE_Thread_Mutex>::wait (this=0x61addbda4d08, abstime=0x7a8286dfcc60) at /var/lib/jenkins/workspace/ACE_TAO_Ubuntu_22_04_Clang22_x64_Debug/ACE/ace/Condition_Thread_Mutex.cpp:101
#8 0x00007a8289c0db42 in OpenDDS::DCPS::ConditionVariable<ACE_Thread_Mutex>::wait_until (this=0x61addbda4d08, expire_at=..., thread_status_manager=...) at DCPS/ConditionVariable.h:72
#9 0x00007a8289c1a51a in OpenDDS::DCPS::DispatchService::run_event_loop (this=0x61addbda4cc0) at DCPS/DispatchService.cpp:199
#10 0x00007a8289c194cd in OpenDDS::DCPS::DispatchService::run (arg=0x61addbda4cc0) at DCPS/DispatchService.cpp:161
#11 0x00007a8289d71188 in OpenDDS::DCPS::ThreadPool::run (arg=0x61addbda4dc0) at DCPS/ThreadPool.cpp:64
#12 0x00007a82883c9815 in ACE_OS_Thread_Adapter::invoke (this=0x61addbda2da0) at /var/lib/jenkins/workspace/ACE_TAO_Ubuntu_22_04_Clang22_x64_Debug/ACE/ace/OS_Thread_Adapter.cpp:90
#13 0x00007a828835d67e in ace_thread_adapter (args=0x61addbda2da0) at /var/lib/jenkins/workspace/ACE_TAO_Ubuntu_22_04_Clang22_x64_Debug/ACE/ace/Base_Thread_Adapter.cpp:116
#14 0x00007a8287e94a83 in start_thread (arg=<optimized out>) at ./nptl/pthread_create.c:442
#15 0x00007a8287f268e0 in clone3 () at ../sysdeps/unix/sysv/linux/x86_64/clone3.S:81
Thread 3 (Thread 0x7a82875fe640 (LWP 177076) "publisher"):
#0 0x00007a8287f1b78d in __GI___select (nfds=7, readfds=0x61addbd2fcc8, writefds=0x0, exceptfds=0x0, timeout=0x0) at ../sysdeps/unix/sysv/linux/select.c:69
#1 0x00007a8289cf2c4d in ACE_OS::select (width=7, rfds=0x61addbd2fcc8, wfds=0x0, efds=0x0, timeout=0x0) at /var/lib/jenkins/workspace/ACE_TAO_Ubuntu_22_04_Clang22_x64_Debug/ACE/ace/OS_NS_sys_select.inl:41
#2 0x00007a8289ced844 in ACE_Select_Reactor_T<ACE_Reactor_Token_T<ACE_Token> >::wait_for_multiple_events (this=0x61addbd2fc80, dispatch_set=..., max_wait_time=0x0) at /var/lib/jenkins/workspace/ACE_TAO_Ubuntu_22_04_Clang22_x64_Debug/ACE/ace/Select_Reactor_T.cpp:1104
#3 0x00007a8289cf2f88 in ACE_Select_Reactor_T<ACE_Reactor_Token_T<ACE_Token> >::handle_events_i (this=0x61addbd2fc80, max_wait_time=0x0) at /var/lib/jenkins/workspace/ACE_TAO_Ubuntu_22_04_Clang22_x64_Debug/ACE/ace/Select_Reactor_T.cpp:1453
#4 0x00007a8289ceafea in ACE_Select_Reactor_T<ACE_Reactor_Token_T<ACE_Token> >::handle_events (this=0x61addbd2fc80, max_wait_time=0x0) at /var/lib/jenkins/workspace/ACE_TAO_Ubuntu_22_04_Clang22_x64_Debug/ACE/ace/Select_Reactor_T.cpp:1433
#5 0x00007a82883f080f in ACE_Reactor::run_reactor_event_loop (this=0x61addbd34bc0, eh=0x0) at /var/lib/jenkins/workspace/ACE_TAO_Ubuntu_22_04_Clang22_x64_Debug/ACE/ace/Reactor.cpp:192
#6 0x00007a8289ce4722 in OpenDDS::DCPS::ReactorTask::svc (this=0x61addbd1d510) at DCPS/ReactorTask.cpp:234
#7 0x00007a8288419671 in ACE_Task_Base::svc_run (args=0x61addbd1d718) at /var/lib/jenkins/workspace/ACE_TAO_Ubuntu_22_04_Clang22_x64_Debug/ACE/ace/Task.cpp:269
#8 0x00007a8288419e0c in ACE_Thread_Adapter::invoke_i (this=0x61addbd32790) at /var/lib/jenkins/workspace/ACE_TAO_Ubuntu_22_04_Clang22_x64_Debug/ACE/ace/Thread_Adapter.cpp:143
#9 0x00007a8288419d04 in ACE_Thread_Adapter::invoke (this=0x61addbd32790) at /var/lib/jenkins/workspace/ACE_TAO_Ubuntu_22_04_Clang22_x64_Debug/ACE/ace/Thread_Adapter.cpp:94
#10 0x00007a828835d67e in ace_thread_adapter (args=0x61addbd32790) at /var/lib/jenkins/workspace/ACE_TAO_Ubuntu_22_04_Clang22_x64_Debug/ACE/ace/Base_Thread_Adapter.cpp:116
#11 0x00007a8287e94a83 in start_thread (arg=<optimized out>) at ./nptl/pthread_create.c:442
#12 0x00007a8287f268e0 in clone3 () at ../sysdeps/unix/sysv/linux/x86_64/clone3.S:81
Thread 2 (Thread 0x7a8287dff640 (LWP 177073) "publisher"):
#0 __futex_abstimed_wait_common64 (private=0, cancel=true, abstime=0x0, op=393, expected=0, futex_word=0x61addbd2f380) at ./nptl/futex-internal.c:57
#1 __futex_abstimed_wait_common (cancel=true, private=0, abstime=0x0, clockid=0, expected=0, futex_word=0x61addbd2f380) at ./nptl/futex-internal.c:87
#2 __GI___futex_abstimed_wait_cancelable64 (futex_word=futex_word@entry=0x61addbd2f380, expected=expected@entry=0, clockid=clockid@entry=0, abstime=abstime@entry=0x0, private=private@entry=0) at ./nptl/futex-internal.c:139
#3 0x00007a8287e93a01 in __pthread_cond_wait_common (abstime=0x0, clockid=0, mutex=0x61addbd2f328, cond=0x61addbd2f358) at ./nptl/pthread_cond_wait.c:503
#4 ___pthread_cond_wait (cond=0x61addbd2f358, mutex=0x61addbd2f328) at ./nptl/pthread_cond_wait.c:627
#5 0x00007a828836eedd in ACE_OS::cond_wait (cv=0x61addbd2f358, external_mutex=0x61addbd2f328) at ../ace/OS_NS_Thread.inl:370
#6 0x00007a828836f329 in ACE_Condition<ACE_Thread_Mutex>::wait (this=0x61addbd2f358) at /var/lib/jenkins/workspace/ACE_TAO_Ubuntu_22_04_Clang22_x64_Debug/ACE/ace/Condition_Thread_Mutex.cpp:84
#7 0x00007a828b0f924e in OpenDDS::DCPS::ConditionVariable<ACE_Thread_Mutex>::wait (this=0x61addbd2f358, thread_status_manager=...) at /var/lib/jenkins/workspace/OpenDDS_ACE8_Ubuntu_22_04_Clang22_x64_Debug/dds/DCPS/ConditionVariable.h:56
#8 0x00007a8289c1a55b in OpenDDS::DCPS::DispatchService::run_event_loop (this=0x61addbd2f310) at DCPS/DispatchService.cpp:201
#9 0x00007a8289c194cd in OpenDDS::DCPS::DispatchService::run (arg=0x61addbd2f310) at DCPS/DispatchService.cpp:161
#10 0x00007a8289d71188 in OpenDDS::DCPS::ThreadPool::run (arg=0x61addbd2f410) at DCPS/ThreadPool.cpp:64
#11 0x00007a82883c9815 in ACE_OS_Thread_Adapter::invoke (this=0x61addbd20ce0) at /var/lib/jenkins/workspace/ACE_TAO_Ubuntu_22_04_Clang22_x64_Debug/ACE/ace/OS_Thread_Adapter.cpp:90
#12 0x00007a828835d67e in ace_thread_adapter (args=0x61addbd20ce0) at /var/lib/jenkins/workspace/ACE_TAO_Ubuntu_22_04_Clang22_x64_Debug/ACE/ace/Base_Thread_Adapter.cpp:116
#13 0x00007a8287e94a83 in start_thread (arg=<optimized out>) at ./nptl/pthread_create.c:442
#14 0x00007a8287f268e0 in clone3 () at ../sysdeps/unix/sysv/linux/x86_64/clone3.S:81
Thread 1 (Thread 0x7a828b696740 (LWP 177071) "publisher"):
#0 0x00007a8287ee57b8 in __GI___clock_nanosleep (clock_id=clock_id@entry=0, flags=flags@entry=0, req=0x7ffe27a70db8, rem=0x0) at ../sysdeps/unix/sysv/linux/clock_nanosleep.c:78
#1 0x00007a8287eea637 in __GI___nanosleep (req=<optimized out>, rem=<optimized out>) at ../sysdeps/unix/sysv/linux/nanosleep.c:25
#2 0x000061ada7fa7617 in ACE_OS::sleep (seconds=1) at /var/lib/jenkins/workspace/ACE_TAO_Ubuntu_22_04_Clang22_x64_Debug/ACE/ace/OS_NS_unistd.inl:924
#3 0x000061ada7fa6bb6 in FileBasedDistributedConditionSet::wait_for (this=0x61addbd214d0, waiting_actor=..., posting_actor=..., condition=...) at /var/lib/jenkins/workspace/OpenDDS_ACE8_Ubuntu_22_04_Clang22_x64_Debug/tests/Utils/DistributedConditionSet.h:152
#4 0x000061ada7fa44f4 in main (argc=1, argv=0x7ffe27a71478) at /var/lib/jenkins/workspace/OpenDDS_ACE8_Ubuntu_22_04_Clang22_x64_Debug/tests/DCPS/ZeroEnum/publisher.cpp:57
[Inferior 1 (process 177071) detached]
======= End stuck stacks =======
[Details] 2026-09-23 23:23:48: ERROR: publisher timedout
[Details] ERROR: TEST could get dynamic type member for my_enum
[Details] test FAILED (success).
[Details] auto_run_tests.pl: ERROR: "tests/DCPS/ZeroEnum/run_test.pl" returned with status 4
tests/security/CheckInstance/run_test.pl
[Details] 2026-09-23 23:32:16: ERROR: CheckInstance finished and returned 1
[Details] 2026-09-23 23:32:16.060@LM_ERROR@ERROR: check_local_datawriter_register_instance did not allow an instance to be registered when expected
[Details] test FAILED (success).
[Details] ERROR: test returned 4
[Details] auto_run_tests.pl: ERROR: "tests/security/CheckInstance/run_test.pl" returned with status 1